tuscany-commits mailing list archives

Site index · List index
Message view « Date » · « Thread »
Top « Date » · « Thread »
From Apache Hudson Server <hud...@hudson.zones.apache.org>
Subject Build failed in Hudson: Tuscany-SCA-J-CAA #81
Date Fri, 01 Jan 2010 00:13:15 GMT
See <http://hudson.zones.apache.org/hudson/job/Tuscany-SCA-J-CAA/81/>

------------------------------------------
[...truncated 4114 lines...]
AU        sca-assembly/Test_Client/src/main/java/client/ASM_12010_TestCase.java
AU        sca-assembly/Test_Client/src/main/java/client/ASM_13001_TestCase.java
AU        sca-assembly/Test_Client/src/main/java/client/ASM_13005_TestCase.java
AU        sca-assembly/Test_Client/src/main/java/client/ASM_6010_TestCase.java
AU        sca-assembly/Test_Client/src/main/java/client/ASM_7001_TestCase.java
AU        sca-assembly/Test_Client/src/main/java/client/ASM_5004_TestCase.java
AU        sca-assembly/Test_Client/src/main/java/client/ASM_5023_TestCase.java
AU        sca-assembly/Test_Client/src/main/java/client/ASM_8011_TestCase.java
AU        sca-assembly/Test_Client/src/main/java/client/ASM_9002_TestCase.java
AU        sca-assembly/Test_Client/src/main/java/client/ASM_6014_TestCase.java
AU        sca-assembly/Test_Client/src/main/java/client/ASM_6033_TestCase.java
AU        sca-assembly/Test_Client/src/main/java/client/ASM_7005_TestCase.java
AU        sca-assembly/Test_Client/src/main/java/client/ASM_5008_TestCase.java
AU        sca-assembly/Test_Client/src/main/java/client/ASM_5027_TestCase.java
AU        sca-assembly/Test_Client/src/main/java/client/ASM_8015_TestCase.java
AU        sca-assembly/Test_Client/src/main/java/client/ASM_6018_TestCase.java
AU        sca-assembly/Test_Client/src/main/java/client/ASM_7009_TestCase.java
AU        sca-assembly/Test_Client/src/main/java/client/ASM_8019_TestCase.java
AU        sca-assembly/Test_Client/src/main/java/client/ASM_10003_TestCase.java
AU        sca-assembly/Test_Client/src/main/java/client/ASM_12008_TestCase.java
AU        sca-assembly/Test_Client/src/main/java/client/TestConfiguration.java
AU        sca-assembly/Test_Client/src/main/java/client/TuscanyRuntimeBridge.java
AU        sca-assembly/Test_Client/src/main/java/client/ASM_4003_TestCase.java
AU        sca-assembly/Test_Client/src/main/java/client/ASM_7010_TestCase.java
AU        sca-assembly/Test_Client/src/main/java/client/ASM_8001_TestCase.java
AU        sca-assembly/Test_Client/src/main/java/client/ASM_5013_TestCase.java
AU        sca-assembly/Test_Client/src/main/java/client/ASM_6004_TestCase.java
AU        sca-assembly/Test_Client/src/main/java/client/ASM_5032_TestCase.java
AU        sca-assembly/Test_Client/src/main/java/client/ASM_6023_TestCase.java
AU        sca-assembly/Test_Client/src/main/java/client/ASM_4007_TestCase.java
AU        sca-assembly/Test_Client/src/main/java/client/ASM_8005_TestCase.java
AU        sca-assembly/Test_Client/src/main/java/client/ASM_5017_TestCase.java
AU        sca-assembly/Test_Client/src/main/java/client/ASM_6008_TestCase.java
AU        sca-assembly/Test_Client/src/main/java/client/ASM_5036_TestCase.java
AU        sca-assembly/Test_Client/src/main/java/client/ASM_6027_TestCase.java
AU        sca-assembly/Test_Client/src/main/java/client/ASM_8009_TestCase.java
AU        sca-assembly/Test_Client/src/main/java/client/ASM_12013_TestCase.java
AU        sca-assembly/Test_Client/src/main/java/client/ASM_13004_TestCase.java
AU        sca-assembly/Test_Client/src/main/java/client/ASM_13008_TestCase.java
AU        sca-assembly/Test_Client/src/main/java/client/ASM_5003_TestCase.java
AU        sca-assembly/Test_Client/src/main/java/client/ASM_8010_TestCase.java
AU        sca-assembly/Test_Client/src/main/java/client/ASM_5022_TestCase.java
AU        sca-assembly/Test_Client/src/main/java/client/ASM_6013_TestCase.java
AU        sca-assembly/Test_Client/src/main/java/client/ASM_9001_TestCase.java
AU        sca-assembly/Test_Client/src/main/java/client/ASM_7004_TestCase.java
AU        sca-assembly/Test_Client/src/main/java/client/ASM_6032_TestCase.java
AU        sca-assembly/Test_Client/src/main/java/client/ASM_5007_TestCase.java
AU        sca-assembly/Test_Client/src/main/java/client/ASM_5026_TestCase.java
AU        sca-assembly/Test_Client/src/main/java/client/ASM_8014_TestCase.java
AU        sca-assembly/Test_Client/src/main/java/client/ASM_6017_TestCase.java
AU        sca-assembly/Test_Client/src/main/java/client/ASM_7008_TestCase.java
AU        sca-assembly/Test_Client/src/main/java/client/ASM_8018_TestCase.java
AU        sca-assembly/Test_Client/src/main/java/client/ASM_10002_TestCase.java
AU        sca-assembly/Test_Client/src/main/java/client/ASM_12003_TestCase.java
AU        sca-assembly/Test_Client/src/main/java/client/ASM_12007_TestCase.java
AU        sca-assembly/Test_Client/src/main/java/client/ASM_4002_TestCase.java
AU        sca-assembly/Test_Client/src/main/java/client/ASM_5012_TestCase.java
AU        sca-assembly/Test_Client/src/main/java/client/ASM_5031_TestCase.java
AU        sca-assembly/Test_Client/src/main/java/client/ASM_6003_TestCase.java
AU        sca-assembly/Test_Client/src/main/java/client/ASM_4006_TestCase.java
AU        sca-assembly/Test_Client/src/main/java/client/ASM_6022_TestCase.java
AU        sca-assembly/Test_Client/src/main/java/client/ASM_5016_TestCase.java
AU        sca-assembly/Test_Client/src/main/java/client/ASM_5035_TestCase.java
AU        sca-assembly/Test_Client/src/main/java/client/ASM_6007_TestCase.java
AU        sca-assembly/Test_Client/src/main/java/client/ASM_6026_TestCase.java
AU        sca-assembly/Test_Client/src/main/java/client/ASM_8008_TestCase.java
AU        sca-assembly/Test_Client/src/main/java/client/ASM_12012_TestCase.java
AU        sca-assembly/Test_Client/src/main/java/client/ASM_13003_TestCase.java
AU        sca-assembly/Test_Client/src/main/java/client/ASM_13007_TestCase.java
AU        sca-assembly/Test_Client/src/main/java/client/BaseJAXWSTestRunner.java
AU        sca-assembly/Test_Client/src/main/java/client/ASM_5002_TestCase.java
AU        sca-assembly/Test_Client/src/main/java/client/ASM_5021_TestCase.java
AU        sca-assembly/Test_Client/src/main/java/client/ASM_6012_TestCase.java
AU        sca-assembly/Test_Client/src/main/java/client/ASM_6031_TestCase.java
AU        sca-assembly/Test_Client/src/main/java/client/ASM_7003_TestCase.java
AU        sca-assembly/Test_Client/src/main/java/client/ASM_5006_TestCase.java
AU        sca-assembly/Test_Client/src/main/java/client/ASM_5025_TestCase.java
AU        sca-assembly/Test_Client/src/main/java/client/ASM_8013_TestCase.java
AU        sca-assembly/Test_Client/src/main/java/client/ASM_9004_TestCase.java
AU        sca-assembly/Test_Client/src/main/java/client/ASM_6016_TestCase.java
AU        sca-assembly/Test_Client/src/main/java/client/ASM_7007_TestCase.java
AU        sca-assembly/Test_Client/src/main/java/client/ASM_5029_TestCase.java
AU        sca-assembly/Test_Client/src/main/java/client/ASM_8017_TestCase.java
AU        sca-assembly/Test_Client/src/main/java/client/AllTests.java
AU        sca-assembly/Test_Client/src/main/java/client/ASM_10001_TestCase.java
AU        sca-assembly/Test_Client/src/main/java/client/ASM_12002_TestCase.java
AU        sca-assembly/Test_Client/src/main/java/client/ASM_12006_TestCase.java
AU        sca-assembly/Test_Client/src/main/java/client/ASM_4001_TestCase.java
AU        sca-assembly/Test_Client/src/main/java/client/ASM_5011_TestCase.java
AU        sca-assembly/Test_Client/src/main/java/client/ASM_5030_TestCase.java
AU        sca-assembly/Test_Client/src/main/java/client/ASM_6002_TestCase.java
AU        sca-assembly/Test_Client/src/main/java/client/ASM_4005_TestCase.java
AU        sca-assembly/Test_Client/src/main/java/client/ASM_6021_TestCase.java
AU        sca-assembly/Test_Client/src/main/java/client/ASM_5015_TestCase.java
AU        sca-assembly/Test_Client/src/main/java/client/ASM_8003_TestCase.java
AU        sca-assembly/Test_Client/src/main/java/client/ASM_5034_TestCase.java
AU        sca-assembly/Test_Client/src/main/java/client/ASM_6006_TestCase.java
AU        sca-assembly/Test_Client/src/main/java/client/ASM_6025_TestCase.java
AU        sca-assembly/Test_Client/src/main/java/client/ASM_5019_TestCase.java
AU        sca-assembly/Test_Client/src/main/java/client/ASM_8007_TestCase.java
AU        sca-assembly/Test_Client/src/main/java/client/ASM_6029_TestCase.java
AU        sca-assembly/Test_Client/src/main/java/client/ASM_12011_TestCase.java
AU        sca-assembly/Test_Client/src/main/java/client/RuntimeBridge.java
AU        sca-assembly/Test_Client/src/main/java/client/ASM_13002_TestCase.java
AU        sca-assembly/Test_Client/src/main/java/client/ASM_13006_TestCase.java
AU        sca-assembly/Test_Client/src/main/java/client/ASM_5020_TestCase.java
AU        sca-assembly/Test_Client/src/main/java/client/ASM_6011_TestCase.java
AU        sca-assembly/Test_Client/src/main/java/client/ASM_6030_TestCase.java
AU        sca-assembly/Test_Client/src/main/java/client/ASM_7002_TestCase.java
AU        sca-assembly/Test_Client/src/main/java/client/ASM_5005_TestCase.java
AU        sca-assembly/Test_Client/src/main/java/client/ASM_8012_TestCase.java
AU        sca-assembly/Test_Client/src/main/java/client/ASM_5024_TestCase.java
AU        sca-assembly/Test_Client/src/main/java/client/ASM_6015_TestCase.java
AU        sca-assembly/Test_Client/src/main/java/client/ASM_9003_TestCase.java
AU        sca-assembly/Test_Client/src/main/java/client/ASM_7006_TestCase.java
AU        sca-assembly/Test_Client/src/main/java/client/ASM_5009_TestCase.java
AU        sca-assembly/Test_Client/src/main/java/client/ASM_8016_TestCase.java
AU        sca-assembly/Test_Client/src/main/java/client/ASM_5028_TestCase.java
AU        sca-assembly/Test_Client/src/main/java/client/ASM_6019_TestCase.java
AU        sca-assembly/Test_Client/src/main/java/client/ASM_12001_TestCase.java
A         sca-assembly/Test_Client/src/main/java/testClient
AU        sca-assembly/Test_Client/src/main/java/testClient/package-info.java
AU        sca-assembly/Test_Client/src/main/java/testClient/TestInvocation.java
AU        sca-assembly/Test_Client/src/main/java/testClient/InvokeTestResponse.java
AU        sca-assembly/Test_Client/src/main/java/testClient/TestInvocationService.java
AU        sca-assembly/Test_Client/src/main/java/testClient/InvokeTest.java
AU        sca-assembly/Test_Client/src/main/java/testClient/README.txt
AU        sca-assembly/Test_Client/src/main/java/testClient/TestException_Exception.java
AU        sca-assembly/Test_Client/src/main/java/testClient/ObjectFactory.java
AU        sca-assembly/Test_Client/src/main/java/testClient/TestException.java
A         sca-assembly/Test_Client/src/main/resources
A         sca-assembly/Test_Client/src/main/resources/META-INF
A         sca-assembly/Test_Client/src/main/resources/META-INF/MANIFEST.MF
AU        sca-assembly/Test_Client/src/main/resources/TestInvocation.wsdl
AU        sca-assembly/Test_Client/src/main/resources/TestClient.wsdl
AU        sca-assembly/Test_Client/src/main/resources/commons-logging.properties
AU        sca-assembly/Test_Client/src/main/resources/log4j.properties
AU        sca-assembly/Test_Client/src/main/resources/openjpa.xml
AU        sca-assembly/Test_Client/src/main/resources/tuscany-oasis-sca-tests-errors.properties
AU        sca-assembly/Test_Client/src/main/resources/oasis-sca-tests.properties
AU        sca-assembly/Test_Client/pom.xml
 U        sca-assembly/Test_Client
At revision 426
At revision 894958
no change for https://svn.apache.org/repos/asf/tuscany/sandbox/scajcaa since the previous
build
no change for https://svn.apache.org/repos/asf/tuscany/sca-java-2.x/trunk/modules/assembly
since the previous build
no change for https://svn.apache.org/repos/asf/tuscany/sca-java-2.x/trunk/modules/assembly-xml
since the previous build
no change for https://svn.apache.org/repos/asf/tuscany/sca-java-2.x/trunk/modules/assembly-xsd
since the previous build
no change for https://svn.apache.org/repos/asf/tuscany/sca-java-2.x/trunk/modules/binding-sca-runtime
since the previous build
no change for https://svn.apache.org/repos/asf/tuscany/sca-java-2.x/trunk/modules/binding-sca-runtime-rmi
since the previous build
no change for https://svn.apache.org/repos/asf/tuscany/sca-java-2.x/trunk/modules/binding-ws
since the previous build
no change for https://svn.apache.org/repos/asf/tuscany/sca-java-2.x/trunk/modules/binding-ws-axis2-policy
since the previous build
no change for https://svn.apache.org/repos/asf/tuscany/sca-java-2.x/trunk/modules/binding-ws-wsdlgen
since the previous build
no change for https://svn.apache.org/repos/asf/tuscany/sca-java-2.x/trunk/modules/builder
since the previous build
no change for https://svn.apache.org/repos/asf/tuscany/sca-java-2.x/trunk/modules/common-java
since the previous build
no change for https://svn.apache.org/repos/asf/tuscany/sca-java-2.x/trunk/modules/common-xml
since the previous build
no change for https://svn.apache.org/repos/asf/tuscany/sca-java-2.x/trunk/modules/contribution
since the previous build
no change for https://svn.apache.org/repos/asf/tuscany/sca-java-2.x/trunk/modules/core since
the previous build
no change for https://svn.apache.org/repos/asf/tuscany/sca-java-2.x/trunk/modules/core-databinding
since the previous build
no change for https://svn.apache.org/repos/asf/tuscany/sca-java-2.x/trunk/modules/core-spi
since the previous build
no change for https://svn.apache.org/repos/asf/tuscany/sca-java-2.x/trunk/modules/databinding
since the previous build
no change for https://svn.apache.org/repos/asf/tuscany/sca-java-2.x/trunk/modules/databinding-axiom
since the previous build
no change for https://svn.apache.org/repos/asf/tuscany/sca-java-2.x/trunk/modules/databinding-jaxb
since the previous build
no change for https://svn.apache.org/repos/asf/tuscany/sca-java-2.x/trunk/modules/deployment
since the previous build
no change for https://svn.apache.org/repos/asf/tuscany/sca-java-2.x/trunk/modules/domain-node
since the previous build
no change for https://svn.apache.org/repos/asf/tuscany/sca-java-2.x/trunk/modules/endpoint-tribes
since the previous build
no change for https://svn.apache.org/repos/asf/tuscany/sca-java-2.x/trunk/modules/extensibility
since the previous build
no change for https://svn.apache.org/repos/asf/tuscany/sca-java-2.x/trunk/modules/host-http
since the previous build
no change for https://svn.apache.org/repos/asf/tuscany/sca-java-2.x/trunk/modules/host-jetty
since the previous build
no change for https://svn.apache.org/repos/asf/tuscany/sca-java-2.x/trunk/modules/implementation-java
since the previous build
no change for https://svn.apache.org/repos/asf/tuscany/sca-java-2.x/trunk/modules/implementation-java-runtime
since the previous build
no change for https://svn.apache.org/repos/asf/tuscany/sca-java-2.x/trunk/modules/implementation-web
since the previous build
no change for https://svn.apache.org/repos/asf/tuscany/sca-java-2.x/trunk/modules/implementation-web-runtime
since the previous build
no change for https://svn.apache.org/repos/asf/tuscany/sca-java-2.x/trunk/modules/interface-java
since the previous build
no change for https://svn.apache.org/repos/asf/tuscany/sca-java-2.x/trunk/modules/interface-java-jaxws
since the previous build
no change for https://svn.apache.org/repos/asf/tuscany/sca-java-2.x/trunk/modules/interface-wsdl
since the previous build
no change for https://svn.apache.org/repos/asf/tuscany/sca-java-2.x/trunk/modules/monitor
since the previous build
no change for https://svn.apache.org/repos/asf/tuscany/sca-java-2.x/trunk/modules/node-api
since the previous build
no change for https://svn.apache.org/repos/asf/tuscany/sca-java-2.x/trunk/modules/node-impl
since the previous build
no change for https://svn.apache.org/repos/asf/tuscany/sca-java-2.x/trunk/modules/policy-security
since the previous build
no change for https://svn.apache.org/repos/asf/tuscany/sca-java-2.x/trunk/modules/sca-api
since the previous build
no change for https://svn.apache.org/repos/asf/tuscany/sca-java-2.x/trunk/modules/sca-client-rmi
since the previous build
no change for https://svn.apache.org/repos/asf/tuscany/sca-java-2.x/trunk/modules/xsd since
the previous build
no change for https://svn.apache.org/repos/asf/tuscany/sca-java-2.x/trunk/modules/databinding-jaxb-axiom
since the previous build
no change for https://svn.apache.org/repos/asf/tuscany/sca-java-2.x/trunk/modules/policy-xml-ws
since the previous build
no change for https://svn.apache.org/repos/asf/tuscany/sca-java-2.x/trunk/modules/binding-ws-axis2
since the previous build
no change for https://svn.apache.org/repos/asf/tuscany/sca-java-2.x/trunk/modules/extensibility-equinox
since the previous build
no change for https://svn.apache.org/repos/asf/tuscany/sca-java-2.x/trunk/modules/node-launcher-equinox
since the previous build
no change for http://tools.oasis-open.org/version-control/svn/sca-j/TestCases since the previous
build
no change for https://svn.apache.org/repos/asf/tuscany/otest/newlayout/tuscany-java-caa-test-runner
since the previous build
no change for http://tools.oasis-open.org/version-control/svn/sca-assembly/TestCases/Test_Client
since the previous build
Parsing POMs
ERROR: Failed to parse POMs
hudson.util.IOException2: remote file operation failed
	at hudson.FilePath.act(FilePath.java:672)
	at hudson.FilePath.act(FilePath.java:660)
	at hudson.maven.MavenModuleSetBuild$RunnerImpl.parsePoms(MavenModuleSetBuild.java:531)
	at hudson.maven.MavenModuleSetBuild$RunnerImpl.doRun(MavenModuleSetBuild.java:391)
	at hudson.model.AbstractBuild$AbstractRunner.run(AbstractBuild.java:417)
	at hudson.model.Run.run(Run.java:1179)
	at hudson.maven.MavenModuleSetBuild.run(MavenModuleSetBuild.java:304)
	at hudson.model.ResourceController.execute(ResourceController.java:88)
	at hudson.model.Executor.run(Executor.java:122)
Caused by: hudson.remoting.ProxyException: hudson.maven.MavenModuleSetBuild$MavenExecutionException:
org.apache.maven.project.ProjectBuildingException: Cannot find parent: org.apache.tuscany.sca:tuscany-sca
for project: null:tuscany-scajcaa-test:pom:null for project null:tuscany-scajcaa-test:pom:null
	at hudson.maven.MavenModuleSetBuild$PomParser.invoke(MavenModuleSetBuild.java:881)
	at hudson.maven.MavenModuleSetBuild$PomParser.invoke(MavenModuleSetBuild.java:786)
	at hudson.FilePath$FileCallableWrapper.call(FilePath.java:2062)
	at hudson.remoting.UserRequest.perform(UserRequest.java:104)
	at hudson.remoting.UserRequest.perform(UserRequest.java:48)
	at hudson.remoting.Request$2.run(Request.java:236)
	at java.util.concurrent.Executors$RunnableAdapter.call(Executors.java:441)
	at java.util.concurrent.FutureTask$Sync.innerRun(FutureTask.java:303)
	at java.util.concurrent.FutureTask.run(FutureTask.java:138)
	at java.util.concurrent.ThreadPoolExecutor$Worker.runTask(ThreadPoolExecutor.java:886)
	at java.util.concurrent.ThreadPoolExecutor$Worker.run(ThreadPoolExecutor.java:908)
	at java.lang.Thread.run(Thread.java:619)
Caused by: hudson.remoting.ProxyException: org.apache.maven.project.ProjectBuildingException:
Cannot find parent: org.apache.tuscany.sca:tuscany-sca for project: null:tuscany-scajcaa-test:pom:null
for project null:tuscany-scajcaa-test:pom:null
	at org.apache.maven.project.DefaultMavenProjectBuilder.assembleLineage(DefaultMavenProjectBuilder.java:1370)
	at org.apache.maven.project.DefaultMavenProjectBuilder.buildInternal(DefaultMavenProjectBuilder.java:821)
	at org.apache.maven.project.DefaultMavenProjectBuilder.buildFromSourceFileInternal(DefaultMavenProjectBuilder.java:506)
	at org.apache.maven.project.DefaultMavenProjectBuilder.build(DefaultMavenProjectBuilder.java:215)
	at hudson.maven.MavenEmbedder.readProject(MavenEmbedder.java:334)
	at hudson.maven.MavenModuleSetBuild$PomParser.invoke(MavenModuleSetBuild.java:861)
	... 11 more
Caused by: hudson.remoting.ProxyException: org.apache.maven.project.ProjectBuildingException:
POM 'org.apache.tuscany.sca:tuscany-sca' not found in repository: Unable to download the artifact
from any repository

  org.apache.tuscany.sca:tuscany-sca:pom:2.0-SNAPSHOT

from the specified remote repositories:
  central (http://repo1.maven.org/maven2)
 for project org.apache.tuscany.sca:tuscany-sca
	at org.apache.maven.project.DefaultMavenProjectBuilder.findModelFromRepository(DefaultMavenProjectBuilder.java:603)
	at org.apache.maven.project.DefaultMavenProjectBuilder.assembleLineage(DefaultMavenProjectBuilder.java:1366)
	... 16 more
Caused by: hudson.remoting.ProxyException: org.apache.maven.artifact.resolver.ArtifactNotFoundException:
Unable to download the artifact from any repository

  org.apache.tuscany.sca:tuscany-sca:pom:2.0-SNAPSHOT

from the specified remote repositories:
  central (http://repo1.maven.org/maven2)

	at org.apache.maven.artifact.resolver.DefaultArtifactResolver.resolve(DefaultArtifactResolver.java:212)
	at org.apache.maven.artifact.resolver.DefaultArtifactResolver.resolve(DefaultArtifactResolver.java:74)
	at org.apache.maven.project.DefaultMavenProjectBuilder.findModelFromRepository(DefaultMavenProjectBuilder.java:556)
	... 17 more
Caused by: hudson.remoting.ProxyException: org.apache.maven.wagon.ResourceDoesNotExistException:
Unable to download the artifact from any repository
	at org.apache.maven.artifact.manager.DefaultWagonManager.getArtifact(DefaultWagonManager.java:331)
	at org.apache.maven.artifact.resolver.DefaultArtifactResolver.resolve(DefaultArtifactResolver.java:200)
	... 19 more


Mime
View raw message