tuscany-commits mailing list archives

Site index · List index
Message view « Date » · « Thread »
Top « Date » · « Thread »
From Apache Hudson Server <hud...@hudson.zones.apache.org>
Subject Build failed in Hudson: Tuscany-2x #601
Date Thu, 08 Apr 2010 07:50:04 GMT
See <http://hudson.zones.apache.org/hudson/job/Tuscany-2x/601/changes>

Changes:

[antelder] Replace non utf8 characters

[antelder] Try using a property to stop deploying the itest modules

[antelder] Add back in some distro itests

[antelder] Update LICENSE for new hazelcast release

[antelder] Update LICENSE for new hazelcast release

[antelder] Update to Hazelcast 1.8.3

[antelder] Update to Hazelcast 1.8.3

[antelder] Update to latest release of the eclipse compiler

------------------------------------------
[...truncated 1634 lines...]
Apr 8, 2010 7:48:57 AM org.apache.tuscany.sca.contribution.processor.ExtensibleStAXArtifactProcessor
[Definitions: <http://hudson.zones.apache.org/hudson/job/Tuscany-2x/ws/sca-2x/modules/assembly-xml/target/test-classes/org/apache/tuscany/sca/assembly/xml/test_definitions.xml]>
(ElementCannotBeProcessed)
SEVERE: Element {http://schemas.xmlsoap.org/ws/2004/09/policy}PolicyAttachment cannot be processed.
([row,col,system-id]: [69,17,"<http://hudson.zones.apache.org/hudson/job/Tuscany-2x/ws/sca-2x/modules/assembly-xml/target/test-classes/org/apache/tuscany/sca/assembly/xml/test_definitions.xml"])>
Apr 8, 2010 7:48:57 AM org.apache.tuscany.sca.contribution.processor.ExtensibleStAXArtifactProcessor
[Definitions: <http://hudson.zones.apache.org/hudson/job/Tuscany-2x/ws/sca-2x/modules/assembly-xml/target/test-classes/org/apache/tuscany/sca/assembly/xml/test_definitions.xml]>
(ElementCannotBeProcessed)
SEVERE: Element {http://schemas.xmlsoap.org/ws/2004/09/policy}PolicyAttachment cannot be processed.
([row,col,system-id]: [72,17,"<http://hudson.zones.apache.org/hudson/job/Tuscany-2x/ws/sca-2x/modules/assembly-xml/target/test-classes/org/apache/tuscany/sca/assembly/xml/test_definitions.xml"])>
Apr 8, 2010 7:48:57 AM org.apache.tuscany.sca.contribution.processor.ExtensibleStAXArtifactProcessor
[Definitions: <http://hudson.zones.apache.org/hudson/job/Tuscany-2x/ws/sca-2x/modules/assembly-xml/target/test-classes/org/apache/tuscany/sca/assembly/xml/test_definitions.xml]>
(ElementCannotBeProcessed)
SEVERE: Element {http://schemas.xmlsoap.org/ws/2004/09/policy}PolicyAttachment cannot be processed.
([row,col,system-id]: [75,17,"<http://hudson.zones.apache.org/hudson/job/Tuscany-2x/ws/sca-2x/modules/assembly-xml/target/test-classes/org/apache/tuscany/sca/assembly/xml/test_definitions.xml"])>
Apr 8, 2010 7:48:57 AM org.apache.tuscany.sca.contribution.processor.ExtensibleStAXArtifactProcessor
[Definitions: <http://hudson.zones.apache.org/hudson/job/Tuscany-2x/ws/sca-2x/modules/assembly-xml/target/test-classes/org/apache/tuscany/sca/assembly/xml/test_definitions.xml]>
(ElementCannotBeProcessed)
SEVERE: Element {http://schemas.xmlsoap.org/ws/2004/09/policy}PolicyAttachment cannot be processed.
([row,col,system-id]: [86,17,"<http://hudson.zones.apache.org/hudson/job/Tuscany-2x/ws/sca-2x/modules/assembly-xml/target/test-classes/org/apache/tuscany/sca/assembly/xml/test_definitions.xml"])>
Apr 8, 2010 7:48:57 AM org.apache.tuscany.sca.contribution.processor.ExtensibleStAXArtifactProcessor
[Definitions: <http://hudson.zones.apache.org/hudson/job/Tuscany-2x/ws/sca-2x/modules/assembly-xml/target/test-classes/org/apache/tuscany/sca/assembly/xml/test_definitions.xml]>
(ElementCannotBeProcessed)
SEVERE: Element {http://schemas.xmlsoap.org/ws/2004/09/policy}PolicyAttachment cannot be processed.
([row,col,system-id]: [89,17,"<http://hudson.zones.apache.org/hudson/job/Tuscany-2x/ws/sca-2x/modules/assembly-xml/target/test-classes/org/apache/tuscany/sca/assembly/xml/test_definitions.xml"])>
Apr 8, 2010 7:48:57 AM org.apache.tuscany.sca.contribution.processor.ExtensibleStAXArtifactProcessor
[Definitions: <http://hudson.zones.apache.org/hudson/job/Tuscany-2x/ws/sca-2x/modules/assembly-xml/target/test-classes/org/apache/tuscany/sca/assembly/xml/test_definitions.xml]>
(ElementCannotBeProcessed)
SEVERE: Element {http://schemas.xmlsoap.org/ws/2004/09/policy}PolicyAttachment cannot be processed.
([row,col,system-id]: [94,17,"<http://hudson.zones.apache.org/hudson/job/Tuscany-2x/ws/sca-2x/modules/assembly-xml/target/test-classes/org/apache/tuscany/sca/assembly/xml/test_definitions.xml"])>
Apr 8, 2010 7:48:57 AM org.apache.tuscany.sca.contribution.processor.ExtensibleStAXArtifactProcessor
[Definitions: <http://hudson.zones.apache.org/hudson/job/Tuscany-2x/ws/sca-2x/modules/assembly-xml/target/test-classes/org/apache/tuscany/sca/assembly/xml/test_definitions.xml]>
(ElementCannotBeProcessed)
SEVERE: Element {http://schemas.xmlsoap.org/ws/2004/09/policy}PolicyAttachment cannot be processed.
([row,col,system-id]: [109,9,"<http://hudson.zones.apache.org/hudson/job/Tuscany-2x/ws/sca-2x/modules/assembly-xml/target/test-classes/org/apache/tuscany/sca/assembly/xml/test_definitions.xml"])>
Apr 8, 2010 7:48:57 AM org.apache.tuscany.sca.contribution.processor.ExtensibleStAXArtifactProcessor
[Definitions: <http://hudson.zones.apache.org/hudson/job/Tuscany-2x/ws/sca-2x/modules/assembly-xml/target/test-classes/org/apache/tuscany/sca/assembly/xml/test_definitions.xml]>
(ElementCannotBeProcessed)
SEVERE: Element {http://schemas.xmlsoap.org/ws/2004/09/policy}PolicyAttachment cannot be processed.
([row,col,system-id]: [119,17,"<http://hudson.zones.apache.org/hudson/job/Tuscany-2x/ws/sca-2x/modules/assembly-xml/target/test-classes/org/apache/tuscany/sca/assembly/xml/test_definitions.xml"])>
Apr 8, 2010 7:48:57 AM org.apache.tuscany.sca.contribution.processor.ExtensibleStAXArtifactProcessor
[Definitions: <http://hudson.zones.apache.org/hudson/job/Tuscany-2x/ws/sca-2x/modules/assembly-xml/target/test-classes/org/apache/tuscany/sca/assembly/xml/test_definitions.xml]>
(ElementCannotBeProcessed)
SEVERE: Element {http://schemas.xmlsoap.org/ws/2004/09/policy}PolicyAttachment cannot be processed.
([row,col,system-id]: [123,17,"<http://hudson.zones.apache.org/hudson/job/Tuscany-2x/ws/sca-2x/modules/assembly-xml/target/test-classes/org/apache/tuscany/sca/assembly/xml/test_definitions.xml"])>
Apr 8, 2010 7:48:57 AM org.apache.tuscany.sca.contribution.processor.ExtensibleStAXArtifactProcessor
[Definitions: <http://hudson.zones.apache.org/hudson/job/Tuscany-2x/ws/sca-2x/modules/assembly-xml/target/test-classes/org/apache/tuscany/sca/assembly/xml/test_definitions.xml]>
(ElementCannotBeProcessed)
SEVERE: Element {http://schemas.xmlsoap.org/ws/2004/09/policy}PolicyAttachment cannot be processed.
([row,col,system-id]: [126,17,"<http://hudson.zones.apache.org/hudson/job/Tuscany-2x/ws/sca-2x/modules/assembly-xml/target/test-classes/org/apache/tuscany/sca/assembly/xml/test_definitions.xml"])>
Apr 8, 2010 7:48:57 AM org.apache.tuscany.sca.contribution.processor.ExtensibleStAXArtifactProcessor
[Definitions: <http://hudson.zones.apache.org/hudson/job/Tuscany-2x/ws/sca-2x/modules/assembly-xml/target/test-classes/org/apache/tuscany/sca/assembly/xml/test_definitions.xml]>
(ElementCannotBeProcessed)
SEVERE: Element {http://schemas.xmlsoap.org/ws/2004/09/policy}Policy cannot be processed.
([row,col,system-id]: [138,9,"<http://hudson.zones.apache.org/hudson/job/Tuscany-2x/ws/sca-2x/modules/assembly-xml/target/test-classes/org/apache/tuscany/sca/assembly/xml/test_definitions.xml"])>
Apr 8, 2010 7:48:57 AM org.apache.tuscany.sca.definitions.xml.DefinitionsProcessor [] (BindingTypeNotFound)
SEVERE: An extension to support the binding type {http://docs.oasis-open.org/ns/opencsa/sca/200912}binding.ws
cant be found in the domain  
Apr 8, 2010 7:48:57 AM org.apache.tuscany.sca.definitions.xml.DefinitionsProcessor [] (ImplementationTypeNotFound)
SEVERE: [POL50001] An extension to support the implementation type {http://docs.oasis-open.org/ns/opencsa/sca/200912}implementation.java
cant be found in the domain
Apr 8, 2010 7:48:57 AM org.apache.tuscany.sca.assembly.xml.CompositeProcessor [Composite:
{http://calc}TestAllCalculator] (ContributionResolveException)
SEVERE: ContributionResolveException occured due to : {0}
org.apache.tuscany.sca.contribution.processor.ContributionResolveException: [ASM60042] Error:
Composite {http://calc}TestAllDivide is not a valid composite within th[HUDSON] Recording
test resultse domain
	at org.apache.tuscany.sca.assembly.xml.CompositeProcessor.resolve(CompositeProcessor.java:983)
Tests run: 3, Failures: 0, Errors: 0, Skipped: 0, Time elapsed: 0.154 sec
	at org.apache.tuscany.sca.assembly.xml.CompositeProcessor.resolve(CompositeProcessor.java:1)
Running org.apache.tuscany.sca.assembly.xml.ReadTestCase
	at org.apache.tuscany.sca.contribution.processor.DefaultStAXArtifactProcessorExtensionPoint$LazyStAXArtifactProcessor.resolve(DefaultStAXArtifactProcessorExtensionPoint.java:321)
Tests run: 3, Failures: 0, Errors: 0, Skipped: 0, Time elapsed: 0.018 sec
Running org.apache.tuscany.sca.definitions.xml.ReadDocumentTestCase
	at org.apache.tuscany.sca.contribution.processor.ExtensibleStAXArtifactProcessor.resolve(ExtensibleStAXArtifactProcessor.java:199)
	at org.apache.tuscany.sca.assembly.xml.WriteAllTestCase.testReadWireWriteComposite(WriteAllTestCase.java:111)
	at sun.reflect.NativeMethodAccessorImpl.invoke0(Native Method)
	at sun.reflect.NativeMethodAccessorImpl.invoke(NativeMethodAccessorImpl.java:39)
	at sun.reflect.DelegatingMethodAccessorImpl.invoke(DelegatingMethodAccessorImpl.java:25)
	at java.lang.reflect.Method.invoke(Method.java:597)
Tests run: 2, Failures: 0, Errors: 0, Skipped: 0, Time elapsed: 0.093 sec
	at org.junit.runners.model.FrameworkMethod$1.runReflectiveCall(FrameworkMethod.java:44)
	at org.junit.internal.runners.model.ReflectiveCallable.run(ReflectiveCallable.java:15)
Running org.apache.tuscany.sca.assembly.xml.ReadAllTestCase
	at org.junit.runners.model.FrameworkMethod.invokeExplosively(FrameworkMethod.java:41)
	at org.junit.internal.runners.statements.InvokeMethod.evaluate(InvokeMethod.java:20)
Tests run: 1, Failures: 0, Errors: 0, Skipped: 0, Time elapsed: 0.021 sec
	at org.junit.runners.BlockJUnit4ClassRunner.runChild(BlockJUnit4ClassRunner.java:76)
	at org.junit.runners.BlockJUnit4ClassRunner.runChild(BlockJUnit4ClassRunner.java:50)
Running org.apache.tuscany.sca.assembly.xml.MultiplicityReadWriteTestCase
	at org.junit.runners.ParentRunner$3.run(ParentRunner.java:193)
	at org.junit.runners.ParentRunner$1.schedule(ParentRunner.java:52)
Tests run: 1, Failures: 0, Errors: 0, Skipped: 0, Time elapsed: 0.011 sec

Results :

	at org.junit.runners.ParentRunner.runChildren(ParentRunner.java:191)
Tests run: 35, Failures: 0, Errors: 0, Skipped: 0
	at org.junit.runners.ParentRunner.access$000(ParentRunner.java:42)

	at org.junit.runners.ParentRunner$2.evaluate(ParentRunner.java:184)
	at org.junit.internal.runners.statements.RunBefores.evaluate(RunBefores.java:28)
	at org.junit.runners.ParentRunner.run(ParentRunner.java:236)
	at org.apache.maven.surefire.junit4.JUnit4TestSet.execute(JUnit4TestSet.java:62)
	at org.apache.maven.surefire.suite.AbstractDirectoryTestSuite.executeTestSet(AbstractDirectoryTestSuite.java:140)
	at org.apache.maven.surefire.suite.AbstractDirectoryTestSuite.execute(AbstractDirectoryTestSuite.java:127)
	at org.apache.maven.surefire.Surefire.run(Surefire.java:177)
	at sun.reflect.NativeMethodAccessorImpl.invoke0(Native Method)
	at sun.reflect.NativeMethodAccessorImpl.invoke(NativeMethodAccessorImpl.java:39)
	at sun.reflect.DelegatingMethodAccessorImpl.invoke(DelegatingMethodAccessorImpl.java:25)
	at java.lang.reflect.Method.invoke(Method.java:597)
	at org.apache.maven.surefire.booter.SurefireBooter.runSuitesInProcess(SurefireBooter.java:345)
	at org.apache.maven.surefire.booter.SurefireBooter.main(SurefireBooter.java:1009)
Apr 8, 2010 7:48:57 AM org.apache.tuscany.sca.contribution.processor.ExtensibleStAXArtifactProcessor
[] (ElementCannotBeProcessed)
SEVERE: Element {http://docs.oasis-open.org/ns/opencsa/sca/200912}interface.java cannot be
processed. ([row,col {unknown-source}]: [23,9])
Apr 8, 2010 7:48:57 AM org.apache.tuscany.sca.contribution.processor.ExtensibleStAXArtifactProcessor
[] (ElementCannotBeProcessed)
SEVERE: Element {http://docs.oasis-open.org/ns/opencsa/sca/200912}interface.java cannot be
processed. ([row,col {unknown-source}]: [27,9])
Apr 8, 2010 7:48:57 AM org.apache.tuscany.sca.contribution.processor.ExtensibleStAXArtifactProcessor
[] (ElementCannotBeProcessed)
SEVERE: Element {http://docs.oasis-open.org/ns/opencsa/sca/200912}interface.java cannot be
processed. ([row,col {unknown-source}]: [27,9])
Apr 8, 2010 7:48:57 AM org.apache.tuscany.sca.contribution.processor.ExtensibleStAXArtifactProcessor
[] (ElementCannotBeProcessed)
SEVERE: Element {http://docs.oasis-open.org/ns/opencsa/sca/200912}implementation.java cannot
be processed. ([row,col {unknown-source}]: [31,3])
Apr 8, 2010 7:48:57 AM org.apache.tuscany.sca.contribution.processor.ExtensibleStAXArtifactProcessor
[] (ElementCannotBeProcessed)
SEVERE: Element {http://docs.oasis-open.org/ns/opencsa/sca/200912}implementation.java cannot
be processed. ([row,col {unknown-source}]: [39,9])
Apr 8, 2010 7:48:57 AM org.apache.tuscany.sca.contribution.processor.ExtensibleStAXArtifactProcessor
[] (ElementCannotBeProcessed)
SEVERE: Element {http://docs.oasis-open.org/ns/opencsa/sca/200912}implementation.java cannot
be processed. ([row,col {unknown-source}]: [43,9])
Apr 8, 2010 7:48:57 AM org.apache.tuscany.sca.contribution.processor.ExtensibleStAXArtifactProcessor
[] (ElementCannotBeProcessed)
SEVERE: Element {http://docs.oasis-open.org/ns/opencsa/sca/200912}implementation.java cannot
be processed. ([row,col {unknown-source}]: [47,9])
Apr 8, 2010 7:48:57 AM org.apache.tuscany.sca.contribution.processor.ExtensibleStAXArtifactProcessor
[] (ElementCannotBeProcessed)
SEVERE: Element {http://docs.oasis-open.org/ns/opencsa/sca/200912}implementation.java cannot
be processed. ([row,col {unknown-source}]: [51,9])
Apr 8, 2010 7:48:57 AM org.apache.tuscany.sca.contribution.processor.ExtensibleStAXArtifactProcessor
[] (ElementCannotBeProcessed)
SEVERE: Element {http://x}unknownElement cannot be processed. ([row,col {unknown-source}]:
[54,5])
Apr 8, 2010 7:48:57 AM org.apache.tuscany.sca.contribution.processor.ExtensibleStAXArtifactProcessor
[] (ElementCannotBeProcessed)
SEVERE: Element {http://docs.oasis-open.org/ns/opencsa/sca/200912}interface.java cannot be
processed. ([row,col {unknown-source}]: [23,9])
Apr 8, 2010 7:48:57 AM org.apache.tuscany.sca.contribution.processor.ExtensibleStAXArtifactProcessor
[] (ElementCannotBeProcessed)
SEVERE: Element {http://docs.oasis-open.org/ns/opencsa/sca/200912}interface.java cannot be
processed. ([row,col {unknown-source}]: [27,9])
Apr 8, 2010 7:48:57 AM org.apache.tuscany.sca.contribution.processor.ExtensibleStAXArtifactProcessor
[] (ElementCannotBeProcessed)
SEVERE: Element {http://docs.oasis-open.org/ns/opencsa/sca/200912}interface.java cannot be
processed. ([row,col {unknown-source}]: [27,9])
Apr 8, 2010 7:48:57 AM org.apache.tuscany.sca.contribution.processor.ExtensibleStAXArtifactProcessor
[] (ElementCannotBeProcessed)
SEVERE: Element {http://docs.oasis-open.org/ns/opencsa/sca/200912}implementation.java cannot
be processed. ([row,col {unknown-source}]: [31,3])
Apr 8, 2010 7:48:57 AM org.apache.tuscany.sca.contribution.processor.ExtensibleStAXArtifactProcessor
[] (ElementCannotBeProcessed)
SEVERE: Element {http://docs.oasis-open.org/ns/opencsa/sca/200912}implementation.java cannot
be processed. ([row,col {unknown-source}]: [39,9])
Apr 8, 2010 7:48:57 AM org.apache.tuscany.sca.contribution.processor.ExtensibleStAXArtifactProcessor
[] (ElementCannotBeProcessed)
SEVERE: Element {http://docs.oasis-open.org/ns/opencsa/sca/200912}implementation.java cannot
be processed. ([row,col {unknown-source}]: [43,9])
Apr 8, 2010 7:48:57 AM org.apache.tuscany.sca.contribution.processor.ExtensibleStAXArtifactProcessor
[] (ElementCannotBeProcessed)
SEVERE: Element {http://docs.oasis-open.org/ns/opencsa/sca/200912}implementation.java cannot
be processed. ([row,col {unknown-source}]: [47,9])
Apr 8, 2010 7:48:57 AM org.apache.tuscany.sca.contribution.processor.ExtensibleStAXArtifactProcessor
[] (ElementCannotBeProcessed)
SEVERE: Element {http://docs.oasis-open.org/ns/opencsa/sca/200912}implementation.java cannot
be processed. ([row,col {unknown-source}]: [51,9])
Apr 8, 2010 7:48:57 AM org.apache.tuscany.sca.contribution.processor.ExtensibleStAXArtifactProcessor
[] (ElementCannotBeProcessed)
SEVERE: Element {http://x}unknownElement cannot be processed. ([row,col {unknown-source}]:
[54,5])
Apr 8, 2010 7:48:57 AM org.apache.tuscany.sca.contribution.processor.ExtensibleStAXArtifactProcessor
[Definitions: <http://hudson.zones.apache.org/hudson/job/Tuscany-2x/ws/sca-2x/modules/assembly-xml/target/test-classes/org/apache/tuscany/sca/definitions/xml/test_definitions.xml]>
(ElementCannotBeProcessed)
SEVERE: Element {http://schemas.xmlsoap.org/ws/2004/09/policy}Policy cannot be processed.
([row,col,system-id]: [139,9,"<http://hudson.zones.apache.org/hudson/job/Tuscany-2x/ws/sca-2x/modules/assembly-xml/target/test-classes/org/apache/tuscany/sca/definitions/xml/test_definitions.xml"])>
Apr 8, 2010 7:48:57 AM org.apache.tuscany.sca.definitions.xml.DefinitionsProcessor [] (BindingTypeNotFound)
SEVERE: An extension to support the binding type {http://docs.oasis-open.org/ns/opencsa/sca/200912}binding.ws
cant be found in the domain  
Apr 8, 2010 7:48:57 AM org.apache.tuscany.sca.definitions.xml.DefinitionsProcessor [] (ImplementationTypeNotFound)
SEVERE: [POL50001] An extension to support the implementation type {http://docs.oasis-open.org/ns/opencsa/sca/200912}implementation.java
cant be found in the domain
Apr 8, 2010 7:48:58 AM org.apache.tuscany.sca.contribution.processor.ExtensibleStAXArtifactProcessor
[] (ElementCannotBeProcessed)
SEVERE: Element {http://extension}testExtension cannot be processed. ([row,col {unknown-source}]:
[30,5])
Apr 8, 2010 7:48:58 AM org.apache.tuscany.sca.contribution.processor.ExtensibleStAXArtifactProcessor
[] (ElementCannotBeProcessed)
SEVERE: Element {http://extension}testExtension cannot be processed. ([row,col {unknown-source}]:
[34,9])
Apr 8, 2010 7:48:58 AM org.apache.tuscany.sca.contribution.processor.ExtensibleStAXArtifactProcessor
[] (ElementCannotBeProcessed)
SEVERE: Element {http://docs.oasis-open.org/ns/opencsa/sca/200912}interface.java cannot be
processed. ([row,col {unknown-source}]: [35,9])
Apr 8, 2010 7:48:58 AM org.apache.tuscany.sca.contribution.processor.ExtensibleStAXArtifactProcessor
[] (ElementCannotBeProcessed)
SEVERE: Element {http://docs.oasis-open.org/ns/opencsa/sca/200912}operation cannot be processed.
([row,col {unknown-source}]: [36,9])
Apr 8, 2010 7:48:58 AM org.apache.tuscany.sca.contribution.processor.ExtensibleStAXArtifactProcessor
[] (ElementCannotBeProcessed)
SEVERE: Element {http://docs.oasis-open.org/ns/opencsa/sca/200912}binding.ws cannot be processed.
([row,col {unknown-source}]: [38,9])
Apr 8, 2010 7:48:58 AM org.apache.tuscany.sca.contribution.processor.ExtensibleStAXArtifactProcessor
[] (ElementCannotBeProcessed)
SEVERE: Element {http://extension}testExtension cannot be processed. ([row,col {unknown-source}]:
[42,10])
Apr 8, 2010 7:48:58 AM org.apache.tuscany.sca.contribution.processor.ExtensibleStAXArtifactProcessor
[] (ElementCannotBeProcessed)
SEVERE: Element {http://docs.oasis-open.org/ns/opencsa/sca/200912}binding.ws cannot be processed.
([row,col {unknown-source}]: [43,13])
Apr 8, 2010 7:48:58 AM org.apache.tuscany.sca.contribution.processor.ExtensibleStAXArtifactProcessor
[] (ElementCannotBeProcessed)
SEVERE: Element {http://extension}testExtension cannot be processed. ([row,col {unknown-source}]:
[50,9])
Apr 8, 2010 7:48:58 AM org.apache.tuscany.sca.contribution.processor.ExtensibleStAXArtifactProcessor
[] (ElementCannotBeProcessed)
SEVERE: Element {http://docs.oasis-open.org/ns/opencsa/sca/200912}interface.java cannot be
processed. ([row,col {unknown-source}]: [52,13])
Apr 8, 2010 7:48:58 AM org.apache.tuscany.sca.contribution.processor.ExtensibleStAXArtifactProcessor
[] (ElementCannotBeProcessed)
SEVERE: Element {http://extension}testExtension cannot be processed. ([row,col {unknown-source}]:
[57,13])
Apr 8, 2010 7:48:58 AM org.apache.tuscany.sca.contribution.processor.ExtensibleStAXArtifactProcessor
[] (ElementCannotBeProcessed)
SEVERE: Element {http://docs.oasis-open.org/ns/opencsa/sca/200912}interface.java cannot be
processed. ([row,col {unknown-source}]: [58,13])
Apr 8, 2010 7:48:58 AM org.apache.tuscany.sca.contribution.processor.ExtensibleStAXArtifactProcessor
[] (ElementCannotBeProcessed)
SEVERE: Element {http://docs.oasis-open.org/ns/opencsa/sca/200912}implementation.java cannot
be processed. ([row,col {unknown-source}]: [66,9])
Apr 8, 2010 7:48:58 AM org.apache.tuscany.sca.contribution.processor.ExtensibleStAXArtifactProcessor
[] (ElementCannotBeProcessed)
SEVERE: Element {http://docs.oasis-open.org/ns/opencsa/sca/200912}interface.java cannot be
processed. ([row,col {unknown-source}]: [71,13])
Apr 8, 2010 7:48:58 AM org.apache.tuscany.sca.contribution.processor.ExtensibleStAXArtifactProcessor
[] (ElementCannotBeProcessed)
SEVERE: Element {http://docs.oasis-open.org/ns/opencsa/sca/200912}implementation.java cannot
be processed. ([row,col {unknown-source}]: [73,9])
Apr 8, 2010 7:48:58 AM org.apache.tuscany.sca.contribution.processor.ExtensibleStAXArtifactProcessor
[] (ElementCannotBeProcessed)
SEVERE: Element {http://docs.oasis-open.org/ns/opencsa/sca/200912}interface.java cannot be
processed. ([row,col {unknown-source}]: [78,13])
Apr 8, 2010 7:48:58 AM org.apache.tuscany.sca.contribution.processor.ExtensibleStAXArtifactProcessor
[] (ElementCannotBeProcessed)
SEVERE: Element {http://docs.oasis-open.org/ns/opencsa/sca/200912}implementation.java cannot
be processed. ([row,col {unknown-source}]: [84,9])
Apr 8, 2010 7:48:58 AM org.apache.tuscany.sca.contribution.processor.ExtensibleStAXArtifactProcessor
[] (ElementCannotBeProcessed)
SEVERE: Element {http://docs.oasis-open.org/ns/opencsa/sca/200912}implementation.java cannot
be processed. ([row,col {unknown-source}]: [88,9])
Apr 8, 2010 7:48:58 AM org.apache.tuscany.sca.contribution.processor.ExtensibleStAXArtifactProcessor
[] (ElementCannotBeProcessed)
SEVERE: Element {http://docs.oasis-open.org/ns/opencsa/sca/200912}implementation.java cannot
be processed. ([row,col {unknown-source}]: [92,9])
Apr 8, 2010 7:48:58 AM org.apache.tuscany.sca.contribution.processor.ExtensibleStAXArtifactProcessor
[] (ElementCannotBeProcessed)
SEVERE: Element {http://docs.oasis-open.org/ns/opencsa/sca/200912}interface.java cannot be
processed. ([row,col {unknown-source}]: [97,9])
Apr 8, 2010 7:48:58 AM org.apache.tuscany.sca.contribution.processor.ExtensibleStAXArtifactProcessor
[] (ElementCannotBeProcessed)
SEVERE: Element {http://docs.oasis-open.org/ns/opencsa/sca/200912}binding.ws cannot be processed.
([row,col {unknown-source}]: [99,9])
Apr 8, 2010 7:48:58 AM org.apache.tuscany.sca.contribution.processor.ExtensibleStAXArtifactProcessor
[] (ElementCannotBeProcessed)
SEVERE: Element {http://docs.oasis-open.org/ns/opencsa/sca/200912}binding.ws cannot be processed.
([row,col {unknown-source}]: [103,13])
Apr 8, 2010 7:48:58 AM org.apache.tuscany.sca.contribution.processor.ExtensibleStAXArtifactProcessor
[] (ElementCannotBeProcessed)
SEVERE: Element {http://docs.oasis-open.org/ns/opencsa/sca/200912}implementation.java cannot
be processed. ([row,col {unknown-source}]: [24,5])
Apr 8, 2010 7:48:58 AM org.apache.tuscany.sca.contribution.processor.ExtensibleStAXArtifactProcessor
[] (ElementCannotBeProcessed)
SEVERE: Element {http://docs.oasis-open.org/ns/opencsa/sca/200912}interface.wsdl cannot be
processed. ([row,col {unknown-source}]: [26,7])
Apr 8, 2010 7:48:58 AM org.apache.tuscany.sca.contribution.processor.ExtensibleStAXArtifactProcessor
[] (ElementCannotBeProcessed)
SEVERE: Element {http://docs.oasis-open.org/ns/opencsa/sca/200912}implementation.java cannot
be processed. ([row,col {unknown-source}]: [1,179])
Apr 8, 2010 7:48:58 AM org.apache.tuscany.sca.contribution.processor.ExtensibleStAXArtifactProcessor
[] (ElementCannotBeProcessed)
SEVERE: Element {http://docs.oasis-open.org/ns/opencsa/sca/200912}interface.wsdl cannot be
processed. ([row,col {unknown-source}]: [1,245])

[INFO] [jar:jar {execution: default-jar}]
[INFO] Building jar: <http://hudson.zones.apache.org/hudson/job/Tuscany-2x/ws/sca-2x/modules/assembly-xml/target/tuscany-assembly-xml-2.0-SNAPSHOT.jar>
[INFO] [install:install {execution: default-install}]
[INFO] Installing <http://hudson.zones.apache.org/hudson/job/Tuscany-2x/ws/sca-2x/modules/assembly-xml/target/tuscany-assembly-xml-2.0-SNAPSHOT.jar>
to /export/home/hudson/.m2/repository/org/apache/tuscany/sca/tuscany-assembly-xml/2.0-SNAPSHOT/tuscany-assembly-xml-2.0-SNAPSHOT.jar
[HUDSON] Archiving <http://hudson.zones.apache.org/hudson/job/Tuscany-2x/ws/sca-2x/modules/assembly-xml/pom.xml>
to /export/home/hudson/hudson/jobs/Tuscany-2x/modules/org.apache.tuscany.sca$tuscany-assembly-xml/builds/2010-04-08_07-42-22/archive/org.apache.tuscany.sca/tuscany-assembly-xml/2.0-SNAPSHOT/pom.xml
[HUDSON] Archiving <http://hudson.zones.apache.org/hudson/job/Tuscany-2x/ws/sca-2x/modules/assembly-xml/target/tuscany-assembly-xml-2.0-SNAPSHOT.jar>
to /export/home/hudson/hudson/jobs/Tuscany-2x/modules/org.apache.tuscany.sca$tuscany-assembly-xml/builds/2010-04-08_07-42-22/archive/org.apache.tuscany.sca/tuscany-assembly-xml/2.0-SNAPSHOT/tuscany-assembly-xml-2.0-SNAPSHOT.jar
[INFO] ------------------------------------------------------------------------
[INFO] Building Apache Tuscany SCA Atom Feed Binding Extension
[INFO]    task-segment: [clean, install]
[INFO] ------------------------------------------------------------------------
[INFO] [clean:clean {execution: default-clean}]
[INFO] Deleting file set: <http://hudson.zones.apache.org/hudson/job/Tuscany-2x/ws/sca-2x/modules/binding-atom/target>
(included: [**], excluded: [])
[INFO] [enforcer:enforce {execution: enforce-plugin-versions}]
[INFO] [resources:resources {execution: default-resources}]
[INFO] Using 'UTF-8' encoding to copy filtered resources.
[INFO] Copying 2 resources
[INFO] Copying 5 resources
[INFO] [compiler:compile {execution: default-compile}]
[INFO] Invoking Tuscany Eclipse JDT compiler
[INFO] Compiling 4 to <http://hudson.zones.apache.org/hudson/job/Tuscany-2x/ws/sca-2x/modules/binding-atom/target/classes>
[INFO] Resolving OSGi bundle: org.apache.tuscany.sca.binding.atom
[ERROR] --> [org.apache.tuscany.sca.binding.atom] Missing Constraint: Import-Package: org.apache.tuscany.sca.assembly.xml;
version="2.0.0"
[INFO] [resources:testResources {execution: default-testResources}]
[INFO] Using 'UTF-8' encoding to copy filtered resources.
[INFO] Copying 0 resource
[INFO] [compiler:testCompile {execution: default-testCompile}]
[INFO] Invoking Tuscany Eclipse JDT compiler
[INFO] Compiling 1 to <http://hudson.zones.apache.org/hudson/job/Tuscany-2x/ws/sca-2x/modules/binding-atom/target/test-classes>
[INFO] [surefire:test {execution: default-test}]
[INFO] Surefire report directory: <http://hudson.zones.apache.org/hudson/job/Tuscany-2x/ws/sca-2x/modules/binding-atom/target/surefire-reports>

-------------------------------------------------------
 T E S T S
-------------------------------------------------------
Running org.apache.tuscany.sca.binding.atom.AtomBindingProcessorTestCase
Apr 8, 2010 7:49:21 AM org.apache.tuscany.sca.contribution.processor.ExtensibleStAXArtifactProcessor
[] (ElementCannotBeProcessed)
SEVERE: Element {http://docs.oasis-open.org/ns/opencsa/sca/200912}implementation.java cannot
be processed. ([row,col {unknown-source}]: [1,263])
Tests run: 1, Failures: 0, Errors: 0, Skipped: 0, Time elapsed: 0.216 sec

Results :

Tests run: 1, Failures: 0, Errors: 0, Skipped: 0

[HUDSON] Recording test results
[INFO] [jar:jar {execution: default-jar}]
[INFO] Building jar: <http://hudson.zones.apache.org/hudson/job/Tuscany-2x/ws/sca-2x/modules/binding-atom/target/tuscany-binding-atom-2.0-SNAPSHOT.jar>
[INFO] [install:install {execution: default-install}]
[INFO] Installing <http://hudson.zones.apache.org/hudson/job/Tuscany-2x/ws/sca-2x/modules/binding-atom/target/tuscany-binding-atom-2.0-SNAPSHOT.jar>
to /export/home/hudson/.m2/repository/org/apache/tuscany/sca/tuscany-binding-atom/2.0-SNAPSHOT/tuscany-binding-atom-2.0-SNAPSHOT.jar
[HUDSON] Archiving <http://hudson.zones.apache.org/hudson/job/Tuscany-2x/ws/sca-2x/modules/binding-atom/pom.xml>
to /export/home/hudson/hudson/jobs/Tuscany-2x/modules/org.apache.tuscany.sca$tuscany-binding-atom/builds/2010-04-08_07-42-22/archive/org.apache.tuscany.sca/tuscany-binding-atom/2.0-SNAPSHOT/pom.xml
[HUDSON] Archiving <http://hudson.zones.apache.org/hudson/job/Tuscany-2x/ws/sca-2x/modules/binding-atom/target/tuscany-binding-atom-2.0-SNAPSHOT.jar>
to /export/home/hudson/hudson/jobs/Tuscany-2x/modules/org.apache.tuscany.sca$tuscany-binding-atom/builds/2010-04-08_07-42-22/archive/org.apache.tuscany.sca/tuscany-binding-atom/2.0-SNAPSHOT/tuscany-binding-atom-2.0-SNAPSHOT.jar
[INFO] ------------------------------------------------------------------------
[INFO] Building Apache Tuscany SCA Core SPI
[INFO]    task-segment: [clean, install]
[INFO] ------------------------------------------------------------------------
[INFO] [clean:clean {execution: default-clean}]
[INFO] [enforcer:enforce {execution: enforce-plugin-versions}]
[INFO] [buildnumber:create {execution: default}]
[INFO] Checking for local modifications: skipped.
[INFO] Executing: /bin/sh -c cd <http://hudson.zones.apache.org/hudson/job/Tuscany-2x/ws/sca-2x/modules/core-spi>
&& svn --non-interactive update <http://hudson.zones.apache.org/hudson/job/Tuscany-2x/ws/sca-2x/modules/core-spi>
[INFO] Working directory: <http://hudson.zones.apache.org/hudson/job/Tuscany-2x/ws/sca-2x/modules/core-spi>
Provider message:
The svn command failed.
Command output:
svn: OPTIONS of 'https://svn.apache.org/repos/asf/tuscany/sca-java-2.x/trunk/modules': Server
certificate verification failed: issuer is not trusted (https://svn.apache.org)

[HUDSON] Archiving <http://hudson.zones.apache.org/hudson/job/Tuscany-2x/ws/sca-2x/modules/core-spi/pom.xml>
to /export/home/hudson/hudson/jobs/Tuscany-2x/modules/org.apache.tuscany.sca$tuscany-core-spi/builds/2010-04-08_07-42-24/archive/org.apache.tuscany.sca/tuscany-core-spi/2.0-SNAPSHOT/pom.xml
[INFO] ------------------------------------------------------------------------
[ERROR] BUILD ERROR
[INFO] ------------------------------------------------------------------------
[INFO] Couldn't update project.

Embedded error: Error!
[INFO] ------------------------------------------------------------------------
[INFO] For more information, run Maven with the -e switch
[INFO] ------------------------------------------------------------------------
[INFO] Total time: 5 minutes 55 seconds
[INFO] Finished at: Thu Apr 08 07:49:42 GMT+00:00 2010
[INFO] Final Memory: 50M/748M
[INFO] ------------------------------------------------------------------------
Sending e-mails to: commits@tuscany.apache.org
channel stopped


Mime
View raw message