tuscany-commits mailing list archives

Site index · List index
Message view « Date » · « Thread »
Top « Date » · « Thread »
From Apache Hudson Server <hud...@hudson.zones.apache.org>
Subject Build failed in Hudson: Tuscany-2x #636
Date Wed, 21 Apr 2010 16:46:33 GMT
See <http://hudson.zones.apache.org/hudson/job/Tuscany-2x/636/changes>

Changes:

[antelder] Update tomcat distro license for recent changes

------------------------------------------
[...truncated 12570 lines...]
[INFO] [compiler:compile {execution: default-compile}]
[INFO] Compiling 5 source files to <http://hudson.zones.apache.org/hudson/job/Tuscany-2x/ws/sca-2x/itest/callback-api/target/classes>
[INFO] [resources:testResources {execution: default-testResources}]
[INFO] Using 'UTF-8' encoding to copy filtered resources.
[INFO] skip non existing resourceDirectory <http://hudson.zones.apache.org/hudson/job/Tuscany-2x/ws/sca-2x/itest/callback-api/src/test/resources>
[INFO] [compiler:testCompile {execution: default-testCompile}]
[INFO] Compiling 1 source file to <http://hudson.zones.apache.org/hudson/job/Tuscany-2x/ws/sca-2x/itest/callback-api/target/test-classes>
[INFO] [surefire:test {execution: default-test}]
[INFO] Surefire report directory: <http://hudson.zones.apache.org/hudson/job/Tuscany-2x/ws/sca-2x/itest/callback-api/target/surefire-reports>

-------------------------------------------------------
 T E S T S
-------------------------------------------------------
Running org.apache.tuscany.sca.test.CallBackApiTestCase
Apr 21, 2010 4:37:40 PM org.apache.tuscany.sca.node.impl.NodeImpl start
INFO: Starting node: http://tuscany.apache.org/sca/1.1/nodes/default0 domain: default
Apr 21, 2010 4:37:40 PM org.apache.tuscany.sca.node.impl.NodeFactoryImpl loadContributions
INFO: Loading contribution: <http://hudson.zones.apache.org/hudson/job/Tuscany-2x/ws/sca-2x/itest/callback-api/target/classes/>
Apr 21, 2010 4:37:40 PM org.apache.tuscany.sca.binding.sca.provider.DefaultSCABindingMapper
<init>
WARNING: Mapped binding for binding.sca is not supported: {http://tuscany.apache.org/xmlns/sca/1.1}binding.rmi
Apr 21, 2010 4:37:40 PM org.apache.tuscany.sca.core.assembly.impl.EndpointRegistryImpl addEndpoint
INFO: Add endpoint - (@2592387)Endpoint:  URI = CallBackApiClient#service-binding(CallBackApiClient/CallBackApiClient)
Apr 21, 2010 4:37:40 PM org.apache.tuscany.sca.core.assembly.impl.EndpointRegistryImpl addEndpoint
INFO: Add endpoint - (@16606885)Endpoint:  URI = CallBackApiClient#service-binding(aCallBackService/aCallBackService)
Apr 21, 2010 4:37:40 PM org.apache.tuscany.sca.core.assembly.impl.EndpointRegistryImpl addEndpoint
INFO: Add endpoint - (@6159089)Endpoint:  URI = CallBackApiService#service-binding(CallBackApiService/CallBackApiService)
CallBackApiServiceImpl message received: Knock Knock
CallBackApiServiceImpl getting request context
CallBackApiServiceImpl getting callback from request context
CallBackApiServiceImpl returning callback
Entering callback callBackMessage: Who's There
CallBackApiServiceImpl response sent
CallBackApiServiceImpl message received: Knock Knock
Entering callback callBackMessage: Who's There
CallBackApiServiceImpl response sent
CallBackApiServiceImpl message received: No Reply Desired
CallBackApiServiceImpl getting request context
CallBackApiServiceImpl getting callback from request context
CallBackApiServiceImpl returning callback
CallBackApiServiceImpl message received: Call me back 3 times
Entering callback increment: Who's There 1
CallBackApiServiceImpl response sent
Entering callback increment: Who's There 2
CallBackApiServiceImpl response sent
Entering callback increment: Who's There 3
CallBackApiServiceImpl response sent
Apr 21, 2010 4:37:40 PM org.apache.tuscany.sca.node.impl.NodeImpl stop
INFO: Stopping node: http://tuscany.apache.org/sca/1.1/nodes/default0
Tests run: 1, Failures: 0, Errors: 0, Skipped: 0, Time elapsed: 0.986 sec

Results :

Tests run: 1, Failures: 0, Errors: 0, Skipped: 0

[HUDSON] Recording test results
[INFO] [jar:jar {execution: default-jar}]
[INFO] Building jar: <http://hudson.zones.apache.org/hudson/job/Tuscany-2x/ws/sca-2x/itest/callback-api/target/itest-callback-api-2.0-SNAPSHOT.jar>
[INFO] [install:install {execution: default-install}]
[INFO] Installing <http://hudson.zones.apache.org/hudson/job/Tuscany-2x/ws/sca-2x/itest/callback-api/target/itest-callback-api-2.0-SNAPSHOT.jar>
to /home/hudson/.m2/repository/org/apache/tuscany/sca/itest-callback-api/2.0-SNAPSHOT/itest-callback-api-2.0-SNAPSHOT.jar
[HUDSON] Archiving <http://hudson.zones.apache.org/hudson/job/Tuscany-2x/ws/sca-2x/itest/callback-api/pom.xml>
to /export/home/hudson/hudson/jobs/Tuscany-2x/modules/org.apache.tuscany.sca$itest-callback-api/builds/2010-04-21_16-18-02/archive/org.apache.tuscany.sca/itest-callback-api/2.0-SNAPSHOT/pom.xml
[HUDSON] Archiving <http://hudson.zones.apache.org/hudson/job/Tuscany-2x/ws/sca-2x/itest/callback-api/target/itest-callback-api-2.0-SNAPSHOT.jar>
to /export/home/hudson/hudson/jobs/Tuscany-2x/modules/org.apache.tuscany.sca$itest-callback-api/builds/2010-04-21_16-18-02/archive/org.apache.tuscany.sca/itest-callback-api/2.0-SNAPSHOT/itest-callback-api-2.0-SNAPSHOT.jar
[INFO] ------------------------------------------------------------------------
[INFO] Building Apache Tuscany SCA iTest Callback Basic
[INFO]    task-segment: [clean, install]
[INFO] ------------------------------------------------------------------------
[INFO] [clean:clean {execution: default-clean}]
[INFO] Deleting file set: <http://hudson.zones.apache.org/hudson/job/Tuscany-2x/ws/sca-2x/itest/callback-basic/target>
(included: [**], excluded: [])
[INFO] [enforcer:enforce {execution: enforce-plugin-versions}]
[INFO] [resources:resources {execution: default-resources}]
[INFO] Using 'UTF-8' encoding to copy filtered resources.
[INFO] Copying 2 resources
[INFO] Copying 0 resource
[INFO] [compiler:compile {execution: default-compile}]
[INFO] Compiling 5 source files to <http://hudson.zones.apache.org/hudson/job/Tuscany-2x/ws/sca-2x/itest/callback-basic/target/classes>
[INFO] [resources:testResources {execution: default-testResources}]
[INFO] Using 'UTF-8' encoding to copy filtered resources.
[INFO] skip non existing resourceDirectory <http://hudson.zones.apache.org/hudson/job/Tuscany-2x/ws/sca-2x/itest/callback-basic/src/test/resources>
[INFO] [compiler:testCompile {execution: default-testCompile}]
[INFO] Compiling 1 source file to <http://hudson.zones.apache.org/hudson/job/Tuscany-2x/ws/sca-2x/itest/callback-basic/target/test-classes>
[INFO] [surefire:test {execution: default-test}]
[INFO] Surefire report directory: <http://hudson.zones.apache.org/hudson/job/Tuscany-2x/ws/sca-2x/itest/callback-basic/target/surefire-reports>

-------------------------------------------------------
 T E S T S
-------------------------------------------------------
Running org.apache.tuscany.sca.test.CallBackBasicTestCase
Apr 21, 2010 4:37:43 PM org.apache.tuscany.sca.node.impl.NodeImpl start
INFO: Starting node: http://tuscany.apache.org/sca/1.1/nodes/default0 domain: default
Apr 21, 2010 4:37:43 PM org.apache.tuscany.sca.node.impl.NodeFactoryImpl loadContributions
INFO: Loading contribution: <http://hudson.zones.apache.org/hudson/job/Tuscany-2x/ws/sca-2x/itest/callback-basic/target/classes/>
Apr 21, 2010 4:37:44 PM org.apache.tuscany.sca.binding.sca.provider.DefaultSCABindingMapper
<init>
WARNING: Mapped binding for binding.sca is not supported: {http://tuscany.apache.org/xmlns/sca/1.1}binding.rmi
Apr 21, 2010 4:37:44 PM org.apache.tuscany.sca.core.assembly.impl.EndpointRegistryImpl addEndpoint
INFO: Add endpoint - (@25054702)Endpoint:  URI = CallBackBasicClient#service-binding(CallBackBasicClient/CallBackBasicClient)
Apr 21, 2010 4:37:44 PM org.apache.tuscany.sca.core.assembly.impl.EndpointRegistryImpl addEndpoint
INFO: Add endpoint - (@19823722)Endpoint:  URI = CallBackBasicClient#service-binding(aCallBackService/aCallBackService)
Apr 21, 2010 4:37:44 PM org.apache.tuscany.sca.core.assembly.impl.EndpointRegistryImpl addEndpoint
INFO: Add endpoint - (@15357025)Endpoint:  URI = CallBackBasicService#service-binding(CallBackBasicService/CallBackBasicService)
CallBackBasicServiceImpl message received: Knock Knock
Entering callback callBackMessage: Who's There
CallBackBasicServiceImpl response sent
CallBackBasicServiceImpl message received: No Reply Desired
CallBackBasicServiceImpl message received: Call me back 3 times
Entering callback increment: Who's There 1
CallBackBasicServiceImpl response sent
Entering callback increment: Who's There 2
CallBackBasicServiceImpl response sent
Entering callback increment: Who's There 3
CallBackBasicServiceImpl response sent
Apr 21, 2010 4:37:44 PM org.apache.tuscany.sca.node.impl.NodeImpl stop
INFO: Stopping node: http://tuscany.apache.org/sca/1.1/nodes/default0
Tests run: 1, Failures: 0, Errors: 0, Skipped: 0, Time elapsed: 0.883 sec

Results :

Tests run: 1, Failures: 0, Errors: 0, Skipped: 0

[HUDSON] Recording test results
[INFO] [jar:jar {execution: default-jar}]
[INFO] Building jar: <http://hudson.zones.apache.org/hudson/job/Tuscany-2x/ws/sca-2x/itest/callback-basic/target/itest-callback-basic-2.0-SNAPSHOT.jar>
[INFO] [install:install {execution: default-install}]
[INFO] Installing <http://hudson.zones.apache.org/hudson/job/Tuscany-2x/ws/sca-2x/itest/callback-basic/target/itest-callback-basic-2.0-SNAPSHOT.jar>
to /home/hudson/.m2/repository/org/apache/tuscany/sca/itest-callback-basic/2.0-SNAPSHOT/itest-callback-basic-2.0-SNAPSHOT.jar
[HUDSON] Archiving <http://hudson.zones.apache.org/hudson/job/Tuscany-2x/ws/sca-2x/itest/callback-basic/pom.xml>
to /export/home/hudson/hudson/jobs/Tuscany-2x/modules/org.apache.tuscany.sca$itest-callback-basic/builds/2010-04-21_16-18-02/archive/org.apache.tuscany.sca/itest-callback-basic/2.0-SNAPSHOT/pom.xml
[HUDSON] Archiving <http://hudson.zones.apache.org/hudson/job/Tuscany-2x/ws/sca-2x/itest/callback-basic/target/itest-callback-basic-2.0-SNAPSHOT.jar>
to /export/home/hudson/hudson/jobs/Tuscany-2x/modules/org.apache.tuscany.sca$itest-callback-basic/builds/2010-04-21_16-18-02/archive/org.apache.tuscany.sca/itest-callback-basic/2.0-SNAPSHOT/itest-callback-basic-2.0-SNAPSHOT.jar
[INFO] ------------------------------------------------------------------------
[INFO] Building Apache Tuscany SCA iTest Callback Basic WebServices
[INFO]    task-segment: [clean, install]
[INFO] ------------------------------------------------------------------------
[INFO] [clean:clean {execution: default-clean}]
[INFO] Deleting file set: <http://hudson.zones.apache.org/hudson/job/Tuscany-2x/ws/sca-2x/itest/callback-basic-ws/target>
(included: [**], excluded: [])
[INFO] [enforcer:enforce {execution: enforce-plugin-versions}]
[INFO] [resources:resources {execution: default-resources}]
[INFO] Using 'UTF-8' encoding to copy filtered resources.
[INFO] Copying 2 resources
[INFO] Copying 0 resource
[INFO] [compiler:compile {execution: default-compile}]
[INFO] Compiling 5 source files to <http://hudson.zones.apache.org/hudson/job/Tuscany-2x/ws/sca-2x/itest/callback-basic-ws/target/classes>
[INFO] [resources:testResources {execution: default-testResources}]
[INFO] Using 'UTF-8' encoding to copy filtered resources.
[INFO] skip non existing resourceDirectory <http://hudson.zones.apache.org/hudson/job/Tuscany-2x/ws/sca-2x/itest/callback-basic-ws/src/test/resources>
[INFO] [compiler:testCompile {execution: default-testCompile}]
[INFO] Compiling 1 source file to <http://hudson.zones.apache.org/hudson/job/Tuscany-2x/ws/sca-2x/itest/callback-basic-ws/target/test-classes>
[INFO] [surefire:test {execution: default-test}]
[INFO] Surefire report directory: <http://hudson.zones.apache.org/hudson/job/Tuscany-2x/ws/sca-2x/itest/callback-basic-ws/target/surefire-reports>

-------------------------------------------------------
 T E S T S
-------------------------------------------------------
Running org.apache.tuscany.sca.test.CallBackBasicTestCase
Apr 21, 2010 4:37:48 PM org.apache.tuscany.sca.node.impl.NodeImpl start
INFO: Starting node: http://tuscany.apache.org/sca/1.1/nodes/default0 domain: default
Apr 21, 2010 4:37:48 PM org.apache.tuscany.sca.node.impl.NodeFactoryImpl loadContributions
INFO: Loading contribution: <http://hudson.zones.apache.org/hudson/job/Tuscany-2x/ws/sca-2x/itest/callback-basic-ws/target/classes/>
Apr 21, 2010 4:37:49 PM org.apache.tuscany.sca.core.assembly.impl.EndpointRegistryImpl addEndpoint
INFO: Add endpoint - (@1553074)Endpoint:  URI = CallBackBasicClient#service-binding(CallBackBasicClient/CallBackBasicClient)
- Deploying module: rampart-1.4 - jar:<http://hudson.zones.apache.org/hudson/job/Tuscany-2x/ws/sca-2x/modules/binding-ws-runtime-axis2/target/tuscany-binding-ws-runtime-axis2-2.0-SNAPSHOT.jar!/org/apache/tuscany/sca/binding/ws/axis2/engine/repository/modules/rampart-1.4.mar>
2010-04-21 16:37:50.006::INFO:  Logging to STDERR via org.mortbay.log.StdErrLog
Apr 21, 2010 4:37:50 PM org.apache.tuscany.sca.http.jetty.JettyLogger info
INFO: jetty-6.1.19
Apr 21, 2010 4:37:50 PM org.apache.tuscany.sca.http.jetty.JettyLogger info
INFO: Started SelectChannelConnector@localhost:8084
Apr 21, 2010 4:37:50 PM org.apache.tuscany.sca.http.jetty.JettyServer addServletMapping
INFO: Added Servlet mapping: http://localhost:8084/aCallBackService
Apr 21, 2010 4:37:50 PM org.apache.tuscany.sca.core.assembly.impl.EndpointRegistryImpl addEndpoint
INFO: Add endpoint - (@13823905)Endpoint:  URI = CallBackBasicClient#service-binding(aCallBackService/aCallBackService)
- Deploying module: rampart-1.4 - jar:<http://hudson.zones.apache.org/hudson/job/Tuscany-2x/ws/sca-2x/modules/binding-ws-runtime-axis2/target/tuscany-binding-ws-runtime-axis2-2.0-SNAPSHOT.jar!/org/apache/tuscany/sca/binding/ws/axis2/engine/repository/modules/rampart-1.4.mar>
Apr 21, 2010 4:37:50 PM org.apache.tuscany.sca.http.jetty.JettyLogger info
INFO: jetty-6.1.19
Apr 21, 2010 4:37:50 PM org.apache.tuscany.sca.http.jetty.JettyLogger info
INFO: Started SelectChannelConnector@localhost:8085
Apr 21, 2010 4:37:50 PM org.apache.tuscany.sca.http.jetty.JettyServer addServletMapping
INFO: Added Servlet mapping: http://localhost:8085/CallBackBasicService
Apr 21, 2010 4:37:50 PM org.apache.tuscany.sca.core.assembly.impl.EndpointRegistryImpl addEndpoint
INFO: Add endpoint - (@3315058)Endpoint:  URI = CallBackBasicService#service-binding(CallBackBasicService/CallBackBasicService)
- Deploying module: rampart-1.4 - jar:<http://hudson.zones.apache.org/hudson/job/Tuscany-2x/ws/sca-2x/modules/binding-ws-runtime-axis2/target/tuscany-binding-ws-runtime-axis2-2.0-SNAPSHOT.jar!/org/apache/tuscany/sca/binding/ws/axis2/engine/repository/modules/rampart-1.4.mar>
CallBackBasicServiceImpl message received: Knock Knock
- Deploying module: rampart-1.4 - jar:<http://hudson.zones.apache.org/hudson/job/Tuscany-2x/ws/sca-2x/modules/binding-ws-runtime-axis2/target/tuscany-binding-ws-runtime-axis2-2.0-SNAPSHOT.jar!/org/apache/tuscany/sca/binding/ws/axis2/engine/repository/modules/rampart-1.4.mar>
Entering callback callBackMessage: Who's There
CallBackBasicServiceImpl response sent
CallBackBasicServiceImpl message received: No Reply Desired
CallBackBasicServiceImpl message received: Call me back 3 times
- Deploying module: rampart-1.4 - jar:<http://hudson.zones.apache.org/hudson/job/Tuscany-2x/ws/sca-2x/modules/binding-ws-runtime-axis2/target/tuscany-binding-ws-runtime-axis2-2.0-SNAPSHOT.jar!/org/apache/tuscany/sca/binding/ws/axis2/engine/repository/modules/rampart-1.4.mar>
Entering callback increment: Who's There 1
CallBackBasicServiceImpl response sent
- Deploying module: rampart-1.4 - jar:<http://hudson.zones.apache.org/hudson/job/Tuscany-2x/ws/sca-2x/modules/binding-ws-runtime-axis2/target/tuscany-binding-ws-runtime-axis2-2.0-SNAPSHOT.jar!/org/apache/tuscany/sca/binding/ws/axis2/engine/repository/modules/rampart-1.4.mar>
Entering callback increment: Who's There 2
CallBackBasicServiceImpl response sent
- Deploying module: rampart-1.4 - jar:<http://hudson.zones.apache.org/hudson/job/Tuscany-2x/ws/sca-2x/modules/binding-ws-runtime-axis2/target/tuscany-binding-ws-runtime-axis2-2.0-SNAPSHOT.jar!/org/apache/tuscany/sca/binding/ws/axis2/engine/repository/modules/rampart-1.4.mar>
Entering callback increment: Who's There 3
CallBackBasicServiceImpl response sent
Apr 21, 2010 4:37:50 PM org.apache.tuscany.sca.node.impl.NodeImpl stop
INFO: Stopping node: http://tuscany.apache.org/sca/1.1/nodes/default0
Apr 21, 2010 4:37:50 PM org.apache.tuscany.sca.http.jetty.JettyServer removeServletMapping
INFO: Removed Servlet mapping: /aCallBackService
Apr 21, 2010 4:37:50 PM org.apache.tuscany.sca.http.jetty.JettyServer removeServletMapping
INFO: Removed Servlet mapping: /CallBackBasicService
Tests run: 1, Failures: 0, Errors: 0, Skipped: 0, Time elapsed: 2.601 sec

Results :

Tests run: 1, Failures: 0, Errors: 0, Skipped: 0

[HUDSON] Recording test results
[INFO] [jar:jar {execution: default-jar}]
[INFO] Building jar: <http://hudson.zones.apache.org/hudson/job/Tuscany-2x/ws/sca-2x/itest/callback-basic-ws/target/itest-callback-basic-ws-2.0-SNAPSHOT.jar>
[INFO] [install:install {execution: default-install}]
[INFO] Installing <http://hudson.zones.apache.org/hudson/job/Tuscany-2x/ws/sca-2x/itest/callback-basic-ws/target/itest-callback-basic-ws-2.0-SNAPSHOT.jar>
to /home/hudson/.m2/repository/org/apache/tuscany/sca/itest-callback-basic-ws/2.0-SNAPSHOT/itest-callback-basic-ws-2.0-SNAPSHOT.jar
[HUDSON] Archiving <http://hudson.zones.apache.org/hudson/job/Tuscany-2x/ws/sca-2x/itest/callback-basic-ws/pom.xml>
to /export/home/hudson/hudson/jobs/Tuscany-2x/modules/org.apache.tuscany.sca$itest-callback-basic-ws/builds/2010-04-21_16-18-02/archive/org.apache.tuscany.sca/itest-callback-basic-ws/2.0-SNAPSHOT/pom.xml
[HUDSON] Archiving <http://hudson.zones.apache.org/hudson/job/Tuscany-2x/ws/sca-2x/itest/callback-basic-ws/target/itest-callback-basic-ws-2.0-SNAPSHOT.jar>
to /export/home/hudson/hudson/jobs/Tuscany-2x/modules/org.apache.tuscany.sca$itest-callback-basic-ws/builds/2010-04-21_16-18-02/archive/org.apache.tuscany.sca/itest-callback-basic-ws/2.0-SNAPSHOT/itest-callback-basic-ws-2.0-SNAPSHOT.jar
[INFO] ------------------------------------------------------------------------
[INFO] Building Apache Tuscany SCA iTest Callback Complex Type
[INFO]    task-segment: [clean, install]
[INFO] ------------------------------------------------------------------------
ERROR: Failed to parse POMs
hudson.util.IOException2: Failed to join the process
	at hudson.Proc$RemoteProc.join(Proc.java:312)
	at hudson.maven.ProcessCache$MavenProcess.call(ProcessCache.java:164)
	at hudson.maven.MavenModuleSetBuild$RunnerImpl.doRun(MavenModuleSetBuild.java:480)
	at hudson.model.AbstractBuild$AbstractRunner.run(AbstractBuild.java:416)
	at hudson.model.Run.run(Run.java:1243)
	at hudson.maven.MavenModuleSetBuild.run(MavenModuleSetBuild.java:304)
	at hudson.model.ResourceController.execute(ResourceController.java:88)
	at hudson.model.Executor.run(Executor.java:122)
Caused by: java.util.concurrent.ExecutionException: hudson.remoting.RequestAbortedException:
java.io.EOFException
	at hudson.remoting.Request$1.get(Request.java:218)
	at hudson.remoting.Request$1.get(Request.java:172)
	at hudson.remoting.FutureAdapter.get(FutureAdapter.java:55)
	at hudson.Proc$RemoteProc.join(Proc.java:304)
	... 7 more
Caused by: hudson.remoting.RequestAbortedException: java.io.EOFException
	at hudson.remoting.Request.abort(Request.java:257)
	at hudson.remoting.Channel.terminate(Channel.java:598)
	at hudson.remoting.Channel$ReaderThread.run(Channel.java:876)
Caused by: java.io.EOFException
	at java.io.ObjectInputStream$BlockDataInputStream.peekByte(ObjectInputStream.java:2554)
	at java.io.ObjectInputStream.readObject0(ObjectInputStream.java:1297)
	at java.io.ObjectInputStream.readObject(ObjectInputStream.java:351)
	at hudson.remoting.Channel$ReaderThread.run(Channel.java:856)
FATAL: channel is already closed
hudson.remoting.ChannelClosedException: channel is already closed
	at hudson.remoting.Channel.send(Channel.java:412)
	at hudson.remoting.Request.call(Request.java:105)
	at hudson.remoting.Channel.call(Channel.java:551)
	at hudson.Launcher$RemoteLauncher.kill(Launcher.java:735)
	at hudson.model.AbstractBuild$AbstractRunner.run(AbstractBuild.java:421)
	at hudson.model.Run.run(Run.java:1243)
	at hudson.maven.MavenModuleSetBuild.run(MavenModuleSetBuild.java:304)
	at hudson.model.ResourceController.execute(ResourceController.java:88)
	at hudson.model.Executor.run(Executor.java:122)


Mime
View raw message