tuscany-commits mailing list archives

Site index · List index
Message view « Date » · « Thread »
Top « Date » · « Thread »
From Apache Hudson Server <hud...@hudson.zones.apache.org>
Subject Build failed in Hudson: Tuscany-2x #616
Date Fri, 09 Apr 2010 16:57:46 GMT
See <http://hudson.zones.apache.org/hudson/job/Tuscany-2x/616/changes>

Changes:

[antelder] Update license for tuscany war updates

------------------------------------------
[...truncated 11519 lines...]
Apr 9, 2010 4:17:42 PM org.apache.tuscany.sca.http.jetty.JettyServer addServletMapping
INFO: Added Servlet mapping: http://192.87.106.251:8080/store/*
Apr 9, 2010 4:17:42 PM org.apache.tuscany.sca.core.assembly.impl.EndpointRegistryImpl addEndpoint
INFO: Add endpoint - (@5994703)Endpoint:  URI = Store#service-binding(Widget/Widget)
Apr 9, 2010 4:17:42 PM org.apache.tuscany.sca.http.jetty.JettyServer addServletMapping
INFO: Added Servlet mapping: http://192.87.106.251:8080/Catalog/*
Apr 9, 2010 4:17:42 PM org.apache.tuscany.sca.http.jetty.JettyServer addServletMapping
INFO: Added Servlet mapping: http://192.87.106.251:8080/Catalog
Apr 9, 2010 4:17:42 PM org.apache.tuscany.sca.core.assembly.impl.EndpointRegistryImpl addEndpoint
INFO: Add endpoint - (@2347147)Endpoint:  URI = Catalog#service-binding(Catalog/Catalog)
Apr 9, 2010 4:17:43 PM org.apache.tuscany.sca.http.jetty.JettyServer addServletMapping
INFO: Added Servlet mapping: http://192.87.106.251:8080/ShoppingCart/Cart/*
Apr 9, 2010 4:17:43 PM org.apache.tuscany.sca.http.jetty.JettyServer addServletMapping
INFO: Added Servlet mapping: http://192.87.106.251:8080/ShoppingCart/Cart/
Apr 9, 2010 4:17:43 PM org.apache.tuscany.sca.core.assembly.impl.EndpointRegistryImpl addEndpoint
INFO: Add endpoint - (@8374450)Endpoint:  URI = ShoppingCart#service-binding(Cart/Cart)
Apr 9, 2010 4:17:43 PM org.apache.tuscany.sca.http.jetty.JettyServer addServletMapping
INFO: Added Servlet mapping: http://192.87.106.251:8080/ShoppingCart/Total/*
Apr 9, 2010 4:17:43 PM org.apache.tuscany.sca.http.jetty.JettyServer addServletMapping
INFO: Added Servlet mapping: http://192.87.106.251:8080/ShoppingCart/Total
Apr 9, 2010 4:17:43 PM org.apache.tuscany.sca.core.assembly.impl.EndpointRegistryImpl addEndpoint
INFO: Add endpoint - (@21816811)Endpoint:  URI = ShoppingCart#service-binding(Total/Total)
Apr 9, 2010 4:17:43 PM org.apache.tuscany.sca.binding.sca.provider.DefaultSCABindingMapper
<init>
WARNING: Mapped binding for binding.sca is not supported: {http://tuscany.apache.org/xmlns/sca/1.1}binding.rmi
Apr 9, 2010 4:17:43 PM org.apache.tuscany.sca.core.assembly.impl.EndpointRegistryImpl addEndpoint
INFO: Add endpoint - (@31407449)Endpoint:  URI = CurrencyConverter#service-binding(CurrencyConverter/CurrencyConverter)
Apr 9, 2010 4:17:43 PM org.apache.tuscany.sca.core.assembly.impl.EndpointRegistryImpl addEndpoint
INFO: Add endpoint - (@20235775)Endpoint:  URI = StoreClient#service-binding(Shopper/Shopper)
Apr 9, 2010 4:17:43 PM org.jabsorb.serializer.impl.BeanSerializer analyzeBean
INFO: analyzing services.Item
Total: $17.75
Apr 9, 2010 4:17:43 PM org.apache.tuscany.sca.node.impl.NodeImpl stop
INFO: Stopping node: http://tuscany.apache.org/sca/1.1/nodes/default0
Apr 9, 2010 4:17:43 PM org.apache.tuscany.sca.http.jetty.JettyServer removeServletMapping
INFO: Removed Servlet mapping: /store/*
Apr 9, 2010 4:17:43 PM org.apache.tuscany.sca.http.jetty.JettyServer removeServletMapping
INFO: Removed Servlet mapping: /store/store.js
Apr 9, 2010 4:17:43 PM org.apache.tuscany.sca.http.jetty.JettyServer removeServletMapping
INFO: Removed Servlet mapping: /Catalog/*
Apr 9, 2010 4:17:43 PM org.apache.tuscany.sca.http.jetty.JettyServer removeServletMapping
INFO: Removed Servlet mapping: /Catalog
Apr 9, 2010 4:17:43 PM org.apache.tuscany.sca.http.jetty.JettyServer removeServletMapping
INFO: Removed Servlet mapping: /ShoppingCart/Cart/*
Apr 9, 2010 4:17:43 PM org.apache.tuscany.sca.http.jetty.JettyServer removeServletMapping
INFO: Removed Servlet mapping: /ShoppingCart/Cart/
Apr 9, 2010 4:17:43 PM org.apache.tuscany.sca.http.jetty.JettyServer removeServletMapping
INFO: Removed Servlet mapping: /ShoppingCart/Total/*
Apr 9, 2010 4:17:43 PM org.apache.tuscany.sca.http.jetty.JettyServer removeServletMapping
INFO: Removed Servlet mapping: /ShoppingCart/Total
Apr 9, 2010 4:17:43 PM org.apache.tuscany.sca.http.jetty.JettyServer removeServletMapping
INFO: Removed Servlet mapping: /dojo
Apr 9, 2010 4:17:43 PM org.apache.tuscany.sca.http.jetty.JettyServer removeServletMapping
INFO: Removed Servlet mapping: /dojo/*
Apr 9, 2010 4:17:43 PM org.apache.tuscany.sca.http.jetty.JettyServer removeServletMapping
INFO: Removed Servlet mapping: /tuscany
Apr 9, 2010 4:17:43 PM org.apache.tuscany.sca.http.jetty.JettyServer removeServletMapping
INFO: Removed Servlet mapping: /tuscany/*
Tests run: 3, Failures: 0, Errors: 0, Skipped: 2, Time elapsed: 2.693 sec

Results :

Tests run: 3, Failures: 0, Errors: 0, Skipped: 2

[HUDSON] Recording test results
[INFO] [jar:jar {execution: default-jar}]
[INFO] Building jar: <http://hudson.zones.apache.org/hudson/job/Tuscany-2x/ws/sca-2x/samples/store/target/sample-store.jar>
[INFO] [install:install {execution: default-install}]
[INFO] Installing <http://hudson.zones.apache.org/hudson/job/Tuscany-2x/ws/sca-2x/samples/store/target/sample-store.jar>
to /export/home/hudson/.m2/repository/org/apache/tuscany/sca/sample-store/2.0-SNAPSHOT/sample-store-2.0-SNAPSHOT.jar
[HUDSON] Archiving <http://hudson.zones.apache.org/hudson/job/Tuscany-2x/ws/sca-2x/samples/store/pom.xml>
to /export/home/hudson/hudson/jobs/Tuscany-2x/modules/org.apache.tuscany.sca$sample-store/builds/2010-04-09_15-29-12/archive/org.apache.tuscany.sca/sample-store/2.0-SNAPSHOT/pom.xml
[HUDSON] Archiving <http://hudson.zones.apache.org/hudson/job/Tuscany-2x/ws/sca-2x/samples/store/target/sample-store.jar>
to /export/home/hudson/hudson/jobs/Tuscany-2x/modules/org.apache.tuscany.sca$sample-store/builds/2010-04-09_15-29-12/archive/org.apache.tuscany.sca/sample-store/2.0-SNAPSHOT/sample-store.jar
[INFO] ------------------------------------------------------------------------
[INFO] Building Apache Tuscany SCA Sample Getting Started Online Store as WebApp
[INFO]    task-segment: [clean, install]
[INFO] ------------------------------------------------------------------------
[INFO] [clean:clean {execution: default-clean}]
[INFO] Deleting file set: <http://hudson.zones.apache.org/hudson/job/Tuscany-2x/ws/sca-2x/samples/store-webapp/target>
(included: [**], excluded: [])
[INFO] [enforcer:enforce {execution: enforce-plugin-versions}]
[INFO] [resources:resources {execution: default-resources}]
[INFO] Using 'UTF-8' encoding to copy filtered resources.
[INFO] Copying 1 resource
[INFO] Copying 1 resource
[INFO] [compiler:compile {execution: default-compile}]
[INFO] Compiling 8 source files to <http://hudson.zones.apache.org/hudson/job/Tuscany-2x/ws/sca-2x/samples/store-webapp/target/classes>
[INFO] [resources:testResources {execution: default-testResources}]
[INFO] Using 'UTF-8' encoding to copy filtered resources.
[INFO] skip non existing resourceDirectory <http://hudson.zones.apache.org/hudson/job/Tuscany-2x/ws/sca-2x/samples/store-webapp/src/test/resources>
[INFO] [compiler:testCompile {execution: default-testCompile}]
[INFO] No sources to compile
[INFO] [surefire:test {execution: default-test}]
[INFO] No tests to run.
[HUDSON] Recording test results
[INFO] [war:war {execution: default-war}]
[INFO] Packaging webapp
[INFO] Assembling webapp[sample-store-webapp] in [<http://hudson.zones.apache.org/hudson/job/Tuscany-2x/ws/sca-2x/samples/store-webapp/target/sample-store-webapp]>
[INFO] Processing war project
[INFO] Copying webapp resources[<http://hudson.zones.apache.org/hudson/job/Tuscany-2x/ws/sca-2x/samples/store-webapp/src/main/webapp]>
[INFO] Webapp assembled in[352 msecs]
[INFO] Building war: <http://hudson.zones.apache.org/hudson/job/Tuscany-2x/ws/sca-2x/samples/store-webapp/target/sample-store-webapp.war>
[INFO] [install:install {execution: default-install}]
[INFO] Installing <http://hudson.zones.apache.org/hudson/job/Tuscany-2x/ws/sca-2x/samples/store-webapp/target/sample-store-webapp.war>
to /export/home/hudson/.m2/repository/org/apache/tuscany/sca/sample-store-webapp/2.0-SNAPSHOT/sample-store-webapp-2.0-SNAPSHOT.war
[HUDSON] Archiving <http://hudson.zones.apache.org/hudson/job/Tuscany-2x/ws/sca-2x/samples/store-webapp/pom.xml>
to /export/home/hudson/hudson/jobs/Tuscany-2x/modules/org.apache.tuscany.sca$sample-store-webapp/builds/2010-04-09_15-29-12/archive/org.apache.tuscany.sca/sample-store-webapp/2.0-SNAPSHOT/pom.xml
[HUDSON] Archiving <http://hudson.zones.apache.org/hudson/job/Tuscany-2x/ws/sca-2x/samples/store-webapp/target/sample-store-webapp.war>
to /export/home/hudson/hudson/jobs/Tuscany-2x/modules/org.apache.tuscany.sca$sample-store-webapp/builds/2010-04-09_15-29-12/archive/org.apache.tuscany.sca/sample-store-webapp/2.0-SNAPSHOT/sample-store-webapp.war
[INFO] ------------------------------------------------------------------------
[INFO] Building Apache Tuscany SCA Sample Helloworld
[INFO]    task-segment: [clean, install]
[INFO] ------------------------------------------------------------------------
Downloading: http://people.apache.org/repo/m2-ibiblio-rsync-repository/org/mortbay/jetty/maven-jetty-plugin/6.1.18/maven-jetty-plugin-6.1.18.pom
[INFO] Unable to find resource 'org.mortbay.jetty:maven-jetty-plugin:pom:6.1.18' in repository
apache (http://people.apache.org/repo/m2-ibiblio-rsync-repository)
Downloading: http://people.apache.org/repo/m2-incubating-repository/org/mortbay/jetty/maven-jetty-plugin/6.1.18/maven-jetty-plugin-6.1.18.pom
[INFO] Unable to find resource 'org.mortbay.jetty:maven-jetty-plugin:pom:6.1.18' in repository
apache.incubator (http://people.apache.org/repo/m2-incubating-repository)
Downloading: http://repository.apache.org/snapshots/org/mortbay/jetty/maven-jetty-plugin/6.1.18/maven-jetty-plugin-6.1.18.pom
[INFO] Unable to find resource 'org.mortbay.jetty:maven-jetty-plugin:pom:6.1.18' in repository
apache.snapshots (http://repository.apache.org/snapshots)
Downloading: http://snapshots.repository.codehaus.org/org/mortbay/jetty/maven-jetty-plugin/6.1.18/maven-jetty-plugin-6.1.18.pom
[INFO] Unable to find resource 'org.mortbay.jetty:maven-jetty-plugin:pom:6.1.18' in repository
codehaus-snapshot (http://snapshots.repository.codehaus.org)
Downloading: http://repo2.maven.org/maven2/org/mortbay/jetty/maven-jetty-plugin/6.1.18/maven-jetty-plugin-6.1.18.pom

Downloading: http://people.apache.org/repo/m2-ibiblio-rsync-repository/org/mortbay/jetty/project/6.1.18/project-6.1.18.pom
[INFO] Unable to find resource 'org.mortbay.jetty:project:pom:6.1.18' in repository apache
(http://people.apache.org/repo/m2-ibiblio-rsync-repository)
Downloading: http://people.apache.org/repo/m2-incubating-repository/org/mortbay/jetty/project/6.1.18/project-6.1.18.pom
[INFO] Unable to find resource 'org.mortbay.jetty:project:pom:6.1.18' in repository apache.incubator
(http://people.apache.org/repo/m2-incubating-repository)
Downloading: http://repository.apache.org/snapshots/org/mortbay/jetty/project/6.1.18/project-6.1.18.pom
[INFO] Unable to find resource 'org.mortbay.jetty:project:pom:6.1.18' in repository apache.snapshots
(http://repository.apache.org/snapshots)
Downloading: http://snapshots.repository.codehaus.org/org/mortbay/jetty/project/6.1.18/project-6.1.18.pom
[INFO] Unable to find resource 'org.mortbay.jetty:project:pom:6.1.18' in repository codehaus-snapshot
(http://snapshots.repository.codehaus.org)
Downloading: http://repo2.maven.org/maven2/org/mortbay/jetty/project/6.1.18/project-6.1.18.pom

Downloading: http://people.apache.org/repo/m2-ibiblio-rsync-repository/org/mortbay/jetty/maven-jetty-plugin/6.1.18/maven-jetty-plugin-6.1.18.jar
[INFO] Unable to find resource 'org.mortbay.jetty:maven-jetty-plugin:maven-plugin:6.1.18'
in repository apache (http://people.apache.org/repo/m2-ibiblio-rsync-repository)
Downloading: http://people.apache.org/repo/m2-incubating-repository/org/mortbay/jetty/maven-jetty-plugin/6.1.18/maven-jetty-plugin-6.1.18.jar
[INFO] Unable to find resource 'org.mortbay.jetty:maven-jetty-plugin:maven-plugin:6.1.18'
in repository apache.incubator (http://people.apache.org/repo/m2-incubating-repository)
Downloading: http://repository.apache.org/snapshots/org/mortbay/jetty/maven-jetty-plugin/6.1.18/maven-jetty-plugin-6.1.18.jar
[INFO] Unable to find resource 'org.mortbay.jetty:maven-jetty-plugin:maven-plugin:6.1.18'
in repository apache.snapshots (http://repository.apache.org/snapshots)
Downloading: http://snapshots.repository.codehaus.org/org/mortbay/jetty/maven-jetty-plugin/6.1.18/maven-jetty-plugin-6.1.18.jar
[INFO] Unable to find resource 'org.mortbay.jetty:maven-jetty-plugin:maven-plugin:6.1.18'
in repository codehaus-snapshot (http://snapshots.repository.codehaus.org)
Downloading: http://repo2.maven.org/maven2/org/mortbay/jetty/maven-jetty-plugin/6.1.18/maven-jetty-plugin-6.1.18.jar

[INFO] [clean:clean {execution: default-clean}]
[INFO] [enforcer:enforce {execution: enforce-plugin-versions}]
[INFO] [resources:resources {execution: default-resources}]
[INFO] Using 'UTF-8' encoding to copy filtered resources.
[INFO] skip non existing resourceDirectory <http://hudson.zones.apache.org/hudson/job/Tuscany-2x/ws/sca-2x/samples/webapps/helloworld/src/main/resources>
[INFO] Copying 0 resource
[INFO] [compiler:compile {execution: default-compile}]
[INFO] Compiling 2 source files to <http://hudson.zones.apache.org/hudson/job/Tuscany-2x/ws/sca-2x/samples/webapps/helloworld/target/classes>
[INFO] [resources:testResources {execution: default-testResources}]
[INFO] Using 'UTF-8' encoding to copy filtered resources.
[INFO] skip non existing resourceDirectory <http://hudson.zones.apache.org/hudson/job/Tuscany-2x/ws/sca-2x/samples/webapps/helloworld/src/test/resources>
[INFO] [compiler:testCompile {execution: default-testCompile}]
[INFO] No sources to compile
[INFO] [surefire:test {execution: default-test}]
[INFO] No tests to run.
[HUDSON] Recording test results
[INFO] [war:war {execution: default-war}]
[INFO] Packaging webapp
[INFO] Assembling webapp[sample-helloworld-webapp] in [<http://hudson.zones.apache.org/hudson/job/Tuscany-2x/ws/sca-2x/samples/webapps/helloworld/target/helloworld]>
[INFO] Processing war project
[INFO] Copying webapp resources[<http://hudson.zones.apache.org/hudson/job/Tuscany-2x/ws/sca-2x/samples/webapps/helloworld/src/main/webapp]>
[INFO] Webapp assembled in[337 msecs]
[INFO] Building war: <http://hudson.zones.apache.org/hudson/job/Tuscany-2x/ws/sca-2x/samples/webapps/helloworld/target/helloworld.war>
[INFO] [install:install {execution: default-install}]
[INFO] Installing <http://hudson.zones.apache.org/hudson/job/Tuscany-2x/ws/sca-2x/samples/webapps/helloworld/target/helloworld.war>
to /export/home/hudson/.m2/repository/org/apache/tuscany/sca/sample-helloworld-webapp/2.0-SNAPSHOT/sample-helloworld-webapp-2.0-SNAPSHOT.war
[HUDSON] Archiving <http://hudson.zones.apache.org/hudson/job/Tuscany-2x/ws/sca-2x/samples/webapps/helloworld/pom.xml>
to /export/home/hudson/hudson/jobs/Tuscany-2x/modules/org.apache.tuscany.sca$sample-helloworld-webapp/builds/2010-04-09_15-29-12/archive/org.apache.tuscany.sca/sample-helloworld-webapp/2.0-SNAPSHOT/pom.xml
[HUDSON] Archiving <http://hudson.zones.apache.org/hudson/job/Tuscany-2x/ws/sca-2x/samples/webapps/helloworld/target/helloworld.war>
to /export/home/hudson/hudson/jobs/Tuscany-2x/modules/org.apache.tuscany.sca$sample-helloworld-webapp/builds/2010-04-09_15-29-12/archive/org.apache.tuscany.sca/sample-helloworld-webapp/2.0-SNAPSHOT/helloworld.war
[INFO] ------------------------------------------------------------------------
[INFO] Building Apache Tuscany SCA Sample Helloworld BPEL
[INFO]    task-segment: [clean, install]
[INFO] ------------------------------------------------------------------------
[INFO] [clean:clean {execution: default-clean}]
Downloading: http://repo2.maven.org/maven2/org/mortbay/jetty/jetty/6.1.18/jetty-6.1.18.pom

Downloading: http://repo2.maven.org/maven2/org/mortbay/jetty/jetty-util/6.1.18/jetty-util-6.1.18.pom

Downloading: http://repo2.maven.org/maven2/org/mortbay/jetty/jetty-management/6.1.18/jetty-management-6.1.18.pom

Downloading: http://repo2.maven.org/maven2/org/mortbay/jetty/jetty/6.1.18/jetty-6.1.18.jar

Downloading: http://repo2.maven.org/maven2/org/mortbay/jetty/jetty-util/6.1.18/jetty-util-6.1.18.jar

Downloading: http://repo2.maven.org/maven2/org/mortbay/jetty/jetty-management/6.1.18/jetty-management-6.1.18.jar

[INFO] [enforcer:enforce {execution: enforce-plugin-versions}]
[INFO] [resources:resources {execution: default-resources}]
[INFO] Using 'UTF-8' encoding to copy filtered resources.
[INFO] Copying 2 resources
[INFO] Copying 0 resource
[INFO] [compiler:compile {execution: default-compile}]
[INFO] Compiling 1 source file to <http://hudson.zones.apache.org/hudson/job/Tuscany-2x/ws/sca-2x/samples/webapps/helloworld-bpel/target/classes>
[INFO] [dependency:unpack {execution: unpack}]
[INFO] Configured Artifact: org.apache.ode:ode-dao-jpa-ojpa-derby:1.1.1:zip
Downloading: http://repo2.maven.org/maven2/org/apache/ode/ode-dao-jpa-ojpa-derby/1.1.1/ode-dao-jpa-ojpa-derby-1.1.1.zip
106K downloaded  (ode-dao-jpa-ojpa-derby-1.1.1.zip)
[INFO] Unpacking /export/home/hudson/.m2/repository/org/apache/ode/ode-dao-jpa-ojpa-derby/1.1.1/ode-dao-jpa-ojpa-derby-1.1.1.zipto
 <http://hudson.zones.apache.org/hudson/job/Tuscany-2x/ws/sca-2x/samples/webapps/helloworld-bpel/target/classes>
with Includes **/* and excludes:null
[INFO] [resources:testResources {execution: default-testResources}]
[INFO] Using 'UTF-8' encoding to copy filtered resources.
[INFO] skip non existing resourceDirectory <http://hudson.zones.apache.org/hudson/job/Tuscany-2x/ws/sca-2x/samples/webapps/helloworld-bpel/src/test/resources>
[INFO] [compiler:testCompile {execution: default-testCompile}]
[INFO] No sources to compile
[INFO] [surefire:test {execution: default-test}]
[INFO] No tests to run.
[HUDSON] Recording test results
[INFO] [war:war {execution: default-war}]
[INFO] Packaging webapp
[INFO] Assembling webapp[sample-helloworld-bpel-webapp] in [<http://hudson.zones.apache.org/hudson/job/Tuscany-2x/ws/sca-2x/samples/webapps/helloworld-bpel/target/helloworld-bpel]>
[INFO] Processing war project
[INFO] Copying webapp resources[<http://hudson.zones.apache.org/hudson/job/Tuscany-2x/ws/sca-2x/samples/webapps/helloworld-bpel/src/main/webapp]>
[INFO] Webapp assembled in[3418 msecs]
[INFO] Building war: <http://hudson.zones.apache.org/hudson/job/Tuscany-2x/ws/sca-2x/samples/webapps/helloworld-bpel/target/helloworld-bpel.war>
[INFO] [install:install {execution: default-install}]
[INFO] Installing <http://hudson.zones.apache.org/hudson/job/Tuscany-2x/ws/sca-2x/samples/webapps/helloworld-bpel/target/helloworld-bpel.war>
to /export/home/hudson/.m2/repository/org/apache/tuscany/sca/sample-helloworld-bpel-webapp/2.0-SNAPSHOT/sample-helloworld-bpel-webapp-2.0-SNAPSHOT.war
[HUDSON] Archiving <http://hudson.zones.apache.org/hudson/job/Tuscany-2x/ws/sca-2x/samples/webapps/helloworld-bpel/pom.xml>
to /export/home/hudson/hudson/jobs/Tuscany-2x/modules/org.apache.tuscany.sca$sample-helloworld-bpel-webapp/builds/2010-04-09_15-29-12/archive/org.apache.tuscany.sca/sample-helloworld-bpel-webapp/2.0-SNAPSHOT/pom.xml
[HUDSON] Archiving <http://hudson.zones.apache.org/hudson/job/Tuscany-2x/ws/sca-2x/samples/webapps/helloworld-bpel/target/helloworld-bpel.war>
to /export/home/hudson/hudson/jobs/Tuscany-2x/modules/org.apache.tuscany.sca$sample-helloworld-bpel-webapp/builds/2010-04-09_15-29-12/archive/org.apache.tuscany.sca/sample-helloworld-bpel-webapp/2.0-SNAPSHOT/helloworld-bpel.war
ERROR: Failed to parse POMs
hudson.util.IOException2: Failed to join the process
	at hudson.Proc$RemoteProc.join(Proc.java:312)
	at hudson.maven.ProcessCache$MavenProcess.call(ProcessCache.java:164)
	at hudson.maven.MavenModuleSetBuild$RunnerImpl.doRun(MavenModuleSetBuild.java:480)
	at hudson.model.AbstractBuild$AbstractRunner.run(AbstractBuild.java:416)
	at hudson.model.Run.run(Run.java:1243)
	at hudson.maven.MavenModuleSetBuild.run(MavenModuleSetBuild.java:304)
	at hudson.model.ResourceController.execute(ResourceController.java:88)
	at hudson.model.Executor.run(Executor.java:122)
Caused by: java.util.concurrent.ExecutionException: hudson.remoting.RequestAbortedException:
java.io.EOFException
	at hudson.remoting.Request$1.get(Request.java:218)
	at hudson.remoting.Request$1.get(Request.java:172)
	at hudson.remoting.FutureAdapter.get(FutureAdapter.java:55)
	at hudson.Proc$RemoteProc.join(Proc.java:304)
	... 7 more
Caused by: hudson.remoting.RequestAbortedException: java.io.EOFException
	at hudson.remoting.Request.abort(Request.java:257)
	at hudson.remoting.Channel.terminate(Channel.java:598)
	at hudson.remoting.Channel$ReaderThread.run(Channel.java:876)
Caused by: java.io.EOFException
	at java.io.ObjectInputStream$BlockDataInputStream.peekByte(ObjectInputStream.java:2554)
	at java.io.ObjectInputStream.readObject0(ObjectInputStream.java:1297)
	at java.io.ObjectInputStream.readObject(ObjectInputStream.java:351)
	at hudson.remoting.Channel$ReaderThread.run(Channel.java:856)
FATAL: channel is already closed
hudson.remoting.ChannelClosedException: channel is already closed
	at hudson.remoting.Channel.send(Channel.java:412)
	at hudson.remoting.Request.call(Request.java:105)
	at hudson.remoting.Channel.call(Channel.java:551)
	at hudson.Launcher$RemoteLauncher.kill(Launcher.java:735)
	at hudson.model.AbstractBuild$AbstractRunner.run(AbstractBuild.java:421)
	at hudson.model.Run.run(Run.java:1243)
	at hudson.maven.MavenModuleSetBuild.run(MavenModuleSetBuild.java:304)
	at hudson.model.ResourceController.execute(ResourceController.java:88)
	at hudson.model.Executor.run(Executor.java:122)


Mime
View raw message