tuscany-commits mailing list archives

Site index · List index
Message view « Date » · « Thread »
Top « Date » · « Thread »
From Apache Hudson Server <hud...@hudson.zones.apache.org>
Subject Build failed in Hudson: Tuscany-2.x-M5-Brn #6
Date Wed, 02 Jun 2010 09:02:52 GMT
See <http://hudson.zones.apache.org/hudson/job/Tuscany-2.x-M5-Brn/6/changes>

Changes:

[antelder] Update plugin version to match branch version

------------------------------------------
[...truncated 4680 lines...]
[INFO] Copying 2 resources
[INFO] Copying 3 resources
[INFO] [compiler:compile {execution: default-compile}]
[INFO] Compiling 6 source files to <http://hudson.zones.apache.org/hudson/job/Tuscany-2.x-M5-Brn/ws/sca-2x/modules/implementation-web-runtime/target/classes>
[INFO] [resources:testResources {execution: default-testResources}]
[INFO] Using 'UTF-8' encoding to copy filtered resources.
[INFO] Copying 0 resource
[INFO] [compiler:testCompile {execution: default-testCompile}]
[INFO] Nothing to compile - all classes are up to date
[INFO] [surefire:test {execution: default-test}]
[INFO] Surefire report directory: <http://hudson.zones.apache.org/hudson/job/Tuscany-2.x-M5-Brn/ws/sca-2x/modules/implementation-web-runtime/target/surefire-reports>

-------------------------------------------------------
 T E S T S
-------------------------------------------------------
There are no tests to run.

Results :

Tests run: 0, Failures: 0, Errors: 0, Skipped: 0

[HUDSON] Recording test results
[INFO] [jar:jar {execution: default-jar}]
[INFO] Building jar: <http://hudson.zones.apache.org/hudson/job/Tuscany-2.x-M5-Brn/ws/sca-2x/modules/implementation-web-runtime/target/tuscany-implementation-web-runtime-2.0-M5-SNAPSHOT.jar>
[INFO] [install:install {execution: default-install}]
[INFO] Installing <http://hudson.zones.apache.org/hudson/job/Tuscany-2.x-M5-Brn/ws/sca-2x/modules/implementation-web-runtime/target/tuscany-implementation-web-runtime-2.0-M5-SNAPSHOT.jar>
to /home/hudson/.m2/repository/org/apache/tuscany/sca/tuscany-implementation-web-runtime/2.0-M5-SNAPSHOT/tuscany-implementation-web-runtime-2.0-M5-SNAPSHOT.jar
[HUDSON] Archiving <http://hudson.zones.apache.org/hudson/job/Tuscany-2.x-M5-Brn/ws/sca-2x/modules/implementation-web-runtime/pom.xml>
to /export/home/hudson/hudson/jobs/Tuscany-2.x-M5-Brn/modules/org.apache.tuscany.sca$tuscany-implementation-web-runtime/builds/2010-06-02_08-53-55/archive/org.apache.tuscany.sca/tuscany-implementation-web-runtime/2.0-M5-SNAPSHOT/pom.xml
[HUDSON] Archiving <http://hudson.zones.apache.org/hudson/job/Tuscany-2.x-M5-Brn/ws/sca-2x/modules/implementation-web-runtime/target/tuscany-implementation-web-runtime-2.0-M5-SNAPSHOT.jar>
to /export/home/hudson/hudson/jobs/Tuscany-2.x-M5-Brn/modules/org.apache.tuscany.sca$tuscany-implementation-web-runtime/builds/2010-06-02_08-53-55/archive/org.apache.tuscany.sca/tuscany-implementation-web-runtime/2.0-M5-SNAPSHOT/tuscany-implementation-web-runtime-2.0-M5-SNAPSHOT.jar
[INFO] ------------------------------------------------------------------------
[INFO] Building Apache Tuscany SCA Launcher
[INFO]    task-segment: [clean, install]
[INFO] ------------------------------------------------------------------------
[INFO] [clean:clean {execution: default-clean}]
[INFO] Deleting <http://hudson.zones.apache.org/hudson/job/Tuscany-2.x-M5-Brn/ws/sca-2x/modules/launcher/target>
[INFO] [enforcer:enforce {execution: enforce-plugin-versions}]
[INFO] [resources:resources {execution: default-resources}]
[INFO] Using 'UTF-8' encoding to copy filtered resources.
[INFO] Copying 0 resource
[INFO] Copying 3 resources
[INFO] [compiler:compile {execution: default-compile}]
[INFO] Compiling 1 source file to <http://hudson.zones.apache.org/hudson/job/Tuscany-2.x-M5-Brn/ws/sca-2x/modules/launcher/target/classes>
[INFO] [resources:testResources {execution: default-testResources}]
[INFO] Using 'UTF-8' encoding to copy filtered resources.
[INFO] skip non existing resourceDirectory <http://hudson.zones.apache.org/hudson/job/Tuscany-2.x-M5-Brn/ws/sca-2x/modules/launcher/src/test/resources>
[INFO] [compiler:testCompile {execution: default-testCompile}]
[INFO] Nothing to compile - all classes are up to date
[INFO] [surefire:test {execution: default-test}]
[INFO] No tests to run.
[HUDSON] Recording test results
[INFO] [jar:jar {execution: default-jar}]
[INFO] Building jar: <http://hudson.zones.apache.org/hudson/job/Tuscany-2.x-M5-Brn/ws/sca-2x/modules/launcher/target/tuscany-launcher-2.0-M5-SNAPSHOT.jar>
[INFO] [install:install {execution: default-install}]
[INFO] Installing <http://hudson.zones.apache.org/hudson/job/Tuscany-2.x-M5-Brn/ws/sca-2x/modules/launcher/target/tuscany-launcher-2.0-M5-SNAPSHOT.jar>
to /home/hudson/.m2/repository/org/apache/tuscany/sca/tuscany-launcher/2.0-M5-SNAPSHOT/tuscany-launcher-2.0-M5-SNAPSHOT.jar
[HUDSON] Archiving <http://hudson.zones.apache.org/hudson/job/Tuscany-2.x-M5-Brn/ws/sca-2x/modules/launcher/pom.xml>
to /export/home/hudson/hudson/jobs/Tuscany-2.x-M5-Brn/modules/org.apache.tuscany.sca$tuscany-launcher/builds/2010-06-02_08-53-55/archive/org.apache.tuscany.sca/tuscany-launcher/2.0-M5-SNAPSHOT/pom.xml
[HUDSON] Archiving <http://hudson.zones.apache.org/hudson/job/Tuscany-2.x-M5-Brn/ws/sca-2x/modules/launcher/target/tuscany-launcher-2.0-M5-SNAPSHOT.jar>
to /export/home/hudson/hudson/jobs/Tuscany-2.x-M5-Brn/modules/org.apache.tuscany.sca$tuscany-launcher/builds/2010-06-02_08-53-55/archive/org.apache.tuscany.sca/tuscany-launcher/2.0-M5-SNAPSHOT/tuscany-launcher-2.0-M5-SNAPSHOT.jar
[INFO] ------------------------------------------------------------------------
[INFO] Building Apache Tuscany SCA Apache Wink JAX-RS Integration
[INFO]    task-segment: [clean, install]
[INFO] ------------------------------------------------------------------------
[INFO] [clean:clean {execution: default-clean}]
[INFO] Deleting <http://hudson.zones.apache.org/hudson/job/Tuscany-2.x-M5-Brn/ws/sca-2x/modules/wink/target>
[INFO] [enforcer:enforce {execution: enforce-plugin-versions}]
[INFO] [resources:resources {execution: default-resources}]
[INFO] Using 'UTF-8' encoding to copy filtered resources.
[INFO] Copying 0 resource
[INFO] Copying 3 resources
[INFO] [compiler:compile {execution: default-compile}]
[INFO] Compiling 4 source files to <http://hudson.zones.apache.org/hudson/job/Tuscany-2.x-M5-Brn/ws/sca-2x/modules/wink/target/classes>
[INFO] [resources:testResources {execution: default-testResources}]
[INFO] Using 'UTF-8' encoding to copy filtered resources.
[INFO] skip non existing resourceDirectory <http://hudson.zones.apache.org/hudson/job/Tuscany-2.x-M5-Brn/ws/sca-2x/modules/wink/src/test/resources>
[INFO] [compiler:testCompile {execution: default-testCompile}]
[INFO] No sources to compile
[INFO] [surefire:test {execution: default-test}]
[INFO] No tests to run.
[HUDSON] Recording test results
[INFO] [jar:jar {execution: default-jar}]
[INFO] Building jar: <http://hudson.zones.apache.org/hudson/job/Tuscany-2.x-M5-Brn/ws/sca-2x/modules/wink/target/tuscany-wink-2.0-M5-SNAPSHOT.jar>
[INFO] [install:install {execution: default-install}]
[INFO] Installing <http://hudson.zones.apache.org/hudson/job/Tuscany-2.x-M5-Brn/ws/sca-2x/modules/wink/target/tuscany-wink-2.0-M5-SNAPSHOT.jar>
to /home/hudson/.m2/repository/org/apache/tuscany/sca/tuscany-wink/2.0-M5-SNAPSHOT/tuscany-wink-2.0-M5-SNAPSHOT.jar
[HUDSON] Archiving <http://hudson.zones.apache.org/hudson/job/Tuscany-2.x-M5-Brn/ws/sca-2x/modules/wink/pom.xml>
to /export/home/hudson/hudson/jobs/Tuscany-2.x-M5-Brn/modules/org.apache.tuscany.sca$tuscany-wink/builds/2010-06-02_08-53-55/archive/org.apache.tuscany.sca/tuscany-wink/2.0-M5-SNAPSHOT/pom.xml
[HUDSON] Archiving <http://hudson.zones.apache.org/hudson/job/Tuscany-2.x-M5-Brn/ws/sca-2x/modules/wink/target/tuscany-wink-2.0-M5-SNAPSHOT.jar>
to /export/home/hudson/hudson/jobs/Tuscany-2.x-M5-Brn/modules/org.apache.tuscany.sca$tuscany-wink/builds/2010-06-02_08-53-55/archive/org.apache.tuscany.sca/tuscany-wink/2.0-M5-SNAPSHOT/tuscany-wink-2.0-M5-SNAPSHOT.jar
[INFO] ------------------------------------------------------------------------
[INFO] Building Apache Tuscany SCA Base Jar
[INFO]    task-segment: [clean, install]
[INFO] ------------------------------------------------------------------------
[INFO] [clean:clean {execution: default-clean}]
[INFO] Deleting <http://hudson.zones.apache.org/hudson/job/Tuscany-2.x-M5-Brn/ws/sca-2x/shades/base/target>
[INFO] snapshot org.apache.tuscany.sca:tuscany-stripes:2.0-M5-SNAPSHOT: checking for updates
from apache.snapshots
[INFO] snapshot org.apache.tuscany.sca:tuscany-binding-rmi-runtime:2.0-M5-SNAPSHOT: checking
for updates from apache.snapshots
[INFO] snapshot org.apache.tuscany.sca:tuscany-binding-rmi:2.0-M5-SNAPSHOT: checking for updates
from apache.snapshots
[INFO] snapshot org.apache.tuscany.sca:tuscany-host-rmi:2.0-M5-SNAPSHOT: checking for updates
from apache.snapshots
[INFO] snapshot org.apache.tuscany.sca:tuscany-contribution-osgi:2.0-M5-SNAPSHOT: checking
for updates from apache.snapshots
[INFO] snapshot org.apache.tuscany.sca:tuscany-implementation-osgi-runtime:2.0-M5-SNAPSHOT:
checking for updates from apache.snapshots
[INFO] snapshot org.apache.tuscany.sca:tuscany-implementation-osgi:2.0-M5-SNAPSHOT: checking
for updates from apache.snapshots
[INFO] snapshot org.apache.tuscany.sca:tuscany-node-impl-osgi:2.0-M5-SNAPSHOT: checking for
updates from apache.snapshots
[INFO] snapshot org.apache.tuscany.sca:tuscany-extensibility-equinox:2.0-M5-SNAPSHOT: checking
for updates from apache.snapshots
[INFO] snapshot org.apache.tuscany.sca:tuscany-node-launcher-equinox:2.0-M5-SNAPSHOT: checking
for updates from apache.snapshots
[INFO] snapshot org.apache.tuscany.sca:tuscany-monitor:2.0-M5-SNAPSHOT: checking for updates
from apache.snapshots
[INFO] snapshot org.apache.tuscany.sca:tuscany-extensibility:2.0-M5-SNAPSHOT: checking for
updates from apache.snapshots
[INFO] snapshot org.apache.tuscany.sca:tuscany-contribution:2.0-M5-SNAPSHOT: checking for
updates from apache.snapshots
[INFO] ------------------------------------------------------------------------
[ERROR] FATAL ERROR
[INFO] ------------------------------------------------------------------------
[INFO] Unable to call isArchivingDisabled. Invalid object ID 25
[INFO] ------------------------------------------------------------------------
[INFO] Trace
java.lang.IllegalStateException: Unable to call isArchivingDisabled. Invalid object ID 25
	at hudson.remoting.RemoteInvocationHandler$RPCRequest.perform(RemoteInvocationHandler.java:268)
	at hudson.remoting.RemoteInvocationHandler$RPCRequest.call(RemoteInvocationHandler.java:255)
	at hudson.remoting.RemoteInvocationHandler$RPCRequest.call(RemoteInvocationHandler.java:215)
	at hudson.remoting.UserRequest.perform(UserRequest.java:114)
	at hudson.remoting.UserRequest.perform(UserRequest.java:48)
	at hudson.remoting.Request$2.run(Request.java:270)
	at java.util.concurrent.Executors$RunnableAdapter.call(Executors.java:441)
	at java.util.concurrent.FutureTask$Sync.innerRun(FutureTask.java:303)
	at java.util.concurrent.FutureTask.run(FutureTask.java:138)
	at java.util.concurrent.ThreadPoolExecutor$Worker.runTask(ThreadPoolExecutor.java:885)
	at java.util.concurrent.ThreadPoolExecutor$Worker.run(ThreadPoolExecutor.java:907)
	at java.lang.Thread.run(Thread.java:619)
[INFO] ------------------------------------------------------------------------
[INFO] Total time: 7 minutes 47 seconds
[INFO] Finished at: Wed Jun 02 09:01:57 UTC 2010
[INFO] Final Memory: 42M/716M
[INFO] ------------------------------------------------------------------------
[INFO] snapshot org.apache.tuscany.sca:tuscany-core:2.0-M5-SNAPSHOT: checking for updates
from apache.snapshots
-----------------------------------------------------
this realm = plexus.core.maven
Number of imports: 0
-----------------------------------------------------
[WARNING] repository metadata for: 'snapshot org.apache.tuscany.sca:tuscany-core:2.0-M5-SNAPSHOT'
could not be retrieved from repository: apache.snapshots due to an error: Unsupported Protocol:
'http': Cannot find wagon which supports the requested protocol: http
[INFO] Repository 'apache.snapshots' will be blacklisted
Waiting for Hudson to finish collecting data
channel stopped
ERROR: Aborted Maven execution for InterruptedException
java.lang.InterruptedException
	at java.lang.Object.wait(Native Method)
	at hudson.remoting.Request.call(Request.java:122)
	at hudson.remoting.Channel.call(Channel.java:551)
	at hudson.maven.ProcessCache$MavenProcess.call(ProcessCache.java:156)
	at hudson.maven.MavenModuleSetBuild$RunnerImpl.doRun(MavenModuleSetBuild.java:480)
	at hudson.model.AbstractBuild$AbstractRunner.run(AbstractBuild.java:416)
	at hudson.model.Run.run(Run.java:1243)
	at hudson.maven.MavenModuleSetBuild.run(MavenModuleSetBuild.java:304)
	at hudson.model.ResourceController.execute(ResourceController.java:88)
	at hudson.model.Executor.run(Executor.java:122)
FATAL: Failed to serialize hudson.model.Actionable#actions for class hudson.maven.MavenBuild
java.lang.RuntimeException: Failed to serialize hudson.model.Actionable#actions for class
hudson.maven.MavenBuild
	at hudson.util.RobustReflectionConverter$2.writeField(RobustReflectionConverter.java:164)
	at hudson.util.RobustReflectionConverter$2.visit(RobustReflectionConverter.java:135)
	at com.thoughtworks.xstream.converters.reflection.PureJavaReflectionProvider.visitSerializableFields(PureJavaReflectionProvider.java:130)
	at hudson.util.RobustReflectionConverter.doMarshal(RobustReflectionConverter.java:120)
	at hudson.util.RobustReflectionConverter.marshal(RobustReflectionConverter.java:94)
	at com.thoughtworks.xstream.core.AbstractReferenceMarshaller.convert(AbstractReferenceMarshaller.java:68)
	at com.thoughtworks.xstream.core.TreeMarshaller.convertAnother(TreeMarshaller.java:78)
	at com.thoughtworks.xstream.core.TreeMarshaller.convertAnother(TreeMarshaller.java:63)
	at com.thoughtworks.xstream.core.TreeMarshaller.start(TreeMarshaller.java:98)
	at com.thoughtworks.xstream.core.AbstractTreeMarshallingStrategy.marshal(AbstractTreeMarshallingStrategy.java:38)
	at com.thoughtworks.xstream.XStream.marshal(XStream.java:840)
	at com.thoughtworks.xstream.XStream.marshal(XStream.java:829)
	at com.thoughtworks.xstream.XStream.toXML(XStream.java:804)
	at hudson.XmlFile.write(XmlFile.java:165)
	at hudson.model.Run.save(Run.java:1373)
	at hudson.maven.MavenModuleSetBuild$RunnerImpl.post2(MavenModuleSetBuild.java:592)
	at hudson.model.AbstractBuild$AbstractRunner.post(AbstractBuild.java:528)
	at hudson.model.Run.run(Run.java:1266)
	at hudson.maven.MavenModuleSetBuild.run(MavenModuleSetBuild.java:304)
	at hudson.model.ResourceController.execute(ResourceController.java:88)
	at hudson.model.Executor.run(Executor.java:122)
Caused by: java.lang.RuntimeException: Failed to serialize hudson.tasks.test.AbstractTestResultAction#descriptions
for class hudson.maven.reporters.SurefireReport
	at hudson.util.RobustReflectionConverter$2.writeField(RobustReflectionConverter.java:164)
	at hudson.util.RobustReflectionConverter$2.visit(RobustReflectionConverter.java:135)
	at com.thoughtworks.xstream.converters.reflection.PureJavaReflectionProvider.visitSerializableFields(PureJavaReflectionProvider.java:130)
	at hudson.util.RobustReflectionConverter.doMarshal(RobustReflectionConverter.java:120)
	at hudson.util.RobustReflectionConverter.marshal(RobustReflectionConverter.java:94)
	at com.thoughtworks.xstream.core.AbstractReferenceMarshaller.convert(AbstractReferenceMarshaller.java:68)
	at com.thoughtworks.xstream.core.TreeMarshaller.convertAnother(TreeMarshaller.java:78)
	at com.thoughtworks.xstream.core.TreeMarshaller.convertAnother(TreeMarshaller.java:63)
	at com.thoughtworks.xstream.converters.collections.AbstractCollectionConverter.writeItem(AbstractCollectionConverter.java:64)
	at com.thoughtworks.xstream.converters.collections.CollectionConverter.marshal(CollectionConverter.java:55)
	at com.thoughtworks.xstream.core.AbstractReferenceMarshaller.convert(AbstractReferenceMarshaller.java:68)
	at com.thoughtworks.xstream.core.TreeMarshaller.convertAnother(TreeMarshaller.java:78)
	at com.thoughtworks.xstream.core.TreeMarshaller.convertAnother(TreeMarshaller.java:63)
	at hudson.util.RobustReflectionConverter.marshallField(RobustReflectionConverter.java:172)
	at hudson.util.RobustReflectionConverter$2.writeField(RobustReflectionConverter.java:160)
	... 20 more
Caused by: com.thoughtworks.xstream.converters.ConversionException: Could not call java.util.concurrent.ConcurrentHashMap.writeObject()
: Failed to serialize java.util.concurrent.locks.ReentrantLock#sync for class java.util.concurrent.ConcurrentHashMap$Segment
---- Debugging information ----
message             : Could not call java.util.concurrent.ConcurrentHashMap.writeObject()
cause-exception     : java.lang.RuntimeException
cause-message       : Failed to serialize java.util.concurrent.locks.ReentrantLock#sync for
class java.util.concurrent.ConcurrentHashMap$Segment
-------------------------------
	at com.thoughtworks.xstream.converters.reflection.SerializationMethodInvoker.callWriteObject(SerializationMethodInvoker.java:104)
	at com.thoughtworks.xstream.converters.reflection.SerializableConverter.doMarshal(SerializableConverter.java:215)
	at com.thoughtworks.xstream.converters.reflection.AbstractReflectionConverter.marshal(AbstractReflectionConverter.java:58)
	at com.thoughtworks.xstream.core.AbstractReferenceMarshaller.convert(AbstractReferenceMarshaller.java:68)
	at com.thoughtworks.xstream.core.TreeMarshaller.convertAnother(TreeMarshaller.java:78)
	at com.thoughtworks.xstream.core.TreeMarshaller.convertAnother(TreeMarshaller.java:63)
	at hudson.util.RobustReflectionConverter.marshallField(RobustReflectionConverter.java:172)
	at hudson.util.RobustReflectionConverter$2.writeField(RobustReflectionConverter.java:160)
	... 34 more
Caused by: java.lang.RuntimeException: Failed to serialize java.util.concurrent.locks.ReentrantLock#sync
for class java.util.concurrent.ConcurrentHashMap$Segment
	at hudson.util.RobustReflectionConverter$2.writeField(RobustReflectionConverter.java:164)
	at hudson.util.RobustReflectionConverter$2.visit(RobustReflectionConverter.java:135)
	at com.thoughtworks.xstream.converters.reflection.PureJavaReflectionProvider.visitSerializableFields(PureJavaReflectionProvider.java:130)
	at hudson.util.RobustReflectionConverter.doMarshal(RobustReflectionConverter.java:120)
	at hudson.util.RobustReflectionConverter.marshal(RobustReflectionConverter.java:94)
	at com.thoughtworks.xstream.core.AbstractReferenceMarshaller.convert(AbstractReferenceMarshaller.java:68)
	at com.thoughtworks.xstream.core.TreeMarshaller.convertAnother(TreeMarshaller.java:78)
	at com.thoughtworks.xstream.core.TreeMarshaller.convertAnother(TreeMarshaller.java:63)
	at com.thoughtworks.xstream.converters.collections.AbstractCollectionConverter.writeItem(AbstractCollectionConverter.java:64)
	at com.thoughtworks.xstream.converters.collections.ArrayConverter.marshal(ArrayConverter.java:45)
	at com.thoughtworks.xstream.core.AbstractReferenceMarshaller.convert(AbstractReferenceMarshaller.java:68)
	at com.thoughtworks.xstream.core.TreeMarshaller.convertAnother(TreeMarshaller.java:78)
	at com.thoughtworks.xstream.core.TreeMarshaller.convertAnother(TreeMarshaller.java:63)
	at com.thoughtworks.xstream.converters.reflection.SerializableConverter$1.defaultWriteObject(SerializableConverter.java:176)
	at com.thoughtworks.xstream.core.util.CustomObjectOutputStream.defaultWriteObject(CustomObjectOutputStream.java:80)
	at java.util.concurrent.ConcurrentHashMap.writeObject(ConcurrentHashMap.java:1237)
	at sun.reflect.GeneratedMethodAccessor357.invoke(Unknown Source)
	at sun.reflect.DelegatingMethodAccessorImpl.invoke(DelegatingMethodAccessorImpl.java:25)
	at java.lang.reflect.Method.invoke(Method.java:597)
	at com.thoughtworks.xstream.converters.reflection.SerializationMethodInvoker.callWriteObject(SerializationMethodInvoker.java:100)
	... 41 more
Caused by: com.thoughtworks.xstream.io.StreamException:  : null
	at com.thoughtworks.xstream.core.util.QuickWriter.flush(QuickWriter.java:73)
	at com.thoughtworks.xstream.core.util.QuickWriter.write(QuickWriter.java:37)
	at com.thoughtworks.xstream.io.xml.PrettyPrintWriter.endNode(PrettyPrintWriter.java:283)
	at com.thoughtworks.xstream.io.WriterWrapper.endNode(WriterWrapper.java:37)
	at com.thoughtworks.xstream.io.path.PathTrackingWriter.endNode(PathTrackingWriter.java:48)
	at com.thoughtworks.xstream.converters.reflection.SerializableConverter.doMarshal(SerializableConverter.java:225)
	at com.thoughtworks.xstream.converters.reflection.AbstractReflectionConverter.marshal(AbstractReflectionConverter.java:58)
	at com.thoughtworks.xstream.core.AbstractReferenceMarshaller.convert(AbstractReferenceMarshaller.java:68)
	at com.thoughtworks.xstream.core.TreeMarshaller.convertAnother(TreeMarshaller.java:78)
	at com.thoughtworks.xstream.core.TreeMarshaller.convertAnother(TreeMarshaller.java:63)
	at hudson.util.RobustReflectionConverter.marshallField(RobustReflectionConverter.java:172)
	at hudson.util.RobustReflectionConverter$2.writeField(RobustReflectionConverter.java:160)
	... 60 more
Caused by: java.io.InterruptedIOException
	at java.io.FileOutputStream.writeBytes(Native Method)
	at java.io.FileOutputStream.write(FileOutputStream.java:260)
	at sun.nio.cs.StreamEncoder.writeBytes(StreamEncoder.java:202)
	at sun.nio.cs.StreamEncoder.implFlushBuffer(StreamEncoder.java:272)
	at sun.nio.cs.StreamEncoder.implFlush(StreamEncoder.java:276)
	at sun.nio.cs.StreamEncoder.flush(StreamEncoder.java:122)
	at java.io.OutputStreamWriter.flush(OutputStreamWriter.java:212)
	at java.io.BufferedWriter.flush(BufferedWriter.java:236)
	at hudson.util.AtomicFileWriter.flush(AtomicFileWriter.java:90)
	at com.thoughtworks.xstream.core.util.QuickWriter.flush(QuickWriter.java:71)
	... 71 more


Mime
View raw message