tuscany-commits mailing list archives

Site index · List index
Message view « Date » · « Thread »
Top « Date » · « Thread »
From Apache Hudson Server <hud...@hudson.apache.org>
Subject Build failed in Hudson: Tuscany-2x » Apache Tuscany SCA iTest Callback Using Separate Thread #15
Date Fri, 10 Dec 2010 21:33:39 GMT
See <https://hudson.apache.org/hudson/job/Tuscany-2x/org.apache.tuscany.sca$itest-callback-separatethread/15/>

------------------------------------------
[INFO] ------------------------------------------------------------------------
[INFO] Building Apache Tuscany SCA iTest Callback Using Separate Thread
[INFO]    task-segment: [clean, install]
[INFO] ------------------------------------------------------------------------
[INFO] [clean:clean]
[INFO] [enforcer:enforce {execution: enforce-plugin-versions}]
[INFO] [remote-resources:process {execution: default}]
[INFO] [resources:resources]
[INFO] Using 'UTF-8' encoding to copy filtered resources.
[INFO] Copying 1 resource
[INFO] Copying 0 resource
[INFO] Copying 3 resources
[INFO] [compiler:compile]
[INFO] Compiling 5 source files to <https://hudson.apache.org/hudson/job/Tuscany-2x/org.apache.tuscany.sca$itest-callback-separatethread/ws/target/classes>
[INFO] -------------------------------------------------------------
[ERROR] COMPILATION ERROR : 
[INFO] -------------------------------------------------------------
[ERROR] <https://hudson.apache.org/hudson/job/Tuscany-2x/org.apache.tuscany.sca$itest-callback-separatethread/ws/src/main/java/org/apache/tuscany/sca/itest/EventProcessorServiceImpl.java>:[28,24]
package org.oasisopen.sca does not exist

[ERROR] <https://hudson.apache.org/hudson/job/Tuscany-2x/org.apache.tuscany.sca$itest-callback-separatethread/ws/src/main/java/org/apache/tuscany/sca/itest/EventProcessorServiceImpl.java>:[29,35]
package org.oasisopen.sca.annotation does not exist

[ERROR] <https://hudson.apache.org/hudson/job/Tuscany-2x/org.apache.tuscany.sca$itest-callback-separatethread/ws/src/main/java/org/apache/tuscany/sca/itest/EventProcessorServiceImpl.java>:[30,35]
package org.oasisopen.sca.annotation does not exist

[ERROR] <https://hudson.apache.org/hudson/job/Tuscany-2x/org.apache.tuscany.sca$itest-callback-separatethread/ws/src/main/java/org/apache/tuscany/sca/itest/EventProcessorServiceImpl.java>:[31,35]
package org.oasisopen.sca.annotation does not exist

[ERROR] <https://hudson.apache.org/hudson/job/Tuscany-2x/org.apache.tuscany.sca$itest-callback-separatethread/ws/src/main/java/org/apache/tuscany/sca/itest/EventProcessorServiceImpl.java>:[32,35]
package org.oasisopen.sca.annotation does not exist

[ERROR] <https://hudson.apache.org/hudson/job/Tuscany-2x/org.apache.tuscany.sca$itest-callback-separatethread/ws/src/main/java/org/apache/tuscany/sca/itest/EventProcessorService.java>:[22,35]
package org.oasisopen.sca.annotation does not exist

[ERROR] <https://hudson.apache.org/hudson/job/Tuscany-2x/org.apache.tuscany.sca$itest-callback-separatethread/ws/src/main/java/org/apache/tuscany/sca/itest/EventProcessorService.java>:[23,35]
package org.oasisopen.sca.annotation does not exist

[ERROR] <https://hudson.apache.org/hudson/job/Tuscany-2x/org.apache.tuscany.sca$itest-callback-separatethread/ws/src/main/java/org/apache/tuscany/sca/itest/EventProcessorService.java>:[28,1]
cannot find symbol
symbol: class Callback
@Callback(EventProcessorCallBack.class)

[ERROR] <https://hudson.apache.org/hudson/job/Tuscany-2x/org.apache.tuscany.sca$itest-callback-separatethread/ws/src/main/java/org/apache/tuscany/sca/itest/EventProcessorService.java>:[29,1]
cannot find symbol
symbol: class Remotable
@Remotable

[ERROR] <https://hudson.apache.org/hudson/job/Tuscany-2x/org.apache.tuscany.sca$itest-callback-separatethread/ws/src/main/java/org/apache/tuscany/sca/itest/EventProcessorServiceImpl.java>:[37,1]
cannot find symbol
symbol: class Service
@Service(EventProcessorService.class)

[ERROR] <https://hudson.apache.org/hudson/job/Tuscany-2x/org.apache.tuscany.sca$itest-callback-separatethread/ws/src/main/java/org/apache/tuscany/sca/itest/EventProcessorServiceImpl.java>:[38,1]
cannot find symbol
symbol: class Scope
@Scope("COMPOSITE")

[ERROR] <https://hudson.apache.org/hudson/job/Tuscany-2x/org.apache.tuscany.sca$itest-callback-separatethread/ws/src/main/java/org/apache/tuscany/sca/itest/EventProcessorServiceImpl.java>:[45,14]
cannot find symbol
symbol  : class ServiceReference
location: class org.apache.tuscany.sca.itest.EventProcessorServiceImpl

[ERROR] <https://hudson.apache.org/hudson/job/Tuscany-2x/org.apache.tuscany.sca$itest-callback-separatethread/ws/src/main/java/org/apache/tuscany/sca/itest/EventProcessorCallBack.java>:[22,35]
package org.oasisopen.sca.annotation does not exist

[ERROR] <https://hudson.apache.org/hudson/job/Tuscany-2x/org.apache.tuscany.sca$itest-callback-separatethread/ws/src/main/java/org/apache/tuscany/sca/itest/EventProcessorCallBack.java>:[28,1]
cannot find symbol
symbol: class Remotable
@Remotable

[ERROR] <https://hudson.apache.org/hudson/job/Tuscany-2x/org.apache.tuscany.sca$itest-callback-separatethread/ws/src/main/java/org/apache/tuscany/sca/itest/EventProcessorServiceImpl.java>:[50,30]
cannot find symbol
symbol  : class ServiceReference
location: class org.apache.tuscany.sca.itest.EventProcessorServiceImpl

[ERROR] <https://hudson.apache.org/hudson/job/Tuscany-2x/org.apache.tuscany.sca$itest-callback-separatethread/ws/src/main/java/org/apache/tuscany/sca/itest/CallBackSeparateThreadClientImpl.java>:[25,35]
package org.oasisopen.sca.annotation does not exist

[ERROR] <https://hudson.apache.org/hudson/job/Tuscany-2x/org.apache.tuscany.sca$itest-callback-separatethread/ws/src/main/java/org/apache/tuscany/sca/itest/CallBackSeparateThreadClientImpl.java>:[26,35]
package org.oasisopen.sca.annotation does not exist

[ERROR] <https://hudson.apache.org/hudson/job/Tuscany-2x/org.apache.tuscany.sca$itest-callback-separatethread/ws/src/main/java/org/apache/tuscany/sca/itest/CallBackSeparateThreadClient.java>:[22,35]
package org.oasisopen.sca.annotation does not exist

[ERROR] <https://hudson.apache.org/hudson/job/Tuscany-2x/org.apache.tuscany.sca$itest-callback-separatethread/ws/src/main/java/org/apache/tuscany/sca/itest/CallBackSeparateThreadClient.java>:[27,1]
cannot find symbol
symbol: class Remotable
@Remotable

[ERROR] <https://hudson.apache.org/hudson/job/Tuscany-2x/org.apache.tuscany.sca$itest-callback-separatethread/ws/src/main/java/org/apache/tuscany/sca/itest/CallBackSeparateThreadClientImpl.java>:[31,1]
cannot find symbol
symbol: class Service
@Service(CallBackSeparateThreadClient.class)

[ERROR] <https://hudson.apache.org/hudson/job/Tuscany-2x/org.apache.tuscany.sca$itest-callback-separatethread/ws/src/main/java/org/apache/tuscany/sca/itest/EventProcessorServiceImpl.java>:[44,5]
cannot find symbol
symbol  : class Callback
location: class org.apache.tuscany.sca.itest.EventProcessorServiceImpl

[ERROR] <https://hudson.apache.org/hudson/job/Tuscany-2x/org.apache.tuscany.sca$itest-callback-separatethread/ws/src/main/java/org/apache/tuscany/sca/itest/EventProcessorServiceImpl.java>:[117,5]
cannot find symbol
symbol  : class Destroy
location: class org.apache.tuscany.sca.itest.EventProcessorServiceImpl

[ERROR] <https://hudson.apache.org/hudson/job/Tuscany-2x/org.apache.tuscany.sca$itest-callback-separatethread/ws/src/main/java/org/apache/tuscany/sca/itest/CallBackSeparateThreadClientImpl.java>:[51,5]
cannot find symbol
symbol  : class Reference
location: class org.apache.tuscany.sca.itest.CallBackSeparateThreadClientImpl

[ERROR] <https://hudson.apache.org/hudson/job/Tuscany-2x/org.apache.tuscany.sca$itest-callback-separatethread/ws/src/main/java/org/apache/tuscany/sca/itest/EventProcessorServiceImpl.java>:[61,55]
cannot find symbol
symbol  : class ServiceReference
location: class org.apache.tuscany.sca.itest.EventProcessorServiceImpl

[ERROR] <https://hudson.apache.org/hudson/job/Tuscany-2x/org.apache.tuscany.sca$itest-callback-separatethread/ws/src/main/java/org/apache/tuscany/sca/itest/EventProcessorServiceImpl.java>:[102,14]
cannot find symbol
symbol  : class ServiceReference
location: class org.apache.tuscany.sca.itest.EventProcessorServiceImpl

[INFO] 25 errors 
[INFO] -------------------------------------------------------------
[HUDSON] Archiving disabled - not archiving <https://hudson.apache.org/hudson/job/Tuscany-2x/org.apache.tuscany.sca$itest-callback-separatethread/ws/pom.xml>


Mime
View raw message