tuscany-commits mailing list archives

Site index · List index
Message view « Date » · « Thread »
Top « Date » · « Thread »
From Apache Hudson Server <hud...@hudson.apache.org>
Subject Build failed in Hudson: Tuscany-2x » Apache Tuscany SCA iTest WS with Defaults #15
Date Fri, 10 Dec 2010 21:33:39 GMT
See <https://hudson.apache.org/hudson/job/Tuscany-2x/org.apache.tuscany.sca$itest-ws-defaults/15/>

------------------------------------------
[INFO] ------------------------------------------------------------------------
[INFO] Building Apache Tuscany SCA iTest WS with Defaults
[INFO]    task-segment: [clean, install]
[INFO] ------------------------------------------------------------------------
[INFO] [clean:clean]
[INFO] [enforcer:enforce {execution: enforce-plugin-versions}]
[INFO] [remote-resources:process {execution: default}]
[INFO] [resources:resources]
[INFO] Using 'UTF-8' encoding to copy filtered resources.
[INFO] Copying 3 resources
[INFO] Copying 0 resource
[INFO] Copying 3 resources
[INFO] [compiler:compile]
[INFO] Compiling 5 source files to <https://hudson.apache.org/hudson/job/Tuscany-2x/org.apache.tuscany.sca$itest-ws-defaults/ws/target/classes>
[INFO] -------------------------------------------------------------
[ERROR] COMPILATION ERROR : 
[INFO] -------------------------------------------------------------
[ERROR] <https://hudson.apache.org/hudson/job/Tuscany-2x/org.apache.tuscany.sca$itest-ws-defaults/ws/src/main/java/org/apache/tuscany/sca/binding/ws/axis2/HelloWorldClient.java>:[22,35]
package org.oasisopen.sca.annotation does not exist

[ERROR] <https://hudson.apache.org/hudson/job/Tuscany-2x/org.apache.tuscany.sca$itest-ws-defaults/ws/src/main/java/org/apache/tuscany/sca/binding/ws/axis2/HelloWorld.java>:[22,35]
package org.oasisopen.sca.annotation does not exist

[ERROR] <https://hudson.apache.org/hudson/job/Tuscany-2x/org.apache.tuscany.sca$itest-ws-defaults/ws/src/main/java/org/apache/tuscany/sca/binding/ws/axis2/HelloWorld.java>:[24,1]
cannot find symbol
symbol: class Remotable
@Remotable

[ERROR] <https://hudson.apache.org/hudson/job/Tuscany-2x/org.apache.tuscany.sca$itest-ws-defaults/ws/src/main/java/org/apache/tuscany/sca/binding/ws/axis2/HelloWorldClient.java>:[26,5]
cannot find symbol
symbol  : class Reference
location: class org.apache.tuscany.sca.binding.ws.axis2.HelloWorldClient

[INFO] 4 errors 
[INFO] -------------------------------------------------------------
[HUDSON] Archiving disabled - not archiving <https://hudson.apache.org/hudson/job/Tuscany-2x/org.apache.tuscany.sca$itest-ws-defaults/ws/pom.xml>


Mime
View raw message