tuscany-commits mailing list archives

Site index · List index
Message view « Date » · « Thread »
Top « Date » · « Thread »
From Apache Hudson Server <hud...@hudson.apache.org>
Subject Build failed in Hudson: Tuscany-2x » Apache Tuscany SCA iTest Component Type #15
Date Fri, 10 Dec 2010 21:33:38 GMT
See <https://hudson.apache.org/hudson/job/Tuscany-2x/org.apache.tuscany.sca$itest-component-type/15/>

------------------------------------------
[INFO] ------------------------------------------------------------------------
[INFO] Building Apache Tuscany SCA iTest Component Type
[INFO]    task-segment: [clean, install]
[INFO] ------------------------------------------------------------------------
[INFO] [clean:clean]
[INFO] [enforcer:enforce {execution: enforce-plugin-versions}]
[INFO] [remote-resources:process {execution: default}]
[INFO] [resources:resources]
[INFO] Using 'UTF-8' encoding to copy filtered resources.
[INFO] Copying 6 resources
[INFO] Copying 0 resource
[INFO] Copying 3 resources
[INFO] [compiler:compile]
[INFO] Compiling 11 source files to <https://hudson.apache.org/hudson/job/Tuscany-2x/org.apache.tuscany.sca$itest-component-type/ws/target/classes>
[INFO] -------------------------------------------------------------
[ERROR] COMPILATION ERROR : 
[INFO] -------------------------------------------------------------
[ERROR] <https://hudson.apache.org/hudson/job/Tuscany-2x/org.apache.tuscany.sca$itest-component-type/ws/src/main/java/calculator/AddService.java>:[21,35]
package org.oasisopen.sca.annotation does not exist

[ERROR] <https://hudson.apache.org/hudson/job/Tuscany-2x/org.apache.tuscany.sca$itest-component-type/ws/src/main/java/calculator/AddService.java>:[26,1]
cannot find symbol
symbol: class Remotable
@Remotable

[ERROR] <https://hudson.apache.org/hudson/job/Tuscany-2x/org.apache.tuscany.sca$itest-component-type/ws/src/main/java/calculator/CalculatorClient.java>:[22,34]
package org.apache.tuscany.sca.node does not exist

[ERROR] <https://hudson.apache.org/hudson/job/Tuscany-2x/org.apache.tuscany.sca$itest-component-type/ws/src/main/java/calculator/CalculatorClient.java>:[23,34]
package org.apache.tuscany.sca.node does not exist

[ERROR] <https://hudson.apache.org/hudson/job/Tuscany-2x/org.apache.tuscany.sca$itest-component-type/ws/src/main/java/calculator/CalculatorClient.java>:[24,34]
package org.apache.tuscany.sca.node does not exist

[ERROR] <https://hudson.apache.org/hudson/job/Tuscany-2x/org.apache.tuscany.sca$itest-component-type/ws/src/main/java/calculator/CalculatorClient.java>:[25,34]
package org.apache.tuscany.sca.node does not exist

[ERROR] <https://hudson.apache.org/hudson/job/Tuscany-2x/org.apache.tuscany.sca$itest-component-type/ws/src/main/java/calculator/CalculatorClient.java>:[34,26]
cannot find symbol
symbol  : variable ContributionLocationHelper
location: class calculator.CalculatorClient

[ERROR] <https://hudson.apache.org/hudson/job/Tuscany-2x/org.apache.tuscany.sca$itest-component-type/ws/src/main/java/calculator/CalculatorClient.java>:[35,8]
cannot find symbol
symbol  : class Node
location: class calculator.CalculatorClient

[ERROR] <https://hudson.apache.org/hudson/job/Tuscany-2x/org.apache.tuscany.sca$itest-component-type/ws/src/main/java/calculator/CalculatorClient.java>:[35,85]
cannot find symbol
symbol  : class Contribution
location: class calculator.CalculatorClient

[ERROR] <https://hudson.apache.org/hudson/job/Tuscany-2x/org.apache.tuscany.sca$itest-component-type/ws/src/main/java/calculator/CalculatorClient.java>:[35,20]
cannot find symbol
symbol  : variable NodeFactory
location: class calculator.CalculatorClient

[INFO] 10 errors 
[INFO] -------------------------------------------------------------
[HUDSON] Archiving disabled - not archiving <https://hudson.apache.org/hudson/job/Tuscany-2x/org.apache.tuscany.sca$itest-component-type/ws/pom.xml>


Mime
View raw message