tuscany-commits mailing list archives

Site index · List index
Message view « Date » · « Thread »
Top « Date » · « Thread »
From Apache Hudson Server <hud...@hudson.apache.org>
Subject Build failed in Hudson: Tuscany-2x » Apache Tuscany SCA iTest WS Contribution Doc Lit(sometimes called Bare) #15
Date Fri, 10 Dec 2010 21:33:38 GMT
See <https://hudson.apache.org/hudson/job/Tuscany-2x/org.apache.tuscany.sca$itest-ws-contribution-doc-lit/15/>

------------------------------------------
[INFO] ------------------------------------------------------------------------
[INFO] Building Apache Tuscany SCA iTest WS Contribution Doc Lit(sometimes called Bare)
[INFO]    task-segment: [clean, install]
[INFO] ------------------------------------------------------------------------
[INFO] [clean:clean]
[INFO] [enforcer:enforce {execution: enforce-plugin-versions}]
[INFO] [build-helper:add-test-source {execution: add-source}]
[INFO] Test Source directory: <https://hudson.apache.org/hudson/job/Tuscany-2x/org.apache.tuscany.sca$itest-ws-contribution-doc-lit/ws/target/jaxws-source>
added.
[INFO] [remote-resources:process {execution: default}]
[INFO] [resources:resources]
[INFO] Using 'UTF-8' encoding to copy filtered resources.
[INFO] Copying 7 resources
[INFO] Copying 0 resource
[INFO] Copying 3 resources
[INFO] [jaxws:wsimport {execution: wsimport1}]
[INFO] Processing: <https://hudson.apache.org/hudson/job/Tuscany-2x/org.apache.tuscany.sca$itest-ws-contribution-doc-lit/ws/target/classes/helloworld-external-service.wsdl>
[INFO] jaxws:wsimport args: [-s, <https://hudson.apache.org/hudson/job/Tuscany-2x/org.apache.tuscany.sca$itest-ws-contribution-doc-lit/ws/target/jaxws-source,>
-d, <https://hudson.apache.org/hudson/job/Tuscany-2x/org.apache.tuscany.sca$itest-ws-contribution-doc-lit/ws/target/classes,>
-verbose, -p, org.apache.tuscany.sca.binding.ws.jaxws.external.service.iface, -target, 2.1,
-Xnocompile, <https://hudson.apache.org/hudson/job/Tuscany-2x/org.apache.tuscany.sca$itest-ws-contribution-doc-lit/ws/target/classes/helloworld-external-service.wsdl]>
parsing WSDL...


generating code...

org/apache/tuscany/sca/binding/ws/jaxws/external/service/iface/Bar.java
org/apache/tuscany/sca/binding/ws/jaxws/external/service/iface/Foo.java
org/apache/tuscany/sca/binding/ws/jaxws/external/service/iface/GetGreetings.java
org/apache/tuscany/sca/binding/ws/jaxws/external/service/iface/GetGreetingsComplex.java
org/apache/tuscany/sca/binding/ws/jaxws/external/service/iface/GetGreetingsComplexResponse.java
org/apache/tuscany/sca/binding/ws/jaxws/external/service/iface/GetGreetingsResponse.java
org/apache/tuscany/sca/binding/ws/jaxws/external/service/iface/HelloWorldService.java
org/apache/tuscany/sca/binding/ws/jaxws/external/service/iface/HelloWorldServiceService.java
org/apache/tuscany/sca/binding/ws/jaxws/external/service/iface/ObjectFactory.java
org/apache/tuscany/sca/binding/ws/jaxws/external/service/iface/package-info.java
[INFO] [compiler:compile]
[INFO] Compiling 14 source files to <https://hudson.apache.org/hudson/job/Tuscany-2x/org.apache.tuscany.sca$itest-ws-contribution-doc-lit/ws/target/classes>
[INFO] -------------------------------------------------------------
[ERROR] COMPILATION ERROR : 
[INFO] -------------------------------------------------------------
[ERROR] <https://hudson.apache.org/hudson/job/Tuscany-2x/org.apache.tuscany.sca$itest-ws-contribution-doc-lit/ws/src/main/java/org/apache/tuscany/sca/binding/ws/HelloWorld2Impl.java>:[26,24]
package org.oasisopen.sca does not exist

[ERROR] <https://hudson.apache.org/hudson/job/Tuscany-2x/org.apache.tuscany.sca$itest-ws-contribution-doc-lit/ws/src/main/java/org/apache/tuscany/sca/binding/ws/HelloWorld2Impl.java>:[27,35]
package org.oasisopen.sca.annotation does not exist

[ERROR] <https://hudson.apache.org/hudson/job/Tuscany-2x/org.apache.tuscany.sca$itest-ws-contribution-doc-lit/ws/src/main/java/org/apache/tuscany/sca/binding/ws/HelloWorldBare.java>:[25,24]
package org.oasisopen.sca does not exist

[ERROR] <https://hudson.apache.org/hudson/job/Tuscany-2x/org.apache.tuscany.sca$itest-ws-contribution-doc-lit/ws/src/main/java/org/apache/tuscany/sca/binding/ws/HelloWorldBare.java>:[26,35]
package org.oasisopen.sca.annotation does not exist

[ERROR] <https://hudson.apache.org/hudson/job/Tuscany-2x/org.apache.tuscany.sca$itest-ws-contribution-doc-lit/ws/src/main/java/org/apache/tuscany/sca/binding/ws/HelloWorldBare.java>:[28,1]
cannot find symbol
symbol: class Remotable
@Remotable

[ERROR] <https://hudson.apache.org/hudson/job/Tuscany-2x/org.apache.tuscany.sca$itest-ws-contribution-doc-lit/ws/src/main/java/org/apache/tuscany/sca/binding/ws/HelloWorld2Impl.java>:[42,57]
cannot find symbol
symbol  : class ServiceRuntimeException
location: class org.apache.tuscany.sca.binding.ws.HelloWorld2Impl

[ERROR] <https://hudson.apache.org/hudson/job/Tuscany-2x/org.apache.tuscany.sca$itest-ws-contribution-doc-lit/ws/src/main/java/org/apache/tuscany/sca/binding/ws/HelloWorldBare.java>:[33,50]
cannot find symbol
symbol  : class ServiceRuntimeException
location: interface org.apache.tuscany.sca.binding.ws.HelloWorldBare

[ERROR] <https://hudson.apache.org/hudson/job/Tuscany-2x/org.apache.tuscany.sca$itest-ws-contribution-doc-lit/ws/src/main/java/org/apache/tuscany/sca/binding/ws/HelloWorld.java>:[25,24]
package org.oasisopen.sca does not exist

[ERROR] <https://hudson.apache.org/hudson/job/Tuscany-2x/org.apache.tuscany.sca$itest-ws-contribution-doc-lit/ws/src/main/java/org/apache/tuscany/sca/binding/ws/HelloWorld.java>:[26,35]
package org.oasisopen.sca.annotation does not exist

[ERROR] <https://hudson.apache.org/hudson/job/Tuscany-2x/org.apache.tuscany.sca$itest-ws-contribution-doc-lit/ws/src/main/java/org/apache/tuscany/sca/binding/ws/HelloWorld.java>:[28,1]
cannot find symbol
symbol: class Remotable
@Remotable

[ERROR] <https://hudson.apache.org/hudson/job/Tuscany-2x/org.apache.tuscany.sca$itest-ws-contribution-doc-lit/ws/src/main/java/org/apache/tuscany/sca/binding/ws/HelloWorld.java>:[32,50]
cannot find symbol
symbol  : class ServiceRuntimeException
location: interface org.apache.tuscany.sca.binding.ws.HelloWorld

[ERROR] <https://hudson.apache.org/hudson/job/Tuscany-2x/org.apache.tuscany.sca$itest-ws-contribution-doc-lit/ws/src/main/java/org/apache/tuscany/sca/binding/ws/HelloWorld1Impl.java>:[25,24]
package org.oasisopen.sca does not exist

[ERROR] <https://hudson.apache.org/hudson/job/Tuscany-2x/org.apache.tuscany.sca$itest-ws-contribution-doc-lit/ws/src/main/java/org/apache/tuscany/sca/binding/ws/HelloWorld1Impl.java>:[26,35]
package org.oasisopen.sca.annotation does not exist

[ERROR] <https://hudson.apache.org/hudson/job/Tuscany-2x/org.apache.tuscany.sca$itest-ws-contribution-doc-lit/ws/src/main/java/org/apache/tuscany/sca/binding/ws/HelloWorld1Impl.java>:[41,57]
cannot find symbol
symbol  : class ServiceRuntimeException
location: class org.apache.tuscany.sca.binding.ws.HelloWorld1Impl

[ERROR] <https://hudson.apache.org/hudson/job/Tuscany-2x/org.apache.tuscany.sca$itest-ws-contribution-doc-lit/ws/src/main/java/org/apache/tuscany/sca/binding/ws/HelloWorld2Impl.java>:[32,5]
cannot find symbol
symbol  : class Reference
location: class org.apache.tuscany.sca.binding.ws.HelloWorld2Impl

[ERROR] <https://hudson.apache.org/hudson/job/Tuscany-2x/org.apache.tuscany.sca$itest-ws-contribution-doc-lit/ws/src/main/java/org/apache/tuscany/sca/binding/ws/HelloWorld1Impl.java>:[31,5]
cannot find symbol
symbol  : class Reference
location: class org.apache.tuscany.sca.binding.ws.HelloWorld1Impl

[ERROR] <https://hudson.apache.org/hudson/job/Tuscany-2x/org.apache.tuscany.sca$itest-ws-contribution-doc-lit/ws/src/main/java/org/apache/tuscany/sca/binding/ws/HelloWorld2Impl.java>:[46,18]
cannot find symbol
symbol  : class ServiceRuntimeException
location: class org.apache.tuscany.sca.binding.ws.HelloWorld2Impl

[ERROR] <https://hudson.apache.org/hudson/job/Tuscany-2x/org.apache.tuscany.sca$itest-ws-contribution-doc-lit/ws/src/main/java/org/apache/tuscany/sca/binding/ws/HelloWorld1Impl.java>:[45,18]
cannot find symbol
symbol  : class ServiceRuntimeException
location: class org.apache.tuscany.sca.binding.ws.HelloWorld1Impl

[INFO] 18 errors 
[INFO] -------------------------------------------------------------
[HUDSON] Archiving disabled - not archiving <https://hudson.apache.org/hudson/job/Tuscany-2x/org.apache.tuscany.sca$itest-ws-contribution-doc-lit/ws/pom.xml>


Mime
View raw message