tuscany-commits mailing list archives

Site index · List index
Message view « Date » · « Thread »
Top « Date » · « Thread »
From Apache Jenkins Server <hud...@hudson.apache.org>
Subject Build failed in Jenkins: Tuscany-2x #215
Date Mon, 23 May 2011 01:45:10 GMT
See <https://builds.apache.org/hudson/job/Tuscany-2x/215/>

------------------------------------------
[...truncated 68570 lines...]
	at org.apache.tuscany.sca.contribution.processor.impl.ContributionContentProcessor.resolve(ContributionContentProcessor.java:65)
	at org.apache.tuscany.sca.contribution.processor.DefaultURLArtifactProcessorExtensionPoint$LazyURLArtifactProcessor.resolve(DefaultURLArtifactProcessorExtensionPoint.java:305)
	at org.apache.tuscany.sca.deployment.impl.DeployerImpl.build(DeployerImpl.java:550)
	at org.apache.tuscany.sca.deployment.impl.DeployerImpl.build(DeployerImpl.java:477)
	at org.apache.tuscany.sca.node.impl.NodeFactoryImpl.configureNode(NodeFactoryImpl.java:313)
	at org.apache.tuscany.sca.node.impl.NodeImpl.start(NodeImpl.java:139)
	at org.apache.tuscany.sca.otest.TuscanyRuntimeBridge.startContribution(TuscanyRuntimeBridge.java:80)
	at client.BaseJAXWSTestRunner.startContribution(BaseJAXWSTestRunner.java:235)
	at client.BaseJAXWSTestRunner.setUp(BaseJAXWSTestRunner.java:144)
	at sun.reflect.GeneratedMethodAccessor19.invoke(Unknown Source)
	at sun.reflect.DelegatingMethodAccessorImpl.invoke(DelegatingMethodAccessorImpl.java:25)
	at java.lang.reflect.Method.invoke(Method.java:597)
	at org.junit.runners.model.FrameworkMethod$1.runReflectiveCall(FrameworkMethod.java:44)
	at org.junit.internal.runners.model.ReflectiveCallable.run(ReflectiveCallable.java:15)
	at org.junit.runners.model.FrameworkMethod.invokeExplosively(FrameworkMethod.java:41)
	at org.junit.internal.runners.statements.RunBefores.evaluate(RunBefores.java:27)
	at org.junit.internal.runners.statements.RunAfters.evaluate(RunAfters.java:31)
	at org.junit.runners.BlockJUnit4ClassRunner.runChild(BlockJUnit4ClassRunner.java:73)
	at org.junit.runners.BlockJUnit4ClassRunner.runChild(BlockJUnit4ClassRunner.java:46)
	at org.junit.runners.ParentRunner.runChildren(ParentRunner.java:180)
	at org.junit.runners.ParentRunner.access$000(ParentRunner.java:41)
	at org.junit.runners.ParentRunner$1.evaluate(ParentRunner.java:173)
	at org.junit.internal.runners.statements.RunBefores.evaluate(RunBefores.java:28)
	at org.junit.internal.runners.statements.RunAfters.evaluate(RunAfters.java:31)
	at org.junit.runners.ParentRunner.run(ParentRunner.java:220)
	at org.apache.maven.surefire.junit4.JUnit4TestSet.execute(JUnit4TestSet.java:62)
	at org.apache.maven.surefire.suite.AbstractDirectoryTestSuite.executeTestSet(AbstractDirectoryTestSuite.java:140)
	at org.apache.maven.surefire.suite.AbstractDirectoryTestSuite.execute(AbstractDirectoryTestSuite.java:127)
	at org.apache.maven.surefire.Surefire.run(Surefire.java:177)
	at sun.reflect.NativeMethodAccessorImpl.invoke0(Native Method)
	at sun.reflect.NativeMethodAccessorImpl.invoke(NativeMethodAccessorImpl.java:39)
	at sun.reflect.DelegatingMethodAccessorImpl.invoke(DelegatingMethodAccessorImpl.java:25)
	at java.lang.reflect.Method.invoke(Method.java:597)
	at org.apache.maven.surefire.booter.SurefireBooter.runSuitesInProcess(SurefireBooter.java:345)
	at org.apache.maven.surefire.booter.SurefireBooter.main(SurefireBooter.java:1009)
Caused by: org.apache.tuscany.sca.implementation.java.introspect.impl.InvalidConstructorException:
JCA90003 constructor parameters for class org.oasisopen.sca.test.service1BadConstrImpl must
have @Property or @Reference annotation
	at org.apache.tuscany.sca.implementation.java.introspect.impl.ConstructorProcessor.visitConstructor(ConstructorProcessor.java:87)
	at org.apache.tuscany.sca.implementation.java.impl.JavaClassIntrospectorImpl.introspectClass(JavaClassIntrospectorImpl.java:76)
	at org.apache.tuscany.sca.implementation.java.impl.JavaImplementationFactoryImpl.createJavaImplementation(JavaImplementationFactoryImpl.java:63)
	at org.apache.tuscany.sca.implementation.java.xml.JavaImplementationProcessor.resolve(JavaImplementationProcessor.java:198)
	... 48 more
May 23, 2011 1:44:40 AM org.apache.tuscany.sca.builder.impl.ComponentBuilderImpl [Composite:
{http://docs.oasis-open.org/ns/opencsa/sca/200912}, Component: TEST_JCA_10006Component1] (UnresolvedComponentImplementation)
SEVERE: [ASM60030,JCI50004,JCI80001] Component implementation not resolved: Component = TEST_JCA_10006Component1
Uri = TEST_JCA_10006Component1
May 23, 2011 1:44:40 AM org.apache.tuscany.sca.core.runtime.impl.EndpointReferenceBinderImpl
[] (ComponentReferenceTargetNotFound)
WARNING: Component reference target not found at deployment time, it might be a remote service
elsewhere in the SCA Domain so well try and resolve it again at runtime: {1} 
May 23, 2011 1:44:40 AM org.apache.tuscany.sca.core.runtime.impl.EndpointReferenceBinderImpl
[] (ComponentReferenceTargetNotFound)
WARNING: Component reference target not found at deployment time, it might be a remote service
elsewhere in the SCA Domain so well try and resolve it again at runtime: {1} 
org.apache.tuscany.sca.contribution.processor.ContributionResolveException: org.apache.tuscany.sca.implementation.java.introspect.impl.InvalidConstructorException:
JCA90003 constructor parameters for class org.oasisopen.sca.test.service1BadConstrImpl must
have @Property or @Reference annotation
java.lang.IllegalStateException: org.apache.tuscany.sca.contribution.processor.ContributionResolveException:
org.apache.tuscany.sca.implementation.java.introspect.impl.InvalidConstructorException: JCA90003
constructor parameters for class org.oasisopen.sca.test.service1BadConstrImpl must have @Property
or @Reference annotation
	at org.apache.tuscany.sca.node.impl.NodeImpl.start(NodeImpl.java:194)
	at org.apache.tuscany.sca.otest.TuscanyRuntimeBridge.startContribution(TuscanyRuntimeBridge.java:80)
	at client.BaseJAXWSTestRunner.startContribution(BaseJAXWSTestRunner.java:235)
	at client.BaseJAXWSTestRunner.setUp(BaseJAXWSTestRunner.java:144)
	at sun.reflect.GeneratedMethodAccessor19.invoke(Unknown Source)
	at sun.reflect.DelegatingMethodAccessorImpl.invoke(DelegatingMethodAccessorImpl.java:25)
	at java.lang.reflect.Method.invoke(Method.java:597)
	at org.junit.runners.model.FrameworkMethod$1.runReflectiveCall(FrameworkMethod.java:44)
	at org.junit.internal.runners.model.ReflectiveCallable.run(ReflectiveCallable.java:15)
	at org.junit.runners.model.FrameworkMethod.invokeExplosively(FrameworkMethod.java:41)
	at org.junit.internal.runners.statements.RunBefores.evaluate(RunBefores.java:27)
	at org.junit.internal.runners.statements.RunAfters.evaluate(RunAfters.java:31)
	at org.junit.runners.BlockJUnit4ClassRunner.runChild(BlockJUnit4ClassRunner.java:73)
	at org.junit.runners.BlockJUnit4ClassRunner.runChild(BlockJUnit4ClassRunner.java:46)
	at org.junit.runners.ParentRunner.runChildren(ParentRunner.java:180)
	at org.junit.runners.ParentRunner.access$000(ParentRunner.java:41)
	at org.junit.runners.ParentRunner$1.evaluate(ParentRunner.java:173)
	at org.junit.internal.runners.statements.RunBefores.evaluate(RunBefores.java:28)
	at org.junit.internal.runners.statements.RunAfters.evaluate(RunAfters.java:31)
	at org.junit.runners.ParentRunner.run(ParentRunner.java:220)
	at org.apache.maven.surefire.junit4.JUnit4TestSet.execute(JUnit4TestSet.java:62)
	at org.apache.maven.surefire.suite.AbstractDirectoryTestSuite.executeTestSet(AbstractDirectoryTestSuite.java:140)
	at org.apache.maven.surefire.suite.AbstractDirectoryTestSuite.execute(AbstractDirectoryTestSuite.java:127)
	at org.apache.maven.surefire.Surefire.run(Surefire.java:177)
	at sun.reflect.NativeMethodAccessorImpl.invoke0(Native Method)
	at sun.reflect.NativeMethodAccessorImpl.invoke(NativeMethodAccessorImpl.java:39)
	at sun.reflect.DelegatingMethodAccessorImpl.invoke(DelegatingMethodAccessorImpl.java:25)
	at java.lang.reflect.Method.invoke(Method.java:597)
	at org.apache.maven.surefire.booter.SurefireBooter.runSuitesInProcess(SurefireBooter.java:345)
	at org.apache.maven.surefire.booter.SurefireBooter.main(SurefireBooter.java:1009)
Caused by: org.apache.tuscany.sca.contribution.processor.ContributionResolveException: org.apache.tuscany.sca.implementation.java.introspect.impl.InvalidConstructorException:
JCA90003 constructor parameters for class org.oasisopen.sca.test.service1BadConstrImpl must
have @Property or @Reference annotation
	at org.apache.tuscany.sca.implementation.java.xml.JavaImplementationProcessor.resolve(JavaImplementationProcessor.java:200)
	at org.apache.tuscany.sca.implementation.java.xml.JavaImplementationProcessor.resolve(JavaImplementationProcessor.java:81)
	at org.apache.tuscany.sca.contribution.processor.DefaultStAXArtifactProcessorExtensionPoint$LazyStAXArtifactProcessor.resolve(DefaultStAXArtifactProcessorExtensionPoint.java:321)
	at org.apache.tuscany.sca.contribution.processor.ExtensibleStAXArtifactProcessor.resolve(ExtensibleStAXArtifactProcessor.java:199)
	at org.apache.tuscany.sca.assembly.xml.BaseAssemblyProcessor.resolveImplementation(BaseAssemblyProcessor.java:329)
	at org.apache.tuscany.sca.assembly.xml.CompositeProcessor.resolve(CompositeProcessor.java:1104)
	at org.apache.tuscany.sca.assembly.xml.CompositeProcessor.resolve(CompositeProcessor.java:125)
	at org.apache.tuscany.sca.contribution.processor.DefaultStAXArtifactProcessorExtensionPoint$LazyStAXArtifactProcessor.resolve(DefaultStAXArtifactProcessorExtensionPoint.java:321)
	at org.apache.tuscany.sca.contribution.processor.ExtensibleStAXArtifactProcessor.resolve(ExtensibleStAXArtifactProcessor.java:199)
	at org.apache.tuscany.sca.assembly.xml.CompositeDocumentProcessor.resolve(CompositeDocumentProcessor.java:169)
	at org.apache.tuscany.sca.assembly.xml.CompositeDocumentProcessor.resolve(CompositeDocumentProcessor.java:50)
	at org.apache.tuscany.sca.contribution.processor.DefaultURLArtifactProcessorExtensionPoint$LazyURLArtifactProcessor.resolve(DefaultURLArtifactProcessorExtensionPoint.java:305)
	at org.apache.tuscany.sca.contribution.processor.ExtensibleURLArtifactProcessor.resolve(ExtensibleURLArtifactProcessor.java:122)
	at org.apache.tuscany.sca.contribution.processor.impl.ContributionContentProcessor.resolve(ContributionContentProcessor.java:285)
	at org.apache.tuscany.sca.contribution.processor.impl.ContributionContentProcessor.resolve(ContributionContentProcessor.java:65)
	at org.apache.tuscany.sca.contribution.processor.DefaultURLArtifactProcessorExtensionPoint$LazyURLArtifactProcessor.resolve(DefaultURLArtifactProcessorExtensionPoint.java:305)
	at org.apache.tuscany.sca.deployment.impl.DeployerImpl.build(DeployerImpl.java:550)
	at org.apache.tuscany.sca.deployment.impl.DeployerImpl.build(DeployerImpl.java:477)
	at org.apache.tuscany.sca.node.impl.NodeFactoryImpl.configureNode(NodeFactoryImpl.java:313)
	at org.apache.tuscany.sca.node.impl.NodeImpl.start(NodeImpl.java:139)
	... 29 more
Caused by: org.apache.tuscany.sca.implementation.java.introspect.impl.InvalidConstructorException:
JCA90003 constructor parameters for class org.oasisopen.sca.test.service1BadConstrImpl must
have @Property or @Reference annotation
	at org.apache.tuscany.sca.implementation.java.introspect.impl.ConstructorProcessor.visitConstructor(ConstructorProcessor.java:87)
	at org.apache.tuscany.sca.implementation.java.impl.JavaClassIntrospectorImpl.introspectClass(JavaClassIntrospectorImpl.java:76)
	at org.apache.tuscany.sca.implementation.java.impl.JavaImplementationFactoryImpl.createJavaImplementation(JavaImplementationFactoryImpl.java:63)
	at org.apache.tuscany.sca.implementation.java.xml.JavaImplementationProcessor.resolve(JavaImplementationProcessor.java:198)
	... 48 more
Exception received during startup - detail: org.apache.tuscany.sca.contribution.processor.ContributionResolveException:
org.apache.tuscany.sca.implementation.java.introspect.impl.InvalidConstructorException: JCA90003
constructor parameters for class org.oasisopen.sca.test.service1BadConstrImpl must have @Property
or @Reference annotation
java.lang.IllegalStateException: org.apache.tuscany.sca.contribution.processor.ContributionResolveException:
org.apache.tuscany.sca.implementation.java.introspect.impl.InvalidConstructorException: JCA90003
constructor parameters for class org.oasisopen.sca.test.service1BadConstrImpl must have @Property
or @Reference annotation
	at org.apache.tuscany.sca.node.impl.NodeImpl.start(NodeImpl.java:194)
	at org.apache.tuscany.sca.otest.TuscanyRuntimeBridge.startContribution(TuscanyRuntimeBridge.java:80)
	at client.BaseJAXWSTestRunner.startContribution(BaseJAXWSTestRunner.java:235)
	at client.BaseJAXWSTestRunner.setUp(BaseJAXWSTestRunner.java:144)
	at sun.reflect.GeneratedMethodAccessor19.invoke(Unknown Source)
	at sun.reflect.DelegatingMethodAccessorImpl.invoke(DelegatingMethodAccessorImpl.java:25)
	at java.lang.reflect.Method.invoke(Method.java:597)
	at org.junit.runners.model.FrameworkMethod$1.runReflectiveCall(FrameworkMethod.java:44)
	at org.junit.internal.runners.model.ReflectiveCallable.run(ReflectiveCallable.java:15)
	at org.junit.runners.model.FrameworkMethod.invokeExplosively(FrameworkMethod.java:41)
	at org.junit.internal.runners.statements.RunBefores.evaluate(RunBefores.java:27)
	at org.junit.internal.runners.statements.RunAfters.evaluate(RunAfters.java:31)
	at org.junit.runners.BlockJUnit4ClassRunner.runChild(BlockJUnit4ClassRunner.java:73)
	at org.junit.runners.BlockJUnit4ClassRunner.runChild(BlockJUnit4ClassRunner.java:46)
	at org.junit.runners.ParentRunner.runChildren(ParentRunner.java:180)
	at org.junit.runners.ParentRunner.access$000(ParentRunner.java:41)
	at org.junit.runners.ParentRunner$1.evaluate(ParentRunner.java:173)
	at org.junit.internal.runners.statements.RunBefores.evaluate(RunBefores.java:28)
	at org.junit.internal.runners.statements.RunAfters.evaluate(RunAfters.java:31)
	at org.junit.runners.ParentRunner.run(ParentRunner.java:220)
	at org.apache.maven.surefire.junit4.JUnit4TestSet.execute(JUnit4TestSet.java:62)
	at org.apache.maven.surefire.suite.AbstractDirectoryTestSuite.executeTestSet(AbstractDirectoryTestSuite.java:140)
	at org.apache.maven.surefire.suite.AbstractDirectoryTestSuite.execute(AbstractDirectoryTestSuite.java:127)
	at org.apache.maven.surefire.Surefire.run(Surefire.java:177)
	at sun.reflect.NativeMethodAccessorImpl.invoke0(Native Method)
	at sun.reflect.NativeMethodAccessorImpl.invoke(NativeMethodAccessorImpl.java:39)
	at sun.reflect.DelegatingMethodAccessorImpl.invoke(DelegatingMethodAccessorImpl.java:25)
	at java.lang.reflect.Method.invoke(Method.java:597)
	at org.apache.maven.surefire.booter.SurefireBooter.runSuitesInProcess(SurefireBooter.java:345)
	at org.apache.maven.surefire.booter.SurefireBooter.main(SurefireBooter.java:1009)
Caused by: org.apache.tuscany.sca.contribution.processor.ContributionResolveException: org.apache.tuscany.sca.implementation.java.introspect.impl.InvalidConstructorException:
JCA90003 constructor parameters for class org.oasisopen.sca.test.service1BadConstrImpl must
have @Property or @Reference annotation
	at org.apache.tuscany.sca.implementation.java.xml.JavaImplementationProcessor.resolve(JavaImplementationProcessor.java:200)
	at org.apache.tuscany.sca.implementation.java.xml.JavaImplementationProcessor.resolve(JavaImplementationProcessor.java:81)
	at org.apache.tuscany.sca.contribution.processor.DefaultStAXArtifactProcessorExtensionPoint$LazyStAXArtifactProcessor.resolve(DefaultStAXArtifactProcessorExtensionPoint.java:321)
	at org.apache.tuscany.sca.contribution.processor.ExtensibleStAXArtifactProcessor.resolve(ExtensibleStAXArtifactProcessor.java:199)
	at org.apache.tuscany.sca.assembly.xml.BaseAssemblyProcessor.resolveImplementation(BaseAssemblyProcessor.java:329)
	at org.apache.tuscany.sca.assembly.xml.CompositeProcessor.resolve(CompositeProcessor.java:1104)
	at org.apache.tuscany.sca.assembly.xml.CompositeProcessor.resolve(CompositeProcessor.java:125)
	at org.apache.tuscany.sca.contribution.processor.DefaultStAXArtifactProcessorExtensionPoint$LazyStAXArtifactProcessor.resolve(DefaultStAXArtifactProcessorExtensionPoint.java:321)
	at org.apache.tuscany.sca.contribution.processor.ExtensibleStAXArtifactProcessor.resolve(ExtensibleStAXArtifactProcessor.java:199)
	at org.apache.tuscany.sca.assembly.xml.CompositeDocumentProcessor.resolve(CompositeDocumentProcessor.java:169)
	at org.apache.tuscany.sca.assembly.xml.CompositeDocumentProcessor.resolve(CompositeDocumentProcessor.java:50)
	at org.apache.tuscany.sca.contribution.processor.DefaultURLArtifactProcessorExtensionPoint$LazyURLArtifactProcessor.resolve(DefaultURLArtifactProcessorExtensionPoint.java:305)
	at org.apache.tuscany.sca.contribution.processor.ExtensibleURLArtifactProcessor.resolve(ExtensibleURLArtifactProcessor.java:122)
	at org.apache.tuscany.sca.contribution.processor.impl.ContributionContentProcessor.resolve(ContributionContentProcessor.java:285)
	at org.apache.tuscany.sca.contribution.processor.impl.ContributionContentProcessor.resolve(ContributionContentProcessor.java:65)
	at org.apache.tuscany.sca.contribution.processor.DefaultURLArtifactProcessorExtensionPoint$LazyURLArtifactProcessor.resolve(DefaultURLArtifactProcessorExtensionPoint.java:305)
	at org.apache.tuscany.sca.deployment.impl.DeployerImpl.build(DeployerImpl.java:550)
	at org.apache.tuscany.sca.deployment.impl.DeployerImpl.build(DeployerImpl.java:477)
	at org.apache.tuscany.sca.node.impl.NodeFactoryImpl.configureNode(NodeFactoryImpl.java:313)
	at org.apache.tuscany.sca.node.impl.NodeImpl.start(NodeImpl.java:139)
	... 29 more
Caused by: org.apache.tuscany.sca.implementation.java.introspect.impl.InvalidConstructorException:
JCA90003 constructor parameters for class org.oasisopen.sca.test.service1BadConstrImpl must
have @Property or @Reference annotation
	at org.apache.tuscany.sca.implementation.java.introspect.impl.ConstructorProcessor.visitConstructor(ConstructorProcessor.java:87)
	at org.apache.tuscany.sca.implementation.java.impl.JavaClassIntrospectorImpl.introspectClass(JavaClassIntrospectorImpl.java:76)
	at org.apache.tuscany.sca.implementation.java.impl.JavaImplementationFactoryImpl.createJavaImplementation(JavaImplementationFactoryImpl.java:63)
	at org.apache.tuscany.sca.implementation.java.xml.JavaImplementationProcessor.resolve(JavaImplementationProcessor.java:198)
	... 48 more
Test JCA_10006 completed successfully
May 23, 2011 1:44:40 AM org.apache.tuscany.sca.node.impl.NodeImpl stop
INFO: Stopping node: http://tuscany.apache.org/sca/1.1/nodes/default0
Tests run: 2, Failures: 0, Errors: 0, Skipped: 1, Time elapsed: 0.401 sec

Results :

Tests run: 242, Failures: 0, Errors: 0, Skipped: 121

[JENKINS] Recording test results
[INFO] [jar:jar {execution: default-jar}]
[INFO] Building jar: <https://builds.apache.org/hudson/job/Tuscany-2x/ws/sca-2x/testing/compliance-tests/java-caa/target/tuscany-compliance-test-java-caa.jar>
[INFO] [install:install {execution: default-install}]
[INFO] Installing <https://builds.apache.org/hudson/job/Tuscany-2x/ws/sca-2x/testing/compliance-tests/java-caa/target/tuscany-compliance-test-java-caa.jar>
to <https://builds.apache.org/hudson/job/Tuscany-2x/ws/.repository/org/apache/tuscany/sca/tuscany-compliance-test-java-caa/2.0-SNAPSHOT/tuscany-compliance-test-java-caa-2.0-SNAPSHOT.jar>
[JENKINS] Archiving disabled - not archiving <https://builds.apache.org/hudson/job/Tuscany-2x/ws/sca-2x/testing/compliance-tests/java-caa/pom.xml>
[JENKINS] Archiving disabled - not archiving <https://builds.apache.org/hudson/job/Tuscany-2x/ws/sca-2x/testing/compliance-tests/java-caa/target/tuscany-compliance-test-java-caa.jar>
[INFO] ------------------------------------------------------------------------
[INFO] Building Apache Tuscany SCA Specification Compliance Tests Java CI
[INFO]    task-segment: [clean, install]
[INFO] ------------------------------------------------------------------------
[INFO] [clean:clean {execution: default-clean}]
[INFO] [enforcer:enforce {execution: enforce-plugin-versions}]
[INFO] [remote-resources:process {execution: default}]
[INFO] [resources:resources {execution: default-resources}]
[INFO] Using 'UTF-8' encoding to copy filtered resources.
[INFO] skip non existing resourceDirectory <https://builds.apache.org/hudson/job/Tuscany-2x/ws/sca-2x/testing/compliance-tests/java-ci/src/main/resources>
[INFO] Copying 0 resource
[INFO] Copying 3 resources
[INFO] [compiler:compile {execution: default-compile}]
[INFO] No sources to compile
[INFO] [dependency:unpack {execution: unpack}]
[INFO] Configured Artifact: org.apache.tuscany.sca:oasis-jci-contributions:2.0-SNAPSHOT:zip
[INFO] snapshot org.apache.tuscany.sca:oasis-jci-contributions:2.0-SNAPSHOT: checking for
updates from oasis.contributions
[INFO] snapshot org.apache.tuscany.sca:oasis-jci-contributions:2.0-SNAPSHOT: checking for
updates from apache.snapshots
Downloading: http://svn.apache.org/repos/asf/tuscany/maven/org/apache/tuscany/sca/oasis-jci-contributions/2.0-SNAPSHOT/oasis-jci-contributions-2.0-SNAPSHOT.zip

[WARNING] *** CHECKSUM FAILED - Error retrieving checksum file for org/apache/tuscany/sca/oasis-jci-contributions/2.0-SNAPSHOT/oasis-jci-contributions-2.0-SNAPSHOT.zip
- IGNORING
[INFO] Configured Artifact: org.apache.tuscany.sca:tuscany-otests-sca-j-ci-tests:2.0-SNAPSHOT:jar
[INFO] snapshot org.apache.tuscany.sca:tuscany-otests-sca-j-ci-tests:2.0-SNAPSHOT: checking
for updates from oasis.contributions
[INFO] snapshot org.apache.tuscany.sca:tuscany-otests-sca-j-ci-tests:2.0-SNAPSHOT: checking
for updates from apache.snapshots
Downloading: http://svn.apache.org/repos/asf/tuscany/maven/org/apache/tuscany/sca/tuscany-otests-sca-j-ci-tests/2.0-SNAPSHOT/tuscany-otests-sca-j-ci-tests-2.0-SNAPSHOT.jar

[WARNING] Unable to get resource 'org.apache.tuscany.sca:tuscany-otests-sca-j-ci-tests:jar:2.0-SNAPSHOT'
from repository oasis.contributions (http://svn.apache.org/repos/asf/tuscany/maven): Error
transferring file: Connection timed out
Downloading: http://repository.apache.org/snapshots/org/apache/tuscany/sca/tuscany-otests-sca-j-ci-tests/2.0-SNAPSHOT/tuscany-otests-sca-j-ci-tests-2.0-SNAPSHOT.jar
[INFO] Unable to find resource 'org.apache.tuscany.sca:tuscany-otests-sca-j-ci-tests:jar:2.0-SNAPSHOT'
in repository apache.snapshots (http://repository.apache.org/snapshots)
[JENKINS] Archiving disabled - not archiving <https://builds.apache.org/hudson/job/Tuscany-2x/ws/sca-2x/testing/compliance-tests/java-ci/pom.xml>
[INFO] ------------------------------------------------------------------------
[ERROR] BUILD ERROR
[INFO] ------------------------------------------------------------------------
[INFO] Unable to find artifact.

Embedded error: Unable to download the artifact from any repository

Try downloading the file manually from the project website.

Then, install it using the command: 
    mvn install:install-file -DgroupId=org.apache.tuscany.sca -DartifactId=tuscany-otests-sca-j-ci-tests
-Dversion=2.0-SNAPSHOT -Dpackaging=jar -Dfile=/path/to/file

Alternatively, if you host your own repository you can deploy the file there: 
    mvn deploy:deploy-file -DgroupId=org.apache.tuscany.sca -DartifactId=tuscany-otests-sca-j-ci-tests
-Dversion=2.0-SNAPSHOT -Dpackaging=jar -Dfile=/path/to/file -Durl=[url] -DrepositoryId=[id]


  org.apache.tuscany.sca:tuscany-otests-sca-j-ci-tests:jar:2.0-SNAPSHOT

from the specified remote repositories:
  oasis.contributions (http://svn.apache.org/repos/asf/tuscany/maven),
  central (http://repo1.maven.org/maven2),
  tuscany.repo (http://svn.apache.org/repos/asf/tuscany/maven),
  Nexus (http://repository.apache.org/snapshots)


[INFO] ------------------------------------------------------------------------
[INFO] For more information, run Maven with the -e switch
[INFO] ------------------------------------------------------------------------
[INFO] Total time: 83 minutes 37 seconds
[INFO] Finished at: Mon May 23 01:45:05 UTC 2011
[INFO] Final Memory: 194M/739M
[INFO] ------------------------------------------------------------------------
Sending e-mails to: commits@tuscany.apache.org
channel stopped
2011-05-23 01:45:06.869:INFO::Shutdown hook executing
2011-05-23 01:45:06.869:INFO::Shutdown hook complete


Mime
View raw message