tuscany-commits mailing list archives

Site index · List index
Message view « Date » · « Thread »
Top « Date » · « Thread »
From Apache Jenkins Server <jenk...@builds.apache.org>
Subject Build failed in Jenkins: Tuscany-2x-deploy #560
Date Tue, 06 Dec 2011 00:50:33 GMT
See <https://builds.apache.org/job/Tuscany-2x-deploy/560/>

------------------------------------------
[...truncated 9238 lines...]
[INFO] web.xml file = <https://builds.apache.org/job/Tuscany-2x-deploy/ws/sca-2x/samples/getting-started/helloworld-webapp/src/main/webapp/WEB-INF/web.xml>
[INFO] Webapp directory = <https://builds.apache.org/job/Tuscany-2x-deploy/ws/sca-2x/samples/getting-started/helloworld-webapp/src/main/webapp>
[INFO] Starting jetty 6.1.26 ...
2011-12-06 00:50:26.536:INFO::jetty-6.1.26
2011-12-06 00:50:26.662:INFO::No Transaction manager found - if your webapp requires one,
please configure one.
Dec 6, 2011 12:50:26 AM org.apache.tuscany.sca.host.webapp.WebAppServletHost initContextPath
INFO: ContextPath: /helloworld-webapp
Dec 6, 2011 12:50:26 AM org.apache.tuscany.sca.node.impl.NodeImpl start
INFO: Starting node: <https://builds.apache.org/job/Tuscany-2x-deploy/ws/sca-2x/samples/getting-started/helloworld-webapp/src/main/webapp/>
domain: default
Dec 6, 2011 12:50:26 AM org.apache.tuscany.sca.node.impl.NodeFactoryImpl loadContributions
INFO: Loading contribution: <https://builds.apache.org/job/Tuscany-2x-deploy/ws/sca-2x/samples/getting-started/helloworld-webapp/src/main/webapp/>
Dec 6, 2011 12:50:27 AM org.apache.tuscany.sca.node.impl.NodeFactoryImpl loadContributions
INFO: Loading contribution: <https://builds.apache.org/job/Tuscany-2x-deploy/ws/sca-2x/samples/getting-started/helloworld-webapp/src/main/webapp/WEB-INF/sca-contributions/helloworld-2.0-SNAPSHOT.jar>
Dec 6, 2011 12:50:27 AM org.apache.tuscany.sca.node.impl.NodeFactoryImpl loadContributions
INFO: Loading contribution: <https://builds.apache.org/job/Tuscany-2x-deploy/ws/sca-2x/samples/getting-started/helloworld-webapp/src/main/webapp/WEB-INF/sca-contributions/.svn/>
Dec 6, 2011 12:50:27 AM org.apache.tuscany.sca.core.assembly.impl.DomainRegistryImpl addEndpoint
INFO: Add endpoint - binding.sca - HelloworldComponent/Helloworld
2011-12-06 00:50:27.759:WARN::failed SelectChannelConnector@0.0.0.0:8085: java.net.BindException:
Address already in use
2011-12-06 00:50:27.759:WARN::failed Server@6d68ac: java.net.BindException: Address already
in use
[JENKINS] Archiving disabled - not archiving <https://builds.apache.org/job/Tuscany-2x-deploy/ws/sca-2x/samples/getting-started/helloworld-webapp/pom.xml>
[INFO] ------------------------------------------------------------------------
[INFO] Reactor Summary:
[INFO] 
[INFO] Apache Tuscany SCA Implementation Project (2.x) ... SUCCESS [13.732s]
[INFO] Apache Tuscany SCA Implementation Modules ......... SUCCESS [5.879s]
[INFO] Apache Tuscany SCA Monitor ........................ SUCCESS [6.694s]
[INFO] Apache Tuscany SCA Extensibility .................. SUCCESS [5.465s]
[INFO] Apache Tuscany SCA Assembly Model ................. SUCCESS [16.089s]
[INFO] Apache Tuscany SCA Assembly Model XSD Files ....... SUCCESS [25.334s]
[INFO] Apache Tuscany SCA Common XML ..................... SUCCESS [53.303s]
[INFO] Apache Tuscany SCA API ............................ SUCCESS [31.750s]
[INFO] Apache Tuscany SCA Common Java .................... SUCCESS [25.255s]
[INFO] Apache Tuscany SCA Contribution Model ............. SUCCESS [14.791s]
[INFO] Apache Tuscany SCA Node API ....................... SUCCESS [13.142s]
[INFO] Apache Tuscany SCA Core SPI ....................... SUCCESS [26.010s]
[INFO] Apache Tuscany SCA XSD Model ...................... SUCCESS [6.623s]
[INFO] Apache Tuscany SCA Assembly XML Model ............. SUCCESS [6.144s]
[INFO] Apache Tuscany SCA WSDL Interface Model ........... SUCCESS [6.797s]
[INFO] Apache Tuscany SCA Interface Java Model ........... SUCCESS [6.711s]
[INFO] Apache Tuscany SCA Core Runtime ................... SUCCESS [7.818s]
[INFO] Apache Tuscany SCA DataBinding Framework .......... SUCCESS [5.994s]
[INFO] Apache Tuscany SCA DataBinding for JAXB ........... SUCCESS [7.625s]
[INFO] Apache Tuscany SCA Model Builders ................. SUCCESS [6.487s]
[INFO] Apache Tuscany SCA Deployment ..................... SUCCESS [6.304s]
[INFO] Apache Tuscany SCA WS Binding Model ............... SUCCESS [8.207s]
[INFO] Apache Tuscany SCA Interface Java For JAXWS ....... SUCCESS [10.830s]
[INFO] Apache Tuscany SCA Core/DataBinding Integration ... SUCCESS [5.271s]
[INFO] Apache Tuscany SCA Web Service binding WSDL Generator  SUCCESS [6.279s]
[INFO] Apache Tuscany SCA Binding SCA Runtime ............ SUCCESS [4.846s]
[INFO] Apache Tuscany SCA Implementation Java Model ...... SUCCESS [5.846s]
[INFO] Apache Tuscany SCA Implementation Java Runtime .... SUCCESS [5.060s]
[INFO] Apache Tuscany SCA Node Implementation ............ SUCCESS [5.462s]
[INFO] Apache Tuscany SCA Data API ....................... SUCCESS [3.934s]
[INFO] Apache Tuscany SCA Domain Node .................... SUCCESS [7.781s]
[INFO] Apache Tuscany SCA Web Implementation Model ....... SUCCESS [4.712s]
[INFO] Apache Tuscany SCA HTTP Servlet Host Extension Point  SUCCESS [5.023s]
[INFO] Apache Tuscany SCA Webapp Host .................... SUCCESS [4.308s]
[INFO] Apache Tuscany SCA Web Implementation Runtime ..... SUCCESS [4.578s]
[INFO] Apache Tuscany SCA Launcher ....................... SUCCESS [4.279s]
[INFO] Apache Tuscany SCA Client Impl .................... SUCCESS [5.812s]
[INFO] Apache Tuscany SCA Jetty Servlet Host Extension ... SUCCESS [4.755s]
[INFO] Apache Tuscany SCA Shell .......................... SUCCESS [4.963s]
[INFO] Apache Tuscany SCA Stripes Web Framework Integration  SUCCESS [4.582s]
[INFO] Apache Tuscany SCA Apache Wink JAX-RS Integration . SUCCESS [4.258s]
[INFO] Apache Tuscany SCA JAXWS-based WS Binding Extension  SUCCESS [4.807s]
[INFO] Apache Tuscany SCA JAXWS RI based WS Binding Extension  SUCCESS [6.862s]
[INFO] Apache Tuscany SCA Common HTTP .................... SUCCESS [3.859s]
[INFO] Apache Tuscany SCA Core Runtime POM ............... SUCCESS [2.214s]
[INFO] Apache Tuscany SCA Policy Security Model .......... SUCCESS [5.262s]
[INFO] Apache Tuscany SCA Atom Feed Binding Extension .... SUCCESS [4.590s]
[INFO] Apache Tuscany SCA Comet Binding Model ............ SUCCESS [4.590s]
[INFO] Apache Tuscany SCA CORBA Host Extension Point ..... SUCCESS [7.269s]
[INFO] Apache Tuscany SCA CORBA Binding Extension ........ SUCCESS [4.537s]
[INFO] Apache Tuscany SCA EJB Binding Model .............. SUCCESS [4.335s]
[INFO] Apache Tuscany SCA HTTP Binding Model ............. SUCCESS [4.479s]
[INFO] Apache Tuscany SCA JMS Binding Model .............. SUCCESS [5.130s]
[INFO] Apache Tuscany SCA JSONP Binding Model ............ SUCCESS [4.638s]
[INFO] Apache Tuscany SCA JSON-RPC Binding Model ......... SUCCESS [4.977s]
[INFO] Apache Tuscany SCA REST Binding Model ............. SUCCESS [5.727s]
[INFO] Apache Tuscany SCA RMI Binding Model .............. SUCCESS [3.900s]
[INFO] Apache Tuscany SCA BPEL Implementation Extension .. SUCCESS [5.104s]
[INFO] Apache Tuscany SCA Script Implementation Model .... SUCCESS [4.342s]
[INFO] Apache Tuscany SCA Spring Implementation Model .... SUCCESS [6.639s]
[INFO] Apache Tuscany SCA Widget Implementation Model .... SUCCESS [4.884s]
[INFO] Apache Tuscany SCA Base Runtime Jar ............... SUCCESS [7.843s]
[INFO] Apache Tuscany SCA EndPoint Registry using Hazelcast  SUCCESS [5.190s]
[INFO] Apache Tuscany Maven Tuscany Plugin ............... SUCCESS [5.379s]
[INFO] Create an SCA JAR contribution project ............ SUCCESS [6.098s]
[INFO] Create an SCA ZIP contribution project ............ SUCCESS [3.265s]
[INFO] Tuscany SCA ZIP contribution Shared Assembly Descriptor  SUCCESS [3.535s]
[INFO] Create a simple Apache Tuscany SCA webapp project . SUCCESS [3.828s]
[INFO] Create a Tuscany SCA and JSF project .............. SUCCESS [3.341s]
[INFO] Create a simple Apache Tuscany SCA webapp project using the Stripes Web Framework 
SUCCESS [3.863s]
[INFO] Create an SCA Webapp project using BPEL ........... SUCCESS [3.876s]
[INFO] Create a Tuscany binding extension project ........ SUCCESS [6.758s]
[INFO] Apache Tuscany SCA Maven Archetypes ............... SUCCESS [1.676s]
[INFO] Apache Tuscany SCA Web JavaScript ................. SUCCESS [4.317s]
[INFO] Apache Tuscany SCA Abdera Atom Feed Binding Extension  SUCCESS [7.549s]
[INFO] Apache Tuscany SCA JAX-RS Implementation Model .... SUCCESS [4.616s]
[INFO] Apache Tuscany SCA Python Implementation Model .... SUCCESS [5.363s]
[INFO] Apache Tuscany SCA Base Runtime POM ............... SUCCESS [2.825s]
[INFO] Apache Tuscany SCA Comet Binding Runtime .......... SUCCESS [5.613s]
[INFO] Apache Tuscany SCA EJB Binding Runtime ............ SUCCESS [5.776s]
[INFO] Apache Tuscany SCA Data Binding for JSON .......... SUCCESS [5.874s]
[INFO] Apache Tuscany SCA HTTP Binding Runtime ........... SUCCESS [6.582s]
[INFO] Apache Tuscany SCA JMS Binding Runtime ............ SUCCESS [5.896s]
[INFO] Apache Tuscany SCA JMS Binding Runtime AcytiveMQ .. SUCCESS [4.266s]
[INFO] Apache Tuscany SCA JSONP Binding Runtime .......... SUCCESS [4.580s]
[INFO] Apache Tuscany SCA JSON-RPC Binding Runtime ....... SUCCESS [6.317s]
[INFO] Apache Tuscany SCA Interface Java For JAX_RS ...... SUCCESS [4.794s]
[INFO] Apache Tuscany SCA REST Binding Runtime ........... SUCCESS [6.291s]
[INFO] Apache Tuscany SCA RMI Host Extension Point ....... SUCCESS [5.110s]
[INFO] Apache Tuscany SCA RMI Binding Extension .......... SUCCESS [4.594s]
[INFO] Apache Tuscany SCA Websocket Binding Extension .... SUCCESS [5.461s]
[INFO] Apache Tuscany SCA Policy WS-Policy Model ......... SUCCESS [7.447s]
[INFO] Apache Tuscany SCA Data Binding for Axiom ......... SUCCESS [6.219s]
[INFO] Apache Tuscany SCA Data Binding for JAXB-AXIOM .... SUCCESS [5.369s]
[INFO] Apache Tuscany SCA Axis2-1.5-based WS Binding Runtime  SUCCESS [6.225s]
[INFO] Apache Tuscany SCA Resource Import/Export Model ... SUCCESS [5.346s]
[INFO] Apache Tuscany SCA Data Binding for SDO ........... SUCCESS [10.134s]
[INFO] Apache Tuscany SCA Data Binding for SDO/AXIOM ..... SUCCESS [5.689s]
[INFO] Apache Tuscany SCA Tomcat Tribes Based EndPoint Registry  SUCCESS [5.075s]
[INFO] Apache Tuscany SCA Extensibility for Eclipse Equinox  SUCCESS [5.511s]
[INFO] Apache Tuscany SCA Node Equinox OSGi Launcher ..... SUCCESS [8.187s]
[INFO] Apache Tuscany SCA OSGi HTTP Service Based Servlet Host Extension  SUCCESS [5.527s]
[INFO] Apache Tuscany SCA BPEL ODE Implementation Extension  SUCCESS [8.194s]
[INFO] Apache Tuscany SCA JAX-RS Implementation Runtime .. SUCCESS [5.082s]
[INFO] Apache Tuscany SCA Python Implementation Extension  SUCCESS [4.457s]
[INFO] Apache Tuscany SCA Script Implementation Extension  SUCCESS [5.559s]
[INFO] Apache Tuscany SCA Spring Implementation Runtime Model  SUCCESS [7.494s]
[INFO] Apache Tuscany SCA Spring Implementation WebApp Integration  SUCCESS [5.566s]
[INFO] Apache Tuscany SCA Spring Implementation Runtime Stub  SUCCESS [4.511s]
[INFO] Apache Tuscany SCA Spring Implementation Runtime Tie  SUCCESS [4.623s]
[INFO] Apache Tuscany SCA Web Implementation Client ...... SUCCESS [4.742s]
[INFO] Apache Tuscany SCA Widget Implementation Runtime .. SUCCESS [4.117s]
[INFO] Apache Tuscany SCA Web JavaScript for DOJO ........ SUCCESS [21.690s]
[INFO] Apache Tuscany SCA Widget Implementation Runtime (Dojo)  SUCCESS [4.700s]
[INFO] Apache Tuscany SCA MyFaces JSF Integration ........ SUCCESS [4.391s]
[INFO] Apache Tuscany SCA Node Launcher .................. SUCCESS [6.608s]
[INFO] Apache Tuscany SCA Node Manager ................... SUCCESS [4.939s]
[INFO] Apache Tuscany SCA Extension Policy Logging Model . SUCCESS [5.690s]
[INFO] Apache Tuscany SCA Java JSR250 Implementation ..... SUCCESS [4.199s]
[INFO] Apache Tuscany SCA Transaction Policy Model ....... SUCCESS [5.093s]
[INFO] Apache Tuscany SCA Transaction Policy Runtime ..... SUCCESS [5.354s]
[INFO] Apache Tuscany SCA Transaction Policy Runtime (Geronimo)  SUCCESS [6.413s]
[INFO] Apache Tuscany SCA AOP-based Logging and Tracing .. SUCCESS [4.625s]
[INFO] Apache Tuscany SCA Contribution OSGi Bundle ....... SUCCESS [4.335s]
[INFO] Apache Tuscany SCA OSGi Implementation Extension .. SUCCESS [4.897s]
[INFO] Apache Tuscany SCA OSGi Implementation Extension Runtime  SUCCESS [4.104s]
[INFO] Apache Tuscany SCA OSGi Node Implementation ....... SUCCESS [7.393s]
[INFO] Apache Tuscany SCA JSE built-in CORBA Host ........ SUCCESS [5.489s]
[INFO] Apache Tuscany SCA JEE environment CORBA Host ..... SUCCESS [4.806s]
[INFO] Apache Tuscany SCA CORBA Binding Runtime .......... SUCCESS [5.827s]
[INFO] Apache Tuscany SCA Transient Name Server CORBA Host  SUCCESS [4.129s]
[INFO] Apache Tuscany SCA Composite Diagram Generator Application  SUCCESS [6.855s]
[INFO] Apache Tuscany SCA OSGi Runtime POM ............... SUCCESS [2.262s]
[INFO] Apache Tuscany SCA Samples ........................ SUCCESS [2.584s]
[INFO] Apache Tuscany SCA Samples Helloworld ............. SUCCESS [5.117s]
[INFO] Apache Tuscany SCA Samples Helloworld JAX-RS ...... SUCCESS [4.068s]
[INFO] Apache Tuscany SCA Samples Helloworld JSONP ....... SUCCESS [3.781s]
[INFO] Apache Tuscany SCA Samples Helloworld JSON-RPC .... SUCCESS [3.435s]
[INFO] Apache Tuscany SCA Samples Helloworld SCAClient ... SUCCESS [3.563s]
[INFO] Apache Tuscany SCA Samples Helloworld Spring ...... SUCCESS [3.632s]
[INFO] Apache Tuscany SCA Samples Helloworld WebApp ...... FAILURE [5.977s]
[INFO] Apache Tuscany SCA Samples Helloworld Web Service . SKIPPED
[INFO] Apache Tuscany SCA Samples Helloworld With Dependencies  SKIPPED
[INFO] Apache Tuscany SCA Samples Getting Started ........ SKIPPED
[INFO] Apache Tuscany SCA Samples Running Tuscany ........ SKIPPED
[INFO] Apache Tuscany SCA Samples JSE .................... SKIPPED
[INFO] Apache Tuscany SCA Samples JUnit .................. SKIPPED
[INFO] Apache Tuscany SCA Sample Async Invocation ........ SKIPPED
[INFO] Apache Tuscany SCA Sample Learning More ........... SKIPPED
[INFO] Apache Tuscany SCA Sample binding.comet ........... SKIPPED
[INFO] Apache Tuscany SCA Sample binding.comet Real-Time Suggestions Webapp  SKIPPED
[INFO] Apache Tuscany SCA Sample binding.comet Weather Monitor Webapp  SKIPPED
[INFO] Apache Tuscany SCA Sample binding.comet PubSub Webapp  SKIPPED
[INFO] Apache Tuscany SCA Sample binding.comet Chat Webapp  SKIPPED
[INFO] Apache Tuscany SCA Sample binding.websocket ....... SKIPPED
[INFO] Apache Tuscany SCA Sample binding.websocket Autocomplete Webapp  SKIPPED
[INFO] Apache Tuscany SCA Sample binding.websocket Weather Monitor Webapp  SKIPPED
[INFO] Apache Tuscany SCA Sample binding.websocket Chat Webapp  SKIPPED
[INFO] Apache Tuscany SCA Sample binding.websocket PubSub Webapp  SKIPPED
[INFO] Apache Tuscany SCA Sample Calculator OSGi ......... SKIPPED
[INFO] Apache Tuscany SCA All-in-one Distribution ........ SKIPPED
[INFO] ------------------------------------------------------------------------
[INFO] BUILD FAILURE
[INFO] ------------------------------------------------------------------------
[INFO] Total time: 17:53.041s
[INFO] Finished at: Tue Dec 06 00:50:28 UTC 2011
[INFO] Final Memory: 89M/745M
[INFO] ------------------------------------------------------------------------
mavenExecutionResult exceptions not empty
message : Failed to execute goal org.mortbay.jetty:maven-jetty-plugin:6.1.26:run (start-jetty)
on project helloworld-webapp: Failure
cause : Failure
Stack trace : 
org.apache.maven.lifecycle.LifecycleExecutionException: Failed to execute goal org.mortbay.jetty:maven-jetty-plugin:6.1.26:run
(start-jetty) on project helloworld-webapp: Failure
	at org.apache.maven.lifecycle.internal.MojoExecutor.execute(MojoExecutor.java:217)
	at org.apache.maven.lifecycle.internal.MojoExecutor.execute(MojoExecutor.java:153)
	at org.apache.maven.lifecycle.internal.MojoExecutor.execute(MojoExecutor.java:145)
	at org.apache.maven.lifecycle.internal.LifecycleModuleBuilder.buildProject(LifecycleModuleBuilder.java:84)
	at org.apache.maven.lifecycle.internal.LifecycleModuleBuilder.buildProject(LifecycleModuleBuilder.java:59)
	at org.apache.maven.lifecycle.internal.LifecycleStarter.singleThreadedBuild(LifecycleStarter.java:183)
	at org.apache.maven.lifecycle.internal.LifecycleStarter.execute(LifecycleStarter.java:161)
	at org.apache.maven.DefaultMaven.doExecute(DefaultMaven.java:319)
	at org.apache.maven.DefaultMaven.execute(DefaultMaven.java:156)
	at org.jvnet.hudson.maven3.launcher.Maven3Launcher.main(Maven3Launcher.java:79)
	at sun.reflect.NativeMethodAccessorImpl.invoke0(Native Method)
	at sun.reflect.NativeMethodAccessorImpl.invoke(NativeMethodAccessorImpl.java:39)
	at sun.reflect.DelegatingMethodAccessorImpl.invoke(DelegatingMethodAccessorImpl.java:25)
	at java.lang.reflect.Method.invoke(Method.java:597)
	at org.codehaus.plexus.classworlds.launcher.Launcher.launchStandard(Launcher.java:329)
	at org.codehaus.plexus.classworlds.launcher.Launcher.launch(Launcher.java:239)
	at org.jvnet.hudson.maven3.agent.Maven3Main.launch(Maven3Main.java:158)
	at hudson.maven.Maven3Builder.call(Maven3Builder.java:122)
	at hudson.maven.Maven3Builder.call(Maven3Builder.java:74)
	at hudson.remoting.UserRequest.perform(UserRequest.java:118)
	at hudson.remoting.UserRequest.perform(UserRequest.java:48)
	at hudson.remoting.Request$2.run(Request.java:287)
	at java.util.concurrent.Executors$RunnableAdapter.call(Executors.java:441)
	at java.util.concurrent.FutureTask$Sync.innerRun(FutureTask.java:303)
	at java.util.concurrent.FutureTask.run(FutureTask.java:138)
	at java.util.concurrent.ThreadPoolExecutor$Worker.runTask(ThreadPoolExecutor.java:886)
	at java.util.concurrent.ThreadPoolExecutor$Worker.run(ThreadPoolExecutor.java:908)
	at java.lang.Thread.run(Thread.java:662)
Caused by: org.apache.maven.plugin.MojoExecutionException: Failure
	at org.mortbay.jetty.plugin.AbstractJettyMojo.startJetty(AbstractJettyMojo.java:479)
	at org.mortbay.jetty.plugin.AbstractJettyMojo.execute(AbstractJettyMojo.java:396)
	at org.mortbay.jetty.plugin.AbstractJettyRunMojo.execute(AbstractJettyRunMojo.java:210)
	at org.mortbay.jetty.plugin.Jetty6RunMojo.execute(Jetty6RunMojo.java:184)
	at org.apache.maven.plugin.DefaultBuildPluginManager.executeMojo(DefaultBuildPluginManager.java:101)
	at org.apache.maven.lifecycle.internal.MojoExecutor.execute(MojoExecutor.java:209)
	... 27 more
Caused by: java.net.BindException: Address already in use
	at sun.nio.ch.Net.bind(Native Method)
	at sun.nio.ch.ServerSocketChannelImpl.bind(ServerSocketChannelImpl.java:126)
	at sun.nio.ch.ServerSocketAdaptor.bind(ServerSocketAdaptor.java:59)
	at org.mortbay.jetty.nio.SelectChannelConnector.open(SelectChannelConnector.java:216)
	at org.mortbay.jetty.nio.SelectChannelConnector.doStart(SelectChannelConnector.java:315)
	at org.mortbay.component.AbstractLifeCycle.start(AbstractLifeCycle.java:50)
	at org.mortbay.jetty.Server.doStart(Server.java:235)
	at org.mortbay.component.AbstractLifeCycle.start(AbstractLifeCycle.java:50)
	at org.mortbay.jetty.plugin.Jetty6PluginServer.start(Jetty6PluginServer.java:132)
	at org.mortbay.jetty.plugin.AbstractJettyMojo.startJetty(AbstractJettyMojo.java:454)
	... 32 more
Sending e-mails to: commits@tuscany.apache.org
channel stopped
2011-12-06 00:50:30.080:INFO::Shutdown hook executing
2011-12-06 00:50:30.080:INFO::Stopped SelectChannelConnector@0.0.0.0:8085
2011-12-06 00:50:30.835:INFO::Shutdown hook complete


Mime
View raw message