tuscany-commits mailing list archives

Site index · List index
Message view « Date » · « Thread »
Top « Date » · « Thread »
From Apache Jenkins Server <jenk...@builds.apache.org>
Subject Build failed in Jenkins: Tuscany-2x-deploy #823
Date Sun, 10 Jun 2012 01:18:22 GMT
See <https://builds.apache.org/job/Tuscany-2x-deploy/823/>

------------------------------------------
[...truncated 3851 lines...]
[JENKINS] Archiving disabled - not archiving <https://builds.apache.org/job/Tuscany-2x-deploy/ws/sca-2x/maven/archetypes/pom.xml>
[JENKINS] Archiving disabled - not archiving <https://builds.apache.org/job/Tuscany-2x-deploy/ws/.repository/org/apache/tuscany/sca/tuscany-archetype/2.0-SNAPSHOT/tuscany-archetype-2.0-SNAPSHOT.pom>
[INFO] ------------------------------------------------------------------------
[INFO] Building Apache Tuscany SCA Web JavaScript
[INFO]    task-segment: [clean, deploy]
[INFO] ------------------------------------------------------------------------
[INFO] [clean:clean {execution: default-clean}]
[INFO] Deleting <https://builds.apache.org/job/Tuscany-2x-deploy/ws/sca-2x/modules/web-javascript/target>
[INFO] [enforcer:enforce {execution: enforce-plugin-versions}]
[INFO] [remote-resources:process {execution: default}]
[INFO] [resources:resources {execution: default-resources}]
[INFO] Using 'UTF-8' encoding to copy filtered resources.
[INFO] Copying 3 resources
[INFO] Copying 3 resources
[INFO] Copying 3 resources
[INFO] [compiler:compile {execution: default-compile}]
[INFO] Compiling 6 source files to <https://builds.apache.org/job/Tuscany-2x-deploy/ws/sca-2x/modules/web-javascript/target/classes>
[INFO] [resources:testResources {execution: default-testResources}]
[INFO] Using 'UTF-8' encoding to copy filtered resources.
[INFO] skip non existing resourceDirectory <https://builds.apache.org/job/Tuscany-2x-deploy/ws/sca-2x/modules/web-javascript/src/test/resources>
[INFO] Copying 3 resources
[INFO] [compiler:testCompile {execution: default-testCompile}]
[INFO] No sources to compile
[INFO] [surefire:test {execution: default-test}]
[INFO] Tests are skipped.
[INFO] [jar:jar {execution: default-jar}]
[INFO] Building jar: <https://builds.apache.org/job/Tuscany-2x-deploy/ws/sca-2x/modules/web-javascript/target/tuscany-web-javascript-2.0-SNAPSHOT.jar>
[INFO] [source:jar-no-fork {execution: attach-sources}]
[INFO] Building jar: <https://builds.apache.org/job/Tuscany-2x-deploy/ws/sca-2x/modules/web-javascript/target/tuscany-web-javascript-2.0-SNAPSHOT-sources.jar>
[INFO] [install:install {execution: default-install}]
[INFO] Installing <https://builds.apache.org/job/Tuscany-2x-deploy/ws/sca-2x/modules/web-javascript/target/tuscany-web-javascript-2.0-SNAPSHOT.jar>
to <https://builds.apache.org/job/Tuscany-2x-deploy/ws/.repository/org/apache/tuscany/sca/tuscany-web-javascript/2.0-SNAPSHOT/tuscany-web-javascript-2.0-SNAPSHOT.jar>
[INFO] Installing <https://builds.apache.org/job/Tuscany-2x-deploy/ws/sca-2x/modules/web-javascript/target/tuscany-web-javascript-2.0-SNAPSHOT-sources.jar>
to <https://builds.apache.org/job/Tuscany-2x-deploy/ws/.repository/org/apache/tuscany/sca/tuscany-web-javascript/2.0-SNAPSHOT/tuscany-web-javascript-2.0-SNAPSHOT-sources.jar>
[INFO] [deploy:deploy {execution: default-deploy}]
[INFO] Retrieving previous build number from apache.snapshots.https
[WARNING] *** CHECKSUM FAILED - Checksum failed on download: local = 'ef91ec23463eb9839075673599ce7e1c56c2299e';
remote = '28b850481fbfbb546ea4455ab7ceb10eb4d41b49' - RETRYING
[WARNING] *** CHECKSUM FAILED - Checksum failed on download: local = 'ef91ec23463eb9839075673599ce7e1c56c2299e';
remote = '28b850481fbfbb546ea4455ab7ceb10eb4d41b49' - IGNORING
Uploading: https://repository.apache.org/content/repositories/snapshots/org/apache/tuscany/sca/tuscany-web-javascript/2.0-SNAPSHOT/tuscany-web-javascript-2.0-SNAPSHOT.jar
22K uploaded  (tuscany-web-javascript-2.0-SNAPSHOT.jar)
[INFO] Retrieving previous metadata from apache.snapshots.https
[WARNING] *** CHECKSUM FAILED - Checksum failed on download: local = 'ef91ec23463eb9839075673599ce7e1c56c2299e';
remote = '28b850481fbfbb546ea4455ab7ceb10eb4d41b49' - RETRYING
[WARNING] *** CHECKSUM FAILED - Checksum failed on download: local = 'ef91ec23463eb9839075673599ce7e1c56c2299e';
remote = '28b850481fbfbb546ea4455ab7ceb10eb4d41b49' - IGNORING
[INFO] Uploading repository metadata for: 'snapshot org.apache.tuscany.sca:tuscany-web-javascript:2.0-SNAPSHOT'
[INFO] Uploading project information for tuscany-web-javascript 2.0-SNAPSHOT
[INFO] Retrieving previous metadata from apache.snapshots.https
[INFO] Uploading repository metadata for: 'artifact org.apache.tuscany.sca:tuscany-web-javascript'
[INFO] Retrieving previous build number from apache.snapshots.https
Uploading: https://repository.apache.org/content/repositories/snapshots/org/apache/tuscany/sca/tuscany-web-javascript/2.0-SNAPSHOT/tuscany-web-javascript-2.0-SNAPSHOT-sources.jar
21K uploaded  (tuscany-web-javascript-2.0-SNAPSHOT-sources.jar)
[JENKINS] Archiving disabled - not archiving <https://builds.apache.org/job/Tuscany-2x-deploy/ws/sca-2x/modules/web-javascript/pom.xml>
[JENKINS] Archiving disabled - not archiving <https://builds.apache.org/job/Tuscany-2x-deploy/ws/sca-2x/modules/web-javascript/target/tuscany-web-javascript-2.0-SNAPSHOT.jar>
[JENKINS] Archiving disabled - not archiving <https://builds.apache.org/job/Tuscany-2x-deploy/ws/sca-2x/modules/web-javascript/target/tuscany-web-javascript-2.0-SNAPSHOT-sources.jar>
[INFO] ------------------------------------------------------------------------
[INFO] Building Apache Tuscany SCA Abdera Atom Feed Binding Extension
[INFO]    task-segment: [clean, deploy]
[INFO] ------------------------------------------------------------------------
[INFO] [clean:clean {execution: default-clean}]
[INFO] Deleting <https://builds.apache.org/job/Tuscany-2x-deploy/ws/sca-2x/modules/binding-atom-runtime/target>
[INFO] [enforcer:enforce {execution: enforce-plugin-versions}]
[INFO] [remote-resources:process {execution: default}]
[INFO] [resources:resources {execution: default-resources}]
[INFO] Using 'UTF-8' encoding to copy filtered resources.
[INFO] Copying 2 resources
[INFO] Copying 3 resources
[INFO] Copying 3 resources
[INFO] [compiler:compile {execution: default-compile}]
[INFO] Compiling 11 source files to <https://builds.apache.org/job/Tuscany-2x-deploy/ws/sca-2x/modules/binding-atom-runtime/target/classes>
[INFO] [resources:testResources {execution: default-testResources}]
[INFO] Using 'UTF-8' encoding to copy filtered resources.
[INFO] Copying 8 resources
[INFO] Copying 3 resources
[INFO] [compiler:testCompile {execution: default-testCompile}]
[INFO] Compiling 29 source files to <https://builds.apache.org/job/Tuscany-2x-deploy/ws/sca-2x/modules/binding-atom-runtime/target/test-classes>
[INFO] [surefire:test {execution: default-test}]
[INFO] Tests are skipped.
[INFO] [jar:jar {execution: default-jar}]
[INFO] Building jar: <https://builds.apache.org/job/Tuscany-2x-deploy/ws/sca-2x/modules/binding-atom-runtime/target/tuscany-binding-atom-runtime-2.0-SNAPSHOT.jar>
[INFO] [source:jar-no-fork {execution: attach-sources}]
[INFO] Building jar: <https://builds.apache.org/job/Tuscany-2x-deploy/ws/sca-2x/modules/binding-atom-runtime/target/tuscany-binding-atom-runtime-2.0-SNAPSHOT-sources.jar>
[INFO] [install:install {execution: default-install}]
[INFO] Installing <https://builds.apache.org/job/Tuscany-2x-deploy/ws/sca-2x/modules/binding-atom-runtime/target/tuscany-binding-atom-runtime-2.0-SNAPSHOT.jar>
to <https://builds.apache.org/job/Tuscany-2x-deploy/ws/.repository/org/apache/tuscany/sca/tuscany-binding-atom-runtime/2.0-SNAPSHOT/tuscany-binding-atom-runtime-2.0-SNAPSHOT.jar>
[INFO] Installing <https://builds.apache.org/job/Tuscany-2x-deploy/ws/sca-2x/modules/binding-atom-runtime/target/tuscany-binding-atom-runtime-2.0-SNAPSHOT-sources.jar>
to <https://builds.apache.org/job/Tuscany-2x-deploy/ws/.repository/org/apache/tuscany/sca/tuscany-binding-atom-runtime/2.0-SNAPSHOT/tuscany-binding-atom-runtime-2.0-SNAPSHOT-sources.jar>
[INFO] [deploy:deploy {execution: default-deploy}]
[INFO] Retrieving previous build number from apache.snapshots.https
[WARNING] *** CHECKSUM FAILED - Checksum failed on download: local = '9cbba30636f1da17787cc768f6102fbd77eb9a1a';
remote = '0c1e8d261e1d4bdda1363decc64118a3c704a977' - RETRYING
[WARNING] *** CHECKSUM FAILED - Checksum failed on download: local = '9cbba30636f1da17787cc768f6102fbd77eb9a1a';
remote = '0c1e8d261e1d4bdda1363decc64118a3c704a977' - IGNORING
Uploading: https://repository.apache.org/content/repositories/snapshots/org/apache/tuscany/sca/tuscany-binding-atom-runtime/2.0-SNAPSHOT/tuscany-binding-atom-runtime-2.0-SNAPSHOT.jar
54K uploaded  (tuscany-binding-atom-runtime-2.0-SNAPSHOT.jar)
[INFO] Uploading project information for tuscany-binding-atom-runtime 2.0-SNAPSHOT
[INFO] Retrieving previous metadata from apache.snapshots.https
[WARNING] *** CHECKSUM FAILED - Checksum failed on download: local = '9cbba30636f1da17787cc768f6102fbd77eb9a1a';
remote = '0c1e8d261e1d4bdda1363decc64118a3c704a977' - RETRYING
[WARNING] *** CHECKSUM FAILED - Checksum failed on download: local = '9cbba30636f1da17787cc768f6102fbd77eb9a1a';
remote = '0c1e8d261e1d4bdda1363decc64118a3c704a977' - IGNORING
[INFO] Uploading repository metadata for: 'snapshot org.apache.tuscany.sca:tuscany-binding-atom-runtime:2.0-SNAPSHOT'
[INFO] Retrieving previous metadata from apache.snapshots.https
[INFO] Uploading repository metadata for: 'artifact org.apache.tuscany.sca:tuscany-binding-atom-runtime'
[INFO] Retrieving previous build number from apache.snapshots.https
Uploading: https://repository.apache.org/content/repositories/snapshots/org/apache/tuscany/sca/tuscany-binding-atom-runtime/2.0-SNAPSHOT/tuscany-binding-atom-runtime-2.0-SNAPSHOT-sources.jar
35K uploaded  (tuscany-binding-atom-runtime-2.0-SNAPSHOT-sources.jar)
[JENKINS] Archiving disabled - not archiving <https://builds.apache.org/job/Tuscany-2x-deploy/ws/sca-2x/modules/binding-atom-runtime/pom.xml>
[JENKINS] Archiving disabled - not archiving <https://builds.apache.org/job/Tuscany-2x-deploy/ws/sca-2x/modules/binding-atom-runtime/target/tuscany-binding-atom-runtime-2.0-SNAPSHOT.jar>
[JENKINS] Archiving disabled - not archiving <https://builds.apache.org/job/Tuscany-2x-deploy/ws/sca-2x/modules/binding-atom-runtime/target/tuscany-binding-atom-runtime-2.0-SNAPSHOT-sources.jar>
[INFO] ------------------------------------------------------------------------
[INFO] Building Apache Tuscany SCA JAX-RS Implementation Model
[INFO]    task-segment: [clean, deploy]
[INFO] ------------------------------------------------------------------------
[INFO] [clean:clean {execution: default-clean}]
[INFO] Deleting <https://builds.apache.org/job/Tuscany-2x-deploy/ws/sca-2x/modules/implementation-jaxrs/target>
[INFO] [enforcer:enforce {execution: enforce-plugin-versions}]
[INFO] [remote-resources:process {execution: default}]
[INFO] [resources:resources {execution: default-resources}]
[INFO] Using 'UTF-8' encoding to copy filtered resources.
[INFO] Copying 4 resources
[INFO] Copying 3 resources
[INFO] Copying 3 resources
[INFO] [compiler:compile {execution: default-compile}]
[INFO] Compiling 5 source files to <https://builds.apache.org/job/Tuscany-2x-deploy/ws/sca-2x/modules/implementation-jaxrs/target/classes>
[INFO] [resources:testResources {execution: default-testResources}]
[INFO] Using 'UTF-8' encoding to copy filtered resources.
[INFO] Copying 1 resource
[INFO] Copying 3 resources
[INFO] [compiler:testCompile {execution: default-testCompile}]
[INFO] Compiling 2 source files to <https://builds.apache.org/job/Tuscany-2x-deploy/ws/sca-2x/modules/implementation-jaxrs/target/test-classes>
[INFO] [surefire:test {execution: default-test}]
[INFO] Tests are skipped.
[INFO] [jar:jar {execution: default-jar}]
[INFO] Building jar: <https://builds.apache.org/job/Tuscany-2x-deploy/ws/sca-2x/modules/implementation-jaxrs/target/tuscany-implementation-jaxrs-2.0-SNAPSHOT.jar>
[INFO] [source:jar-no-fork {execution: attach-sources}]
[INFO] Building jar: <https://builds.apache.org/job/Tuscany-2x-deploy/ws/sca-2x/modules/implementation-jaxrs/target/tuscany-implementation-jaxrs-2.0-SNAPSHOT-sources.jar>
[INFO] [install:install {execution: default-install}]
[INFO] Installing <https://builds.apache.org/job/Tuscany-2x-deploy/ws/sca-2x/modules/implementation-jaxrs/target/tuscany-implementation-jaxrs-2.0-SNAPSHOT.jar>
to <https://builds.apache.org/job/Tuscany-2x-deploy/ws/.repository/org/apache/tuscany/sca/tuscany-implementation-jaxrs/2.0-SNAPSHOT/tuscany-implementation-jaxrs-2.0-SNAPSHOT.jar>
[INFO] Installing <https://builds.apache.org/job/Tuscany-2x-deploy/ws/sca-2x/modules/implementation-jaxrs/target/tuscany-implementation-jaxrs-2.0-SNAPSHOT-sources.jar>
to <https://builds.apache.org/job/Tuscany-2x-deploy/ws/.repository/org/apache/tuscany/sca/tuscany-implementation-jaxrs/2.0-SNAPSHOT/tuscany-implementation-jaxrs-2.0-SNAPSHOT-sources.jar>
[INFO] [deploy:deploy {execution: default-deploy}]
[INFO] Retrieving previous build number from apache.snapshots.https
[WARNING] *** CHECKSUM FAILED - Checksum failed on download: local = 'f5cab52e674a0c19d0989667d2502fca916dffce';
remote = 'e902927f67d51b0fe85d8411f75b059ed0adc808' - RETRYING
[WARNING] *** CHECKSUM FAILED - Checksum failed on download: local = 'f5cab52e674a0c19d0989667d2502fca916dffce';
remote = 'e902927f67d51b0fe85d8411f75b059ed0adc808' - IGNORING
Uploading: https://repository.apache.org/content/repositories/snapshots/org/apache/tuscany/sca/tuscany-implementation-jaxrs/2.0-SNAPSHOT/tuscany-implementation-jaxrs-2.0-SNAPSHOT.jar
22K uploaded  (tuscany-implementation-jaxrs-2.0-SNAPSHOT.jar)
[INFO] Uploading project information for tuscany-implementation-jaxrs 2.0-SNAPSHOT
[INFO] Retrieving previous metadata from apache.snapshots.https
[WARNING] *** CHECKSUM FAILED - Checksum failed on download: local = 'f5cab52e674a0c19d0989667d2502fca916dffce';
remote = 'e902927f67d51b0fe85d8411f75b059ed0adc808' - RETRYING
[WARNING] *** CHECKSUM FAILED - Checksum failed on download: local = 'f5cab52e674a0c19d0989667d2502fca916dffce';
remote = 'e902927f67d51b0fe85d8411f75b059ed0adc808' - IGNORING
[INFO] Uploading repository metadata for: 'snapshot org.apache.tuscany.sca:tuscany-implementation-jaxrs:2.0-SNAPSHOT'
[INFO] Retrieving previous metadata from apache.snapshots.https
[INFO] Uploading repository metadata for: 'artifact org.apache.tuscany.sca:tuscany-implementation-jaxrs'
[INFO] Retrieving previous build number from apache.snapshots.https
Uploading: https://repository.apache.org/content/repositories/snapshots/org/apache/tuscany/sca/tuscany-implementation-jaxrs/2.0-SNAPSHOT/tuscany-implementation-jaxrs-2.0-SNAPSHOT-sources.jar
19K uploaded  (tuscany-implementation-jaxrs-2.0-SNAPSHOT-sources.jar)
[JENKINS] Archiving disabled - not archiving <https://builds.apache.org/job/Tuscany-2x-deploy/ws/sca-2x/modules/implementation-jaxrs/pom.xml>
[JENKINS] Archiving disabled - not archiving <https://builds.apache.org/job/Tuscany-2x-deploy/ws/sca-2x/modules/implementation-jaxrs/target/tuscany-implementation-jaxrs-2.0-SNAPSHOT.jar>
[JENKINS] Archiving disabled - not archiving <https://builds.apache.org/job/Tuscany-2x-deploy/ws/sca-2x/modules/implementation-jaxrs/target/tuscany-implementation-jaxrs-2.0-SNAPSHOT-sources.jar>
[INFO] ------------------------------------------------------------------------
[INFO] Building Apache Tuscany SCA Python Implementation Model
[INFO]    task-segment: [clean, deploy]
[INFO] ------------------------------------------------------------------------
[INFO] [clean:clean {execution: default-clean}]
[INFO] Deleting <https://builds.apache.org/job/Tuscany-2x-deploy/ws/sca-2x/modules/implementation-python/target>
[INFO] [enforcer:enforce {execution: enforce-plugin-versions}]
[INFO] [remote-resources:process {execution: default}]
[INFO] [resources:resources {execution: default-resources}]
[INFO] Using 'UTF-8' encoding to copy filtered resources.
[INFO] Copying 3 resources
[INFO] Copying 3 resources
[INFO] Copying 3 resources
[INFO] [compiler:compile {execution: default-compile}]
[INFO] Compiling 4 source files to <https://builds.apache.org/job/Tuscany-2x-deploy/ws/sca-2x/modules/implementation-python/target/classes>
[INFO] [resources:testResources {execution: default-testResources}]
[INFO] Using 'UTF-8' encoding to copy filtered resources.
[INFO] Copying 1 resource
[INFO] Copying 3 resources
[INFO] [compiler:testCompile {execution: default-testCompile}]
[INFO] Compiling 1 source file to <https://builds.apache.org/job/Tuscany-2x-deploy/ws/sca-2x/modules/implementation-python/target/test-classes>
[INFO] [surefire:test {execution: default-test}]
[INFO] Tests are skipped.
[INFO] [jar:jar {execution: default-jar}]
[INFO] Building jar: <https://builds.apache.org/job/Tuscany-2x-deploy/ws/sca-2x/modules/implementation-python/target/tuscany-implementation-python-2.0-SNAPSHOT.jar>
[INFO] [source:jar-no-fork {execution: attach-sources}]
[INFO] Building jar: <https://builds.apache.org/job/Tuscany-2x-deploy/ws/sca-2x/modules/implementation-python/target/tuscany-implementation-python-2.0-SNAPSHOT-sources.jar>
[INFO] [install:install {execution: default-install}]
[INFO] Installing <https://builds.apache.org/job/Tuscany-2x-deploy/ws/sca-2x/modules/implementation-python/target/tuscany-implementation-python-2.0-SNAPSHOT.jar>
to <https://builds.apache.org/job/Tuscany-2x-deploy/ws/.repository/org/apache/tuscany/sca/tuscany-implementation-python/2.0-SNAPSHOT/tuscany-implementation-python-2.0-SNAPSHOT.jar>
[INFO] Installing <https://builds.apache.org/job/Tuscany-2x-deploy/ws/sca-2x/modules/implementation-python/target/tuscany-implementation-python-2.0-SNAPSHOT-sources.jar>
to <https://builds.apache.org/job/Tuscany-2x-deploy/ws/.repository/org/apache/tuscany/sca/tuscany-implementation-python/2.0-SNAPSHOT/tuscany-implementation-python-2.0-SNAPSHOT-sources.jar>
[INFO] [deploy:deploy {execution: default-deploy}]
[INFO] Retrieving previous build number from apache.snapshots.https
[WARNING] *** CHECKSUM FAILED - Checksum failed on download: local = '886a41e3f5d2933f7a4a667e88e097ee80ff592d';
remote = 'de9e7147ac3aa7e11d23db9008ab743467ad6ea6' - RETRYING
[WARNING] *** CHECKSUM FAILED - Checksum failed on download: local = '886a41e3f5d2933f7a4a667e88e097ee80ff592d';
remote = 'de9e7147ac3aa7e11d23db9008ab743467ad6ea6' - IGNORING
Uploading: https://repository.apache.org/content/repositories/snapshots/org/apache/tuscany/sca/tuscany-implementation-python/2.0-SNAPSHOT/tuscany-implementation-python-2.0-SNAPSHOT.jar
22K uploaded  (tuscany-implementation-python-2.0-SNAPSHOT.jar)
[INFO] Retrieving previous metadata from apache.snapshots.https
[WARNING] *** CHECKSUM FAILED - Checksum failed on download: local = '886a41e3f5d2933f7a4a667e88e097ee80ff592d';
remote = 'de9e7147ac3aa7e11d23db9008ab743467ad6ea6' - RETRYING
[WARNING] *** CHECKSUM FAILED - Checksum failed on download: local = '886a41e3f5d2933f7a4a667e88e097ee80ff592d';
remote = 'de9e7147ac3aa7e11d23db9008ab743467ad6ea6' - IGNORING
[INFO] Uploading repository metadata for: 'snapshot org.apache.tuscany.sca:tuscany-implementation-python:2.0-SNAPSHOT'
[INFO] Uploading project information for tuscany-implementation-python 2.0-SNAPSHOT
[INFO] Retrieving previous metadata from apache.snapshots.https
[INFO] Uploading repository metadata for: 'artifact org.apache.tuscany.sca:tuscany-implementation-python'
[INFO] Retrieving previous build number from apache.snapshots.https
Uploading: https://repository.apache.org/content/repositories/snapshots/org/apache/tuscany/sca/tuscany-implementation-python/2.0-SNAPSHOT/tuscany-implementation-python-2.0-SNAPSHOT-sources.jar
17K uploaded  (tuscany-implementation-python-2.0-SNAPSHOT-sources.jar)
[JENKINS] Archiving disabled - not archiving <https://builds.apache.org/job/Tuscany-2x-deploy/ws/sca-2x/modules/implementation-python/pom.xml>
[JENKINS] Archiving disabled - not archiving <https://builds.apache.org/job/Tuscany-2x-deploy/ws/sca-2x/modules/implementation-python/target/tuscany-implementation-python-2.0-SNAPSHOT.jar>
[JENKINS] Archiving disabled - not archiving <https://builds.apache.org/job/Tuscany-2x-deploy/ws/sca-2x/modules/implementation-python/target/tuscany-implementation-python-2.0-SNAPSHOT-sources.jar>
[INFO] ------------------------------------------------------------------------
[INFO] Building Apache Tuscany SCA Base Runtime POM
[INFO]    task-segment: [clean, deploy]
[INFO] ------------------------------------------------------------------------
[INFO] [clean:clean {execution: default-clean}]
[INFO] Deleting <https://builds.apache.org/job/Tuscany-2x-deploy/ws/sca-2x/modules/base-runtime-pom/target>
[INFO] [enforcer:enforce {execution: enforce-plugin-versions}]
[INFO] [remote-resources:process {execution: default}]
[INFO] [site:attach-descriptor {execution: default-attach-descriptor}]
[INFO] [source:jar-no-fork {execution: attach-sources}]
[INFO] [install:install {execution: default-install}]
[INFO] Installing <https://builds.apache.org/job/Tuscany-2x-deploy/ws/sca-2x/modules/base-runtime-pom/pom.xml>
to <https://builds.apache.org/job/Tuscany-2x-deploy/ws/.repository/org/apache/tuscany/sca/tuscany-base-runtime-pom/2.0-SNAPSHOT/tuscany-base-runtime-pom-2.0-SNAPSHOT.pom>
[INFO] [deploy:deploy {execution: default-deploy}]
[INFO] Retrieving previous build number from apache.snapshots.https
[WARNING] *** CHECKSUM FAILED - Checksum failed on download: local = 'f39268eb29909321fa430bcb5b600b9347f4abe2';
remote = '7ecb907c28b896172bc014546ede253761a0e228' - RETRYING
[WARNING] *** CHECKSUM FAILED - Checksum failed on download: local = 'f39268eb29909321fa430bcb5b600b9347f4abe2';
remote = '7ecb907c28b896172bc014546ede253761a0e228' - IGNORING
Uploading: https://repository.apache.org/content/repositories/snapshots/org/apache/tuscany/sca/tuscany-base-runtime-pom/2.0-SNAPSHOT/tuscany-base-runtime-pom-2.0-SNAPSHOT.pom
8K uploaded  (tuscany-base-runtime-pom-2.0-SNAPSHOT.pom)
[INFO] Retrieving previous metadata from apache.snapshots.https
[INFO] Uploading repository metadata for: 'artifact org.apache.tuscany.sca:tuscany-base-runtime-pom'
[INFO] Retrieving previous metadata from apache.snapshots.https
[WARNING] *** CHECKSUM FAILED - Checksum failed on download: local = 'f39268eb29909321fa430bcb5b600b9347f4abe2';
remote = '7ecb907c28b896172bc014546ede253761a0e228' - RETRYING
[WARNING] *** CHECKSUM FAILED - Checksum failed on download: local = 'f39268eb29909321fa430bcb5b600b9347f4abe2';
remote = '7ecb907c28b896172bc014546ede253761a0e228' - IGNORING
[INFO] Uploading repository metadata for: 'snapshot org.apache.tuscany.sca:tuscany-base-runtime-pom:2.0-SNAPSHOT'
[JENKINS] Archiving disabled - not archiving <https://builds.apache.org/job/Tuscany-2x-deploy/ws/sca-2x/modules/base-runtime-pom/pom.xml>
[JENKINS] Archiving disabled - not archiving <https://builds.apache.org/job/Tuscany-2x-deploy/ws/.repository/org/apache/tuscany/sca/tuscany-base-runtime-pom/2.0-SNAPSHOT/tuscany-base-runtime-pom-2.0-SNAPSHOT.pom>
[INFO] ------------------------------------------------------------------------
[INFO] Building Apache Tuscany SCA Comet Binding Runtime
[INFO]    task-segment: [clean, deploy]
[INFO] ------------------------------------------------------------------------
[INFO] [clean:clean {execution: default-clean}]
[JENKINS] Archiving disabled - not archiving <https://builds.apache.org/job/Tuscany-2x-deploy/ws/sca-2x/modules/binding-comet-runtime/pom.xml>
[INFO] ------------------------------------------------------------------------
[ERROR] BUILD ERROR
[INFO] ------------------------------------------------------------------------
[INFO] Error building POM (may not be this project's POM).


Project ID: null:jersey-server:bundle:null

Reason: Cannot find parent: com.sun.jersey:jersey-project for project: null:jersey-server:bundle:null
for project null:jersey-server:bundle:null


[INFO] ------------------------------------------------------------------------
[INFO] For more information, run Maven with the -e switch
[INFO] ------------------------------------------------------------------------
[INFO] Total time: 32 minutes 45 seconds
[INFO] Finished at: Sun Jun 10 01:18:02 GMT+00:00 2012
[INFO] Final Memory: 175M/699M
[INFO] ------------------------------------------------------------------------
channel stopped

Mime
View raw message