tuscany-commits mailing list archives

Site index · List index
Message view « Date » · « Thread »
Top « Date » · « Thread »
From Apache Jenkins Server <jenk...@builds.apache.org>
Subject Build failed in Jenkins: Tuscany-2x-deploy #836
Date Wed, 20 Jun 2012 01:38:32 GMT
See <https://builds.apache.org/job/Tuscany-2x-deploy/836/changes>

Changes:

[lresende] Removing system.out

[lresende] Removing unused imports

[lresende] Updating store sample to use new widget implementation way to define how the resources
are exposed without using explicit binding configuration

[lresende] Enhancing widget invoker to handled more details of what resource is being requested.
This logic was present on a specific servlet from the binding, but makes more sense to be
together with the widget implementation

[lresende] Refactoring widget uri to avoid conflict with sca component uri

[lresende] Removing dead/unused code

[lresende] Renaming widget attribute to avoid any conflicts with sca component uri

[lresende] Adding test case for implementation widget processor

[lresende] Adding suppot for parsing uri as new attribute for implementation widget

[lresende] Removing unused imports

[lresende] Adding uri to implementation widget schema

[antelder] Add license header

[antelder] Format the code, no other changes

[antelder] Add a test to create composites programatically

[lresende] Adding policy archetype to build

[lresende] TUSCANY-4064 - Removing files that were truncated to 0 instead of deleted by patch
tool

[lresende] TUSCANY-4064 - Applying patch from Nitya Doraisamy to enhance policy maven archetype

[antelder] Make some error msgs generic as they swap around with different jdks

[antelder] Add snapshot repo definition so the build machine can run just the compliance tests

[antelder] Remove comet binding dependencies

[antelder] Remove comet binding while the binding is broken

[antelder] Remove comet samples while the binding is broken

[antelder] Take out the comet binding for now as it doesn't build because the remote maven
repos no longer include its dependencies correctly

[antelder] Update to use base jar not pom to see if that helps fix the jersymissing pom

[antelder] Remove jersy pom dependency as it didn't seem to help

[antelder] Add jersy pom dependency explicitly to try to get it picked up from thetuscany
repo

[antelder] Add jersy pom dependency explicitly to try to get it picked up from thetuscany
repo

[antelder] Update to avoid duplicated wire processors

[antelder] TUSCANY-4063: Apply updates from Andrew Potter to the README

[antelder] TUSCANY-4062: Apply updates from Andrew Potter to the samples README file

[antelder] TUSCANY-4057: updates from Andrew Potter to improve the INSTALL file

[antelder] TUSCANY-4058: Apply update from Andrew Potter to support IBM JDK

[antelder] TUSCANY-4058: Apply update from Andrew Potter to support IBM JDK

[antelder] Update release date

[antelder] Update release date

[antelder] Fix NPE with widget sample

[antelder] TUSCANY-4059: Apply update from Andrew Potter to fix build failure for itest/policy/reliability
with IBM JDK

[scottkurz] Check in the rest of TUSCANY-4054. Thanks Andrew.

[lresende] Cleaning up System.out prints

[lresende] Formatting and fixing identention

[lresende] Bringup store sample

[antelder] TUSCANY-4054: Apply fix from Andrew Potter to fix scdl itest with ibm jdk

[lresende] TUSCANY-4056 - Applying patch from Andrew Potter to fix cross patform file formatting
problems

[antelder] TUSCANY-4046: Add woodstox dependency

[rfeng] Add CORS support for servlet based impl with REST binding

[antelder] TUSCANY-4053: Apply update from Andrew Potter to fix itests building with the IBM
JDK

[antelder] TUSCANY-4045: Apply update from Andrew Potter to fix Module binding-ws-runtime-axis2
build failure with IBM JDK

------------------------------------------
[...truncated 7947 lines...]
[INFO] Uploading project information for sample-binding-websocket-pubsub-webapp 2.0-SNAPSHOT
[JENKINS] Archiving disabled - not archiving <https://builds.apache.org/job/Tuscany-2x-deploy/ws/sca-2x/samples/learning-more/binding-websocket/pubsub-webapp/pom.xml>
[JENKINS] Archiving disabled - not archiving <https://builds.apache.org/job/Tuscany-2x-deploy/ws/sca-2x/samples/learning-more/binding-websocket/pubsub-webapp/target/sample-binding-websocket-pubsub-webapp-2.0-SNAPSHOT.war>
[INFO] ------------------------------------------------------------------------
[INFO] Building Apache Tuscany SCA Sample Calculator OSGi
[INFO]    task-segment: [clean, deploy]
[INFO] ------------------------------------------------------------------------
[INFO] [clean:clean {execution: default-clean}]
[INFO] Deleting <https://builds.apache.org/job/Tuscany-2x-deploy/ws/sca-2x/samples/learning-more/contribution-osgi/target>
[INFO] [enforcer:enforce {execution: enforce-plugin-versions}]
[INFO] [remote-resources:process {execution: default}]
[INFO] [resources:resources {execution: default-resources}]
[INFO] Using 'UTF-8' encoding to copy filtered resources.
[INFO] Copying 1 resource
[INFO] Copying 1 resource
[INFO] Copying 3 resources
[INFO] [compiler:compile {execution: default-compile}]
[INFO] Compiling 12 source files to <https://builds.apache.org/job/Tuscany-2x-deploy/ws/sca-2x/samples/learning-more/contribution-osgi/target/classes>
[INFO] [resources:testResources {execution: default-testResources}]
[INFO] Using 'UTF-8' encoding to copy filtered resources.
[INFO] skip non existing resourceDirectory <https://builds.apache.org/job/Tuscany-2x-deploy/ws/sca-2x/samples/learning-more/contribution-osgi/src/test/resources>
[INFO] Copying 3 resources
[INFO] [compiler:testCompile {execution: default-testCompile}]
[INFO] Compiling 1 source file to <https://builds.apache.org/job/Tuscany-2x-deploy/ws/sca-2x/samples/learning-more/contribution-osgi/target/test-classes>
[INFO] [surefire:test {execution: default-test}]
[INFO] Tests are skipped.
[INFO] [jar:jar {execution: default-jar}]
[INFO] Building jar: <https://builds.apache.org/job/Tuscany-2x-deploy/ws/sca-2x/samples/learning-more/contribution-osgi/target/sample-contribution-osgi.jar>
[INFO] [install:install {execution: default-install}]
[INFO] Installing <https://builds.apache.org/job/Tuscany-2x-deploy/ws/sca-2x/samples/learning-more/contribution-osgi/target/sample-contribution-osgi.jar>
to <https://builds.apache.org/job/Tuscany-2x-deploy/ws/.repository/org/apache/tuscany/sca/samples/sample-contribution-osgi/2.0-SNAPSHOT/sample-contribution-osgi-2.0-SNAPSHOT.jar>
[INFO] [deploy:deploy {execution: default-deploy}]
[INFO] Retrieving previous build number from apache.snapshots.https
[WARNING] *** CHECKSUM FAILED - Checksum failed on download: local = 'f3c91e9c9ea84b7b25f92a6026819f1d12141b62';
remote = '3ba5845feac2d2e21795f847ebb812748e022cd3' - RETRYING
[WARNING] *** CHECKSUM FAILED - Checksum failed on download: local = 'f3c91e9c9ea84b7b25f92a6026819f1d12141b62';
remote = '3ba5845feac2d2e21795f847ebb812748e022cd3' - IGNORING
Uploading: https://repository.apache.org/content/repositories/snapshots/org/apache/tuscany/sca/samples/sample-contribution-osgi/2.0-SNAPSHOT/sample-contribution-osgi-2.0-SNAPSHOT.jar
17K uploaded  (sample-contribution-osgi-2.0-SNAPSHOT.jar)
[INFO] Retrieving previous metadata from apache.snapshots.https
[INFO] Uploading repository metadata for: 'artifact org.apache.tuscany.sca.samples:sample-contribution-osgi'
[INFO] Retrieving previous metadata from apache.snapshots.https
[WARNING] *** CHECKSUM FAILED - Checksum failed on download: local = 'f3c91e9c9ea84b7b25f92a6026819f1d12141b62';
remote = '3ba5845feac2d2e21795f847ebb812748e022cd3' - RETRYING
[WARNING] *** CHECKSUM FAILED - Checksum failed on download: local = 'f3c91e9c9ea84b7b25f92a6026819f1d12141b62';
remote = '3ba5845feac2d2e21795f847ebb812748e022cd3' - IGNORING
[INFO] Uploading repository metadata for: 'snapshot org.apache.tuscany.sca.samples:sample-contribution-osgi:2.0-SNAPSHOT'
[INFO] Uploading project information for sample-contribution-osgi 2.0-SNAPSHOT
[JENKINS] Archiving disabled - not archiving <https://builds.apache.org/job/Tuscany-2x-deploy/ws/sca-2x/samples/learning-more/contribution-osgi/pom.xml>
[JENKINS] Archiving disabled - not archiving <https://builds.apache.org/job/Tuscany-2x-deploy/ws/sca-2x/samples/learning-more/contribution-osgi/target/sample-contribution-osgi.jar>
[INFO] ------------------------------------------------------------------------
[INFO] Building Apache Tuscany SCA Sample OSGi Remote Services Calculator
[INFO]    task-segment: [clean, deploy]
[INFO] ------------------------------------------------------------------------
[INFO] [clean:clean {execution: default-clean}]
[INFO] Deleting <https://builds.apache.org/job/Tuscany-2x-deploy/ws/sca-2x/samples/learning-more/distributed-osgi-static/calculator-bundle/target>
[INFO] snapshot org.apache.tuscany.sca:tuscany-feature-ejava:2.0-SNAPSHOT: checking for updates
from apache.nexus
[INFO] snapshot org.apache.tuscany.sca:tuscany-feature-ejava:2.0-SNAPSHOT: checking for updates
from apache.snapshots
Downloading: http://repository.apache.org/snapshots/org/apache/tuscany/sca/tuscany-feature-ejava/2.0-SNAPSHOT/tuscany-feature-ejava-2.0-SNAPSHOT.pom
[INFO] snapshot org.apache.tuscany.sca:tuscany-feature:2.0-SNAPSHOT: checking for updates
from apache.nexus
[INFO] snapshot org.apache.tuscany.sca:tuscany-feature:2.0-SNAPSHOT: checking for updates
from apache.snapshots
Downloading: http://repository.apache.org/snapshots/org/apache/tuscany/sca/tuscany-feature/2.0-SNAPSHOT/tuscany-feature-2.0-SNAPSHOT.pom
[INFO] snapshot org.apache.tuscany.sca:tuscany-feature-core:2.0-SNAPSHOT: checking for updates
from apache.nexus
[INFO] snapshot org.apache.tuscany.sca:tuscany-feature-core:2.0-SNAPSHOT: checking for updates
from apache.snapshots
Downloading: http://repository.apache.org/snapshots/org/apache/tuscany/sca/tuscany-feature-core/2.0-SNAPSHOT/tuscany-feature-core-2.0-SNAPSHOT.pom
[INFO] snapshot org.apache.tuscany.sca:tuscany-feature-api:2.0-SNAPSHOT: checking for updates
from apache.nexus
[INFO] snapshot org.apache.tuscany.sca:tuscany-feature-api:2.0-SNAPSHOT: checking for updates
from apache.snapshots
Downloading: http://repository.apache.org/snapshots/org/apache/tuscany/sca/tuscany-feature-api/2.0-SNAPSHOT/tuscany-feature-api-2.0-SNAPSHOT.pom
[INFO] snapshot org.apache.tuscany.sca:tuscany-feature-webservice:2.0-SNAPSHOT: checking for
updates from apache.nexus
[INFO] snapshot org.apache.tuscany.sca:tuscany-feature-webservice:2.0-SNAPSHOT: checking for
updates from apache.snapshots
Downloading: http://repository.apache.org/snapshots/org/apache/tuscany/sca/tuscany-feature-webservice/2.0-SNAPSHOT/tuscany-feature-webservice-2.0-SNAPSHOT.pom
[INFO] snapshot org.apache.tuscany.sca:tuscany-extensibility-equinox:2.0-SNAPSHOT: checking
for updates from apache.nexus
[INFO] snapshot org.apache.tuscany.sca:tuscany-extensibility-equinox:2.0-SNAPSHOT: checking
for updates from apache.snapshots
[INFO] snapshot org.apache.tuscany.sca:tuscany-node-launcher:2.0-SNAPSHOT: checking for updates
from apache.nexus
[INFO] snapshot org.apache.tuscany.sca:tuscany-node-launcher:2.0-SNAPSHOT: checking for updates
from apache.snapshots
[INFO] snapshot org.apache.tuscany.sca:tuscany-binding-rmi-runtime:2.0-SNAPSHOT: checking
for updates from apache.nexus
[INFO] snapshot org.apache.tuscany.sca:tuscany-binding-rmi-runtime:2.0-SNAPSHOT: checking
for updates from apache.snapshots
[INFO] snapshot org.apache.tuscany.sca:tuscany-host-rmi:2.0-SNAPSHOT: checking for updates
from apache.nexus
[INFO] snapshot org.apache.tuscany.sca:tuscany-host-rmi:2.0-SNAPSHOT: checking for updates
from apache.snapshots
[INFO] snapshot org.apache.tuscany.sca:tuscany-binding-corba-runtime:2.0-SNAPSHOT: checking
for updates from apache.nexus
[INFO] snapshot org.apache.tuscany.sca:tuscany-binding-corba-runtime:2.0-SNAPSHOT: checking
for updates from apache.snapshots
[INFO] snapshot org.apache.tuscany.sca:tuscany-host-corba-jee:2.0-SNAPSHOT: checking for updates
from apache.nexus
[INFO] snapshot org.apache.tuscany.sca:tuscany-host-corba-jee:2.0-SNAPSHOT: checking for updates
from apache.snapshots
[INFO] snapshot org.apache.tuscany.sca:tuscany-host-corba-jse:2.0-SNAPSHOT: checking for updates
from apache.nexus
[INFO] snapshot org.apache.tuscany.sca:tuscany-host-corba-jse:2.0-SNAPSHOT: checking for updates
from apache.snapshots
[INFO] snapshot org.apache.tuscany.sca:tuscany-host-corba-jse-tns:2.0-SNAPSHOT: checking for
updates from apache.nexus
[INFO] snapshot org.apache.tuscany.sca:tuscany-host-corba-jse-tns:2.0-SNAPSHOT: checking for
updates from apache.snapshots
[INFO] snapshot org.apache.tuscany.sca:tuscany-implementation-spring-runtime:2.0-SNAPSHOT:
checking for updates from apache.nexus
[INFO] snapshot org.apache.tuscany.sca:tuscany-implementation-spring-runtime:2.0-SNAPSHOT:
checking for updates from apache.snapshots
[INFO] snapshot org.apache.tuscany.sca:tuscany-implementation-osgi-runtime:2.0-SNAPSHOT: checking
for updates from apache.nexus
[INFO] snapshot org.apache.tuscany.sca:tuscany-implementation-osgi-runtime:2.0-SNAPSHOT: checking
for updates from apache.snapshots
[INFO] snapshot org.apache.tuscany.sca:tuscany-contribution-osgi:2.0-SNAPSHOT: checking for
updates from apache.nexus
[INFO] snapshot org.apache.tuscany.sca:tuscany-contribution-osgi:2.0-SNAPSHOT: checking for
updates from apache.snapshots
[INFO] snapshot org.apache.tuscany.sca:tuscany-implementation-script-runtime:2.0-SNAPSHOT:
checking for updates from apache.nexus
[INFO] snapshot org.apache.tuscany.sca:tuscany-implementation-script-runtime:2.0-SNAPSHOT:
checking for updates from apache.snapshots
[INFO] snapshot org.apache.tuscany.sca:tuscany-implementation-jaxrs-runtime:2.0-SNAPSHOT:
checking for updates from apache.nexus
[INFO] snapshot org.apache.tuscany.sca:tuscany-implementation-jaxrs-runtime:2.0-SNAPSHOT:
checking for updates from apache.snapshots
[INFO] snapshot org.apache.tuscany.sca:tuscany-policy-transaction:2.0-SNAPSHOT: checking for
updates from apache.nexus
[INFO] snapshot org.apache.tuscany.sca:tuscany-policy-transaction:2.0-SNAPSHOT: checking for
updates from apache.snapshots
[INFO] snapshot org.apache.tuscany.sca:tuscany-policy-transaction-runtime-geronimo:2.0-SNAPSHOT:
checking for updates from apache.nexus
[INFO] snapshot org.apache.tuscany.sca:tuscany-policy-transaction-runtime-geronimo:2.0-SNAPSHOT:
checking for updates from apache.snapshots
[INFO] snapshot org.apache.tuscany.sca:tuscany-domain-hazelcast:2.0-SNAPSHOT: checking for
updates from apache.nexus
[INFO] snapshot org.apache.tuscany.sca:tuscany-domain-hazelcast:2.0-SNAPSHOT: checking for
updates from apache.snapshots
[INFO] snapshot org.apache.tuscany.sca:tuscany-binding-ws-runtime-axis2:2.0-SNAPSHOT: checking
for updates from apache.nexus
[INFO] snapshot org.apache.tuscany.sca:tuscany-binding-ws-runtime-axis2:2.0-SNAPSHOT: checking
for updates from apache.snapshots
[INFO] snapshot org.apache.tuscany.sca:tuscany-databinding-axiom:2.0-SNAPSHOT: checking for
updates from apache.nexus
[INFO] snapshot org.apache.tuscany.sca:tuscany-databinding-axiom:2.0-SNAPSHOT: checking for
updates from apache.snapshots
[INFO] snapshot org.apache.tuscany.sca:tuscany-databinding-jaxb-axiom:2.0-SNAPSHOT: checking
for updates from apache.nexus
[INFO] snapshot org.apache.tuscany.sca:tuscany-databinding-jaxb-axiom:2.0-SNAPSHOT: checking
for updates from apache.snapshots
[INFO] [enforcer:enforce {execution: enforce-plugin-versions}]
[INFO] [remote-resources:process {execution: default}]
[INFO] [resources:resources {execution: default-resources}]
[INFO] Using 'UTF-8' encoding to copy filtered resources.
[INFO] Copying 1 resource
[INFO] Copying 5 resources
[INFO] Copying 3 resources
[INFO] [compiler:compile {execution: default-compile}]
[INFO] Compiling 11 source files to <https://builds.apache.org/job/Tuscany-2x-deploy/ws/sca-2x/samples/learning-more/distributed-osgi-static/calculator-bundle/target/classes>
[INFO] [resources:testResources {execution: default-testResources}]
[INFO] Using 'UTF-8' encoding to copy filtered resources.
[INFO] Copying 0 resource
[INFO] Copying 3 resources
[INFO] [compiler:testCompile {execution: default-testCompile}]
[INFO] Compiling 3 source files to <https://builds.apache.org/job/Tuscany-2x-deploy/ws/sca-2x/samples/learning-more/distributed-osgi-static/calculator-bundle/target/test-classes>
[INFO] [surefire:test {execution: default-test}]
[INFO] Tests are skipped.
[INFO] [osgi-junit:test {execution: osgi-test}]
[INFO] Tests are skipped.
[INFO] [jar:jar {execution: default-jar}]
[INFO] Building jar: <https://builds.apache.org/job/Tuscany-2x-deploy/ws/sca-2x/samples/learning-more/distributed-osgi-static/calculator-bundle/target/sample-calculator-bundle.jar>
[INFO] [install:install {execution: default-install}]
[INFO] Installing <https://builds.apache.org/job/Tuscany-2x-deploy/ws/sca-2x/samples/learning-more/distributed-osgi-static/calculator-bundle/target/sample-calculator-bundle.jar>
to <https://builds.apache.org/job/Tuscany-2x-deploy/ws/.repository/org/apache/tuscany/sca/samples/sample-calculator-bundle/2.0-SNAPSHOT/sample-calculator-bundle-2.0-SNAPSHOT.jar>
[INFO] [deploy:deploy {execution: default-deploy}]
[INFO] Retrieving previous build number from apache.snapshots.https
[WARNING] *** CHECKSUM FAILED - Checksum failed on download: local = '573e64ae2fdd15f102d6abc3233446d669d31082';
remote = 'fb23057f3593295a56aa9e7d89d01f092dc1a2ff' - RETRYING
[WARNING] *** CHECKSUM FAILED - Checksum failed on download: local = '573e64ae2fdd15f102d6abc3233446d669d31082';
remote = 'fb23057f3593295a56aa9e7d89d01f092dc1a2ff' - IGNORING
Uploading: https://repository.apache.org/content/repositories/snapshots/org/apache/tuscany/sca/samples/sample-calculator-bundle/2.0-SNAPSHOT/sample-calculator-bundle-2.0-SNAPSHOT.jar
27K uploaded  (sample-calculator-bundle-2.0-SNAPSHOT.jar)
[INFO] Retrieving previous metadata from apache.snapshots.https
[WARNING] *** CHECKSUM FAILED - Checksum failed on download: local = '573e64ae2fdd15f102d6abc3233446d669d31082';
remote = 'fb23057f3593295a56aa9e7d89d01f092dc1a2ff' - RETRYING
[WARNING] *** CHECKSUM FAILED - Checksum failed on download: local = '573e64ae2fdd15f102d6abc3233446d669d31082';
remote = 'fb23057f3593295a56aa9e7d89d01f092dc1a2ff' - IGNORING
[INFO] Uploading repository metadata for: 'snapshot org.apache.tuscany.sca.samples:sample-calculator-bundle:2.0-SNAPSHOT'
[INFO] Retrieving previous metadata from apache.snapshots.https
[INFO] Uploading repository metadata for: 'artifact org.apache.tuscany.sca.samples:sample-calculator-bundle'
[INFO] Uploading project information for sample-calculator-bundle 2.0-SNAPSHOT
[JENKINS] Archiving disabled - not archiving <https://builds.apache.org/job/Tuscany-2x-deploy/ws/sca-2x/samples/learning-more/distributed-osgi-static/calculator-bundle/pom.xml>
[JENKINS] Archiving disabled - not archiving <https://builds.apache.org/job/Tuscany-2x-deploy/ws/sca-2x/samples/learning-more/distributed-osgi-static/calculator-bundle/target/sample-calculator-bundle.jar>
[INFO] ------------------------------------------------------------------------
[INFO] Building Apache Tuscany SCA Sample OSGi Remote Services Calculator Operations
[INFO]    task-segment: [clean, deploy]
[INFO] ------------------------------------------------------------------------
[INFO] [clean:clean {execution: default-clean}]
[INFO] Deleting <https://builds.apache.org/job/Tuscany-2x-deploy/ws/sca-2x/samples/learning-more/distributed-osgi-static/operations-bundle/target>
[INFO] [enforcer:enforce {execution: enforce-plugin-versions}]
[INFO] [remote-resources:process {execution: default}]
[INFO] [resources:resources {execution: default-resources}]
[INFO] Using 'UTF-8' encoding to copy filtered resources.
[INFO] Copying 1 resource
[INFO] Copying 8 resources
[INFO] Copying 3 resources
[INFO] [compiler:compile {execution: default-compile}]
[INFO] Compiling 9 source files to <https://builds.apache.org/job/Tuscany-2x-deploy/ws/sca-2x/samples/learning-more/distributed-osgi-static/operations-bundle/target/classes>
[INFO] [resources:testResources {execution: default-testResources}]
[INFO] Using 'UTF-8' encoding to copy filtered resources.
[INFO] Copying 0 resource
[INFO] Copying 3 resources
[INFO] [compiler:testCompile {execution: default-testCompile}]
[INFO] Compiling 3 source files to <https://builds.apache.org/job/Tuscany-2x-deploy/ws/sca-2x/samples/learning-more/distributed-osgi-static/operations-bundle/target/test-classes>
[INFO] [surefire:test {execution: default-test}]
[INFO] Tests are skipped.
[INFO] [jar:jar {execution: default-jar}]
[INFO] Building jar: <https://builds.apache.org/job/Tuscany-2x-deploy/ws/sca-2x/samples/learning-more/distributed-osgi-static/operations-bundle/target/sample-operations-bundle.jar>
[INFO] [install:install {execution: default-install}]
[INFO] Installing <https://builds.apache.org/job/Tuscany-2x-deploy/ws/sca-2x/samples/learning-more/distributed-osgi-static/operations-bundle/target/sample-operations-bundle.jar>
to <https://builds.apache.org/job/Tuscany-2x-deploy/ws/.repository/org/apache/tuscany/sca/samples/sample-operations-bundle/2.0-SNAPSHOT/sample-operations-bundle-2.0-SNAPSHOT.jar>
[INFO] [deploy:deploy {execution: default-deploy}]
[INFO] Retrieving previous build number from apache.snapshots.https
[WARNING] *** CHECKSUM FAILED - Checksum failed on download: local = 'a016433a0df8645ad84dee342747270bd699b7af';
remote = '3c64b410ba7a8507ff74ecf385b4ce9631c0bb32' - RETRYING
[WARNING] *** CHECKSUM FAILED - Checksum failed on download: local = 'a016433a0df8645ad84dee342747270bd699b7af';
remote = '3c64b410ba7a8507ff74ecf385b4ce9631c0bb32' - IGNORING
Uploading: https://repository.apache.org/content/repositories/snapshots/org/apache/tuscany/sca/samples/sample-operations-bundle/2.0-SNAPSHOT/sample-operations-bundle-2.0-SNAPSHOT.jar
22K uploaded  (sample-operations-bundle-2.0-SNAPSHOT.jar)
[INFO] Retrieving previous metadata from apache.snapshots.https
[INFO] Uploading repository metadata for: 'artifact org.apache.tuscany.sca.samples:sample-operations-bundle'
[INFO] Retrieving previous metadata from apache.snapshots.https
[WARNING] *** CHECKSUM FAILED - Checksum failed on download: local = 'a016433a0df8645ad84dee342747270bd699b7af';
remote = '3c64b410ba7a8507ff74ecf385b4ce9631c0bb32' - RETRYING
[WARNING] *** CHECKSUM FAILED - Checksum failed on download: local = 'a016433a0df8645ad84dee342747270bd699b7af';
remote = '3c64b410ba7a8507ff74ecf385b4ce9631c0bb32' - IGNORING
[INFO] Uploading repository metadata for: 'snapshot org.apache.tuscany.sca.samples:sample-operations-bundle:2.0-SNAPSHOT'
[INFO] Uploading project information for sample-operations-bundle 2.0-SNAPSHOT
[JENKINS] Archiving disabled - not archiving <https://builds.apache.org/job/Tuscany-2x-deploy/ws/sca-2x/samples/learning-more/distributed-osgi-static/operations-bundle/pom.xml>
[JENKINS] Archiving disabled - not archiving <https://builds.apache.org/job/Tuscany-2x-deploy/ws/sca-2x/samples/learning-more/distributed-osgi-static/operations-bundle/target/sample-operations-bundle.jar>
[INFO] ------------------------------------------------------------------------
[INFO] Building Apache Tuscany SCA Distributed OSGI Statically Configured Samples
[INFO]    task-segment: [clean, deploy]
[INFO] ------------------------------------------------------------------------
[INFO] [clean:clean {execution: default-clean}]
[INFO] Deleting <https://builds.apache.org/job/Tuscany-2x-deploy/ws/sca-2x/samples/learning-more/distributed-osgi-static/target>
[INFO] [enforcer:enforce {execution: enforce-plugin-versions}]
[INFO] [remote-resources:process {execution: default}]
[INFO] [site:attach-descriptor {execution: default-attach-descriptor}]
[INFO] [install:install {execution: default-install}]
[INFO] Installing <https://builds.apache.org/job/Tuscany-2x-deploy/ws/sca-2x/samples/learning-more/distributed-osgi-static/pom.xml>
to <https://builds.apache.org/job/Tuscany-2x-deploy/ws/.repository/org/apache/tuscany/sca/samples/tuscany-samples-distributed-osgi-static/2.0-SNAPSHOT/tuscany-samples-distributed-osgi-static-2.0-SNAPSHOT.pom>
[INFO] [deploy:deploy {execution: default-deploy}]
[INFO] Retrieving previous build number from apache.snapshots.https
[WARNING] *** CHECKSUM FAILED - Checksum failed on download: local = 'b4cb4689f5f54d9650994053cbca637dd8eeb809';
remote = '2ede0377fac2e4a4f9fea75301cc09e5a128f152' - RETRYING
[WARNING] *** CHECKSUM FAILED - Checksum failed on download: local = 'b4cb4689f5f54d9650994053cbca637dd8eeb809';
remote = '2ede0377fac2e4a4f9fea75301cc09e5a128f152' - IGNORING
Uploading: https://repository.apache.org/content/repositories/snapshots/org/apache/tuscany/sca/samples/tuscany-samples-distributed-osgi-static/2.0-SNAPSHOT/tuscany-samples-distributed-osgi-static-2.0-SNAPSHOT.pom
1K uploaded  (tuscany-samples-distributed-osgi-static-2.0-SNAPSHOT.pom)
[INFO] Retrieving previous metadata from apache.snapshots.https
[WARNING] *** CHECKSUM FAILED - Checksum failed on download: local = 'b4cb4689f5f54d9650994053cbca637dd8eeb809';
remote = '2ede0377fac2e4a4f9fea75301cc09e5a128f152' - RETRYING
[WARNING] *** CHECKSUM FAILED - Checksum failed on download: local = 'b4cb4689f5f54d9650994053cbca637dd8eeb809';
remote = '2ede0377fac2e4a4f9fea75301cc09e5a128f152' - IGNORING
[INFO] Uploading repository metadata for: 'snapshot org.apache.tuscany.sca.samples:tuscany-samples-distributed-osgi-static:2.0-SNAPSHOT'
[INFO] Retrieving previous metadata from apache.snapshots.https
[INFO] Uploading repository metadata for: 'artifact org.apache.tuscany.sca.samples:tuscany-samples-distributed-osgi-static'
[JENKINS] Archiving disabled - not archiving <https://builds.apache.org/job/Tuscany-2x-deploy/ws/sca-2x/samples/learning-more/distributed-osgi-static/pom.xml>
[JENKINS] Archiving disabled - not archiving <https://builds.apache.org/job/Tuscany-2x-deploy/ws/.repository/org/apache/tuscany/sca/samples/tuscany-samples-distributed-osgi-static/2.0-SNAPSHOT/tuscany-samples-distributed-osgi-static-2.0-SNAPSHOT.pom>
[INFO] ------------------------------------------------------------------------
[INFO] Building Apache Tuscany SCA All-in-one Distribution
[INFO]    task-segment: [clean, deploy]
[INFO] ------------------------------------------------------------------------
[INFO] [clean:clean {execution: default-clean}]
[INFO] snapshot org.apache.tuscany.sca:tuscany-feature-all:2.0-SNAPSHOT: checking for updates
from java.net2
[INFO] snapshot org.apache.tuscany.sca:tuscany-feature-all:2.0-SNAPSHOT: checking for updates
from apache.nexus
[INFO] snapshot org.apache.tuscany.sca:tuscany-feature-all:2.0-SNAPSHOT: checking for updates
from apache.snapshots
Downloading: http://repository.apache.org/snapshots/org/apache/tuscany/sca/tuscany-feature-all/2.0-SNAPSHOT/tuscany-feature-all-2.0-SNAPSHOT.pom
[INFO] snapshot org.apache.tuscany.sca:tuscany-binding-atom-js-dojo:2.0-SNAPSHOT: checking
for updates from java.net2
[INFO] snapshot org.apache.tuscany.sca:tuscany-binding-atom-js-dojo:2.0-SNAPSHOT: checking
for updates from apache.nexus
[INFO] snapshot org.apache.tuscany.sca:tuscany-binding-atom-js-dojo:2.0-SNAPSHOT: checking
for updates from apache.snapshots
Downloading: http://repository.apache.org/snapshots/org/apache/tuscany/sca/tuscany-binding-atom-js-dojo/2.0-SNAPSHOT/tuscany-binding-atom-js-dojo-2.0-SNAPSHOT.pom
[INFO] snapshot org.apache.tuscany.sca:tuscany-binding-comet-runtime:2.0-SNAPSHOT: checking
for updates from java.net2
[INFO] snapshot org.apache.tuscany.sca:tuscany-binding-comet-runtime:2.0-SNAPSHOT: checking
for updates from apache.nexus
[INFO] snapshot org.apache.tuscany.sca:tuscany-binding-comet-runtime:2.0-SNAPSHOT: checking
for updates from apache.snapshots
Downloading: http://repository.apache.org/snapshots/org/apache/tuscany/sca/tuscany-binding-comet-runtime/2.0-SNAPSHOT/tuscany-binding-comet-runtime-2.0-20120619.002918-241.pom

[JENKINS] Archiving disabled - not archiving <https://builds.apache.org/job/Tuscany-2x-deploy/ws/sca-2x/distribution/all/pom.xml>
[INFO] ------------------------------------------------------------------------
[ERROR] BUILD ERROR
[INFO] ------------------------------------------------------------------------
[INFO] Error building POM (may not be this project's POM).


Project ID: null:jersey-server:bundle:null

Reason: Cannot find parent: com.sun.jersey:jersey-project for project: null:jersey-server:bundle:null
for project null:jersey-server:bundle:null


[INFO] ------------------------------------------------------------------------
[INFO] For more information, run Maven with the -e switch
[INFO] ------------------------------------------------------------------------
[INFO] Total time: 69 minutes 40 seconds
[INFO] Finished at: Wed Jun 20 01:38:10 GMT+00:00 2012
[INFO] Final Memory: 251M/741M
[INFO] ------------------------------------------------------------------------
channel stopped
2012-06-20 01:38:15.954:INFO::Shutdown hook executing
2012-06-20 01:38:15.954:INFO::Shutdown hook complete

Mime
View raw message