tuscany-commits mailing list archives

Site index · List index
Message view « Date » · « Thread »
Top « Date » · « Thread »
From Apache Jenkins Server <jenk...@builds.apache.org>
Subject Build failed in Jenkins: Tuscany-2x-deploy #915
Date Thu, 06 Sep 2012 00:52:07 GMT
See <https://builds.apache.org/job/Tuscany-2x-deploy/915/>

------------------------------------------
[...truncated 3671 lines...]
[INFO] [archetype:jar {execution: default-jar}]
[INFO] Building archetype jar: <https://builds.apache.org/job/Tuscany-2x-deploy/ws/sca-2x/maven/archetypes/policy/target/tuscany-policy-archetype-2.5-SNAPSHOT>
[INFO] [archetype:integration-test {execution: default-integration-test}]
[INFO] Processing Archetype IT project: basic
[INFO] ----------------------------------------------------------------------------
[INFO] Using following parameters for creating project from Archetype: tuscany-policy-archetype:2.5-SNAPSHOT
[INFO] ----------------------------------------------------------------------------
[INFO] Parameter: groupId, Value: archetype.it
[INFO] Parameter: artifactId, Value: basic
[INFO] Parameter: version, Value: 0.1-SNAPSHOT
[INFO] Parameter: package, Value: archetype.it.basic
[INFO] Parameter: packageInPathFormat, Value: archetype/it/basic
[INFO] Parameter: package, Value: archetype.it.basic
[INFO] Parameter: version, Value: 0.1-SNAPSHOT
[INFO] Parameter: groupId, Value: archetype.it
[INFO] Parameter: policyName, Value: Basic
[INFO] Parameter: artifactId, Value: basic
[INFO] project created from Archetype in dir: <https://builds.apache.org/job/Tuscany-2x-deploy/ws/sca-2x/maven/archetypes/policy/target/test-classes/projects/basic/project/basic>
[INFO] No post-archetype-generation goals to invoke.
[INFO] [install:install {execution: default-install}]
[INFO] Installing <https://builds.apache.org/job/Tuscany-2x-deploy/ws/sca-2x/maven/archetypes/policy/target/tuscany-policy-archetype-2.5-SNAPSHOT.jar>
to <https://builds.apache.org/job/Tuscany-2x-deploy/ws/.repository/org/apache/tuscany/sca/tuscany-policy-archetype/2.5-SNAPSHOT/tuscany-policy-archetype-2.5-SNAPSHOT.jar>
[INFO] [archetype:update-local-catalog {execution: default-update-local-catalog}]
[INFO] [deploy:deploy {execution: default-deploy}]
[INFO] Retrieving previous build number from apache.snapshots.https
[WARNING] *** CHECKSUM FAILED - Checksum failed on download: local = '066d63804d2bfe7c17a3209b1b3a03bf702108f1';
remote = 'a72af23c305085ac73294693712d90feceb7c69e' - RETRYING
[WARNING] *** CHECKSUM FAILED - Checksum failed on download: local = '066d63804d2bfe7c17a3209b1b3a03bf702108f1';
remote = 'a72af23c305085ac73294693712d90feceb7c69e' - IGNORING
Uploading: https://repository.apache.org/content/repositories/snapshots/org/apache/tuscany/sca/tuscany-policy-archetype/2.5-SNAPSHOT/tuscany-policy-archetype-2.5-SNAPSHOT.jar
26K uploaded  (tuscany-policy-archetype-2.5-SNAPSHOT.jar)
[INFO] Retrieving previous metadata from apache.snapshots.https
[INFO] Uploading repository metadata for: 'artifact org.apache.tuscany.sca:tuscany-policy-archetype'
[INFO] Uploading project information for tuscany-policy-archetype 2.5-SNAPSHOT
[INFO] Retrieving previous metadata from apache.snapshots.https
[WARNING] *** CHECKSUM FAILED - Checksum failed on download: local = '066d63804d2bfe7c17a3209b1b3a03bf702108f1';
remote = 'a72af23c305085ac73294693712d90feceb7c69e' - RETRYING
[WARNING] *** CHECKSUM FAILED - Checksum failed on download: local = '066d63804d2bfe7c17a3209b1b3a03bf702108f1';
remote = 'a72af23c305085ac73294693712d90feceb7c69e' - IGNORING
[INFO] Uploading repository metadata for: 'snapshot org.apache.tuscany.sca:tuscany-policy-archetype:2.5-SNAPSHOT'
[JENKINS] Archiving disabled - not archiving <https://builds.apache.org/job/Tuscany-2x-deploy/ws/sca-2x/maven/archetypes/policy/pom.xml>
[JENKINS] Archiving disabled - not archiving <https://builds.apache.org/job/Tuscany-2x-deploy/ws/sca-2x/maven/archetypes/policy/target/tuscany-policy-archetype-2.5-SNAPSHOT.jar>
[INFO] ------------------------------------------------------------------------
[INFO] Building Create a simple Apache Tuscany SCA webapp project
[INFO]    task-segment: [clean, deploy]
[INFO] ------------------------------------------------------------------------
[INFO] [clean:clean {execution: default-clean}]
[INFO] Deleting <https://builds.apache.org/job/Tuscany-2x-deploy/ws/sca-2x/maven/archetypes/quickstart/target>
[INFO] [enforcer:enforce {execution: enforce-plugin-versions}]
[INFO] [remote-resources:process {execution: default}]
[INFO] [resources:resources {execution: default-resources}]
[INFO] Using 'UTF-8' encoding to copy filtered resources.
[INFO] Copying 8 resources
[INFO] Copying 1 resource
[INFO] Copying 3 resources
[INFO] [resources:testResources {execution: default-testResources}]
[INFO] Using 'UTF-8' encoding to copy filtered resources.
[INFO] skip non existing resourceDirectory <https://builds.apache.org/job/Tuscany-2x-deploy/ws/sca-2x/maven/archetypes/quickstart/src/test/resources>
[INFO] Copying 3 resources
[INFO] [archetype:jar {execution: default-jar}]
[INFO] Building archetype jar: <https://builds.apache.org/job/Tuscany-2x-deploy/ws/sca-2x/maven/archetypes/quickstart/target/tuscany-quickstart-2.5-SNAPSHOT>
[INFO] [archetype:integration-test {execution: default-integration-test}]
[WARNING] No Archetype IT projects: root 'projects' directory not found.
[INFO] [install:install {execution: default-install}]
[INFO] Installing <https://builds.apache.org/job/Tuscany-2x-deploy/ws/sca-2x/maven/archetypes/quickstart/target/tuscany-quickstart-2.5-SNAPSHOT.jar>
to <https://builds.apache.org/job/Tuscany-2x-deploy/ws/.repository/org/apache/tuscany/sca/tuscany-quickstart/2.5-SNAPSHOT/tuscany-quickstart-2.5-SNAPSHOT.jar>
[INFO] [archetype:update-local-catalog {execution: default-update-local-catalog}]
[INFO] [deploy:deploy {execution: default-deploy}]
[INFO] Retrieving previous build number from apache.snapshots.https
[WARNING] *** CHECKSUM FAILED - Checksum failed on download: local = 'ac476c581188c0bce0461bcdf3aa3996266d7db7';
remote = 'aff4f8df78b4ee963b523b9fc01595b523ac1a61' - RETRYING
[WARNING] *** CHECKSUM FAILED - Checksum failed on download: local = 'ac476c581188c0bce0461bcdf3aa3996266d7db7';
remote = 'aff4f8df78b4ee963b523b9fc01595b523ac1a61' - IGNORING
Uploading: https://repository.apache.org/content/repositories/snapshots/org/apache/tuscany/sca/tuscany-quickstart/2.5-SNAPSHOT/tuscany-quickstart-2.5-SNAPSHOT.jar
12K uploaded  (tuscany-quickstart-2.5-SNAPSHOT.jar)
[INFO] Retrieving previous metadata from apache.snapshots.https
[INFO] Uploading repository metadata for: 'artifact org.apache.tuscany.sca:tuscany-quickstart'
[INFO] Retrieving previous metadata from apache.snapshots.https
[WARNING] *** CHECKSUM FAILED - Checksum failed on download: local = 'ac476c581188c0bce0461bcdf3aa3996266d7db7';
remote = 'aff4f8df78b4ee963b523b9fc01595b523ac1a61' - RETRYING
[WARNING] *** CHECKSUM FAILED - Checksum failed on download: local = 'ac476c581188c0bce0461bcdf3aa3996266d7db7';
remote = 'aff4f8df78b4ee963b523b9fc01595b523ac1a61' - IGNORING
[INFO] Uploading repository metadata for: 'snapshot org.apache.tuscany.sca:tuscany-quickstart:2.5-SNAPSHOT'
[INFO] Uploading project information for tuscany-quickstart 2.5-SNAPSHOT
[JENKINS] Archiving disabled - not archiving <https://builds.apache.org/job/Tuscany-2x-deploy/ws/sca-2x/maven/archetypes/quickstart/pom.xml>
[JENKINS] Archiving disabled - not archiving <https://builds.apache.org/job/Tuscany-2x-deploy/ws/sca-2x/maven/archetypes/quickstart/target/tuscany-quickstart-2.5-SNAPSHOT.jar>
[INFO] ------------------------------------------------------------------------
[INFO] Building Create a Tuscany SCA and JSF project
[INFO]    task-segment: [clean, deploy]
[INFO] ------------------------------------------------------------------------
[INFO] [clean:clean {execution: default-clean}]
[INFO] Deleting <https://builds.apache.org/job/Tuscany-2x-deploy/ws/sca-2x/maven/archetypes/quickstart-jsf/target>
[INFO] [enforcer:enforce {execution: enforce-plugin-versions}]
[INFO] [remote-resources:process {execution: default}]
[INFO] [resources:resources {execution: default-resources}]
[INFO] Using 'UTF-8' encoding to copy filtered resources.
[INFO] Copying 12 resources
[INFO] Copying 0 resource
[INFO] Copying 3 resources
[INFO] [resources:testResources {execution: default-testResources}]
[INFO] Using 'UTF-8' encoding to copy filtered resources.
[INFO] skip non existing resourceDirectory <https://builds.apache.org/job/Tuscany-2x-deploy/ws/sca-2x/maven/archetypes/quickstart-jsf/src/test/resources>
[INFO] Copying 3 resources
[INFO] [archetype:jar {execution: default-jar}]
[INFO] Building archetype jar: <https://builds.apache.org/job/Tuscany-2x-deploy/ws/sca-2x/maven/archetypes/quickstart-jsf/target/tuscany-quickstart-jsf-2.5-SNAPSHOT>
[INFO] [archetype:integration-test {execution: default-integration-test}]
[WARNING] No Archetype IT projects: root 'projects' directory not found.
[INFO] [install:install {execution: default-install}]
[INFO] Installing <https://builds.apache.org/job/Tuscany-2x-deploy/ws/sca-2x/maven/archetypes/quickstart-jsf/target/tuscany-quickstart-jsf-2.5-SNAPSHOT.jar>
to <https://builds.apache.org/job/Tuscany-2x-deploy/ws/.repository/org/apache/tuscany/sca/tuscany-quickstart-jsf/2.5-SNAPSHOT/tuscany-quickstart-jsf-2.5-SNAPSHOT.jar>
[INFO] [archetype:update-local-catalog {execution: default-update-local-catalog}]
[INFO] [deploy:deploy {execution: default-deploy}]
[INFO] Retrieving previous build number from apache.snapshots.https
[WARNING] *** CHECKSUM FAILED - Checksum failed on download: local = '40ff161c70e8a083babd98d08fc16ec0923285ef';
remote = '5309219b2a4fd3498c9372acf1f5852bd8461713' - RETRYING
[WARNING] *** CHECKSUM FAILED - Checksum failed on download: local = '40ff161c70e8a083babd98d08fc16ec0923285ef';
remote = '5309219b2a4fd3498c9372acf1f5852bd8461713' - IGNORING
Uploading: https://repository.apache.org/content/repositories/snapshots/org/apache/tuscany/sca/tuscany-quickstart-jsf/2.5-SNAPSHOT/tuscany-quickstart-jsf-2.5-SNAPSHOT.jar
17K uploaded  (tuscany-quickstart-jsf-2.5-SNAPSHOT.jar)
[INFO] Uploading project information for tuscany-quickstart-jsf 2.5-SNAPSHOT
[INFO] Retrieving previous metadata from apache.snapshots.https
[WARNING] *** CHECKSUM FAILED - Checksum failed on download: local = '40ff161c70e8a083babd98d08fc16ec0923285ef';
remote = '5309219b2a4fd3498c9372acf1f5852bd8461713' - RETRYING
[WARNING] *** CHECKSUM FAILED - Checksum failed on download: local = '40ff161c70e8a083babd98d08fc16ec0923285ef';
remote = '5309219b2a4fd3498c9372acf1f5852bd8461713' - IGNORING
[INFO] Uploading repository metadata for: 'snapshot org.apache.tuscany.sca:tuscany-quickstart-jsf:2.5-SNAPSHOT'
[INFO] Retrieving previous metadata from apache.snapshots.https
[INFO] Uploading repository metadata for: 'artifact org.apache.tuscany.sca:tuscany-quickstart-jsf'
[JENKINS] Archiving disabled - not archiving <https://builds.apache.org/job/Tuscany-2x-deploy/ws/sca-2x/maven/archetypes/quickstart-jsf/pom.xml>
[JENKINS] Archiving disabled - not archiving <https://builds.apache.org/job/Tuscany-2x-deploy/ws/sca-2x/maven/archetypes/quickstart-jsf/target/tuscany-quickstart-jsf-2.5-SNAPSHOT.jar>
[INFO] ------------------------------------------------------------------------
[INFO] Building Create a simple Apache Tuscany SCA webapp project using the Stripes Web Framework
[INFO]    task-segment: [clean, deploy]
[INFO] ------------------------------------------------------------------------
[INFO] [clean:clean {execution: default-clean}]
[INFO] Deleting <https://builds.apache.org/job/Tuscany-2x-deploy/ws/sca-2x/maven/archetypes/quickstart-stripes/target>
[INFO] [enforcer:enforce {execution: enforce-plugin-versions}]
[INFO] [remote-resources:process {execution: default}]
[INFO] [resources:resources {execution: default-resources}]
[INFO] Using 'UTF-8' encoding to copy filtered resources.
[INFO] Copying 15 resources
[INFO] Copying 1 resource
[INFO] Copying 3 resources
[INFO] [resources:testResources {execution: default-testResources}]
[INFO] Using 'UTF-8' encoding to copy filtered resources.
[INFO] skip non existing resourceDirectory <https://builds.apache.org/job/Tuscany-2x-deploy/ws/sca-2x/maven/archetypes/quickstart-stripes/src/test/resources>
[INFO] Copying 3 resources
[INFO] [archetype:jar {execution: default-jar}]
[INFO] Building archetype jar: <https://builds.apache.org/job/Tuscany-2x-deploy/ws/sca-2x/maven/archetypes/quickstart-stripes/target/tuscany-quickstart-stripes-2.5-SNAPSHOT>
[INFO] [archetype:integration-test {execution: default-integration-test}]
[WARNING] No Archetype IT projects: root 'projects' directory not found.
[INFO] [install:install {execution: default-install}]
[INFO] Installing <https://builds.apache.org/job/Tuscany-2x-deploy/ws/sca-2x/maven/archetypes/quickstart-stripes/target/tuscany-quickstart-stripes-2.5-SNAPSHOT.jar>
to <https://builds.apache.org/job/Tuscany-2x-deploy/ws/.repository/org/apache/tuscany/sca/tuscany-quickstart-stripes/2.5-SNAPSHOT/tuscany-quickstart-stripes-2.5-SNAPSHOT.jar>
[INFO] [archetype:update-local-catalog {execution: default-update-local-catalog}]
[INFO] [deploy:deploy {execution: default-deploy}]
[INFO] Retrieving previous build number from apache.snapshots.https
[WARNING] *** CHECKSUM FAILED - Checksum failed on download: local = '92f3e5fe8731df2b5a648af16b1338c490b7cdb7';
remote = '04f86e9481d9a73273d3ff323da7da6c6b28010c' - RETRYING
[WARNING] *** CHECKSUM FAILED - Checksum failed on download: local = '92f3e5fe8731df2b5a648af16b1338c490b7cdb7';
remote = '04f86e9481d9a73273d3ff323da7da6c6b28010c' - IGNORING
Uploading: https://repository.apache.org/content/repositories/snapshots/org/apache/tuscany/sca/tuscany-quickstart-stripes/2.5-SNAPSHOT/tuscany-quickstart-stripes-2.5-SNAPSHOT.jar
19K uploaded  (tuscany-quickstart-stripes-2.5-SNAPSHOT.jar)
[INFO] Uploading project information for tuscany-quickstart-stripes 2.5-SNAPSHOT
[INFO] Retrieving previous metadata from apache.snapshots.https
[INFO] Uploading repository metadata for: 'artifact org.apache.tuscany.sca:tuscany-quickstart-stripes'
[INFO] Retrieving previous metadata from apache.snapshots.https
[WARNING] *** CHECKSUM FAILED - Checksum failed on download: local = '92f3e5fe8731df2b5a648af16b1338c490b7cdb7';
remote = '04f86e9481d9a73273d3ff323da7da6c6b28010c' - RETRYING
[WARNING] *** CHECKSUM FAILED - Checksum failed on download: local = '92f3e5fe8731df2b5a648af16b1338c490b7cdb7';
remote = '04f86e9481d9a73273d3ff323da7da6c6b28010c' - IGNORING
[INFO] Uploading repository metadata for: 'snapshot org.apache.tuscany.sca:tuscany-quickstart-stripes:2.5-SNAPSHOT'
[JENKINS] Archiving disabled - not archiving <https://builds.apache.org/job/Tuscany-2x-deploy/ws/sca-2x/maven/archetypes/quickstart-stripes/pom.xml>
[JENKINS] Archiving disabled - not archiving <https://builds.apache.org/job/Tuscany-2x-deploy/ws/sca-2x/maven/archetypes/quickstart-stripes/target/tuscany-quickstart-stripes-2.5-SNAPSHOT.jar>
[INFO] ------------------------------------------------------------------------
[INFO] Building Create an SCA Webapp project using BPEL
[INFO]    task-segment: [clean, deploy]
[INFO] ------------------------------------------------------------------------
[INFO] [clean:clean {execution: default-clean}]
[INFO] Deleting <https://builds.apache.org/job/Tuscany-2x-deploy/ws/sca-2x/maven/archetypes/quickstart-bpel/target>
[INFO] [enforcer:enforce {execution: enforce-plugin-versions}]
[INFO] [remote-resources:process {execution: default}]
[INFO] [resources:resources {execution: default-resources}]
[INFO] Using 'UTF-8' encoding to copy filtered resources.
[INFO] Copying 9 resources
[INFO] Copying 1 resource
[INFO] Copying 3 resources
[INFO] [resources:testResources {execution: default-testResources}]
[INFO] Using 'UTF-8' encoding to copy filtered resources.
[INFO] skip non existing resourceDirectory <https://builds.apache.org/job/Tuscany-2x-deploy/ws/sca-2x/maven/archetypes/quickstart-bpel/src/test/resources>
[INFO] Copying 3 resources
[INFO] [archetype:jar {execution: default-jar}]
[INFO] Building archetype jar: <https://builds.apache.org/job/Tuscany-2x-deploy/ws/sca-2x/maven/archetypes/quickstart-bpel/target/tuscany-quickstart-bpel-2.5-SNAPSHOT>
[INFO] [archetype:integration-test {execution: default-integration-test}]
[WARNING] No Archetype IT projects: root 'projects' directory not found.
[INFO] [install:install {execution: default-install}]
[INFO] Installing <https://builds.apache.org/job/Tuscany-2x-deploy/ws/sca-2x/maven/archetypes/quickstart-bpel/target/tuscany-quickstart-bpel-2.5-SNAPSHOT.jar>
to <https://builds.apache.org/job/Tuscany-2x-deploy/ws/.repository/org/apache/tuscany/sca/tuscany-quickstart-bpel/2.5-SNAPSHOT/tuscany-quickstart-bpel-2.5-SNAPSHOT.jar>
[INFO] [archetype:update-local-catalog {execution: default-update-local-catalog}]
[INFO] [deploy:deploy {execution: default-deploy}]
[INFO] Retrieving previous build number from apache.snapshots.https
[WARNING] *** CHECKSUM FAILED - Checksum failed on download: local = '808f25f096c591d9dff20e080d7248aa8cb2cec0';
remote = 'a05056ad5d5a76a2b354882ee6dbc444e30d5a1a' - RETRYING
[WARNING] *** CHECKSUM FAILED - Checksum failed on download: local = '808f25f096c591d9dff20e080d7248aa8cb2cec0';
remote = 'a05056ad5d5a76a2b354882ee6dbc444e30d5a1a' - IGNORING
Uploading: https://repository.apache.org/content/repositories/snapshots/org/apache/tuscany/sca/tuscany-quickstart-bpel/2.5-SNAPSHOT/tuscany-quickstart-bpel-2.5-SNAPSHOT.jar
14K uploaded  (tuscany-quickstart-bpel-2.5-SNAPSHOT.jar)
[INFO] Retrieving previous metadata from apache.snapshots.https
[WARNING] *** CHECKSUM FAILED - Checksum failed on download: local = '808f25f096c591d9dff20e080d7248aa8cb2cec0';
remote = 'a05056ad5d5a76a2b354882ee6dbc444e30d5a1a' - RETRYING
[WARNING] *** CHECKSUM FAILED - Checksum failed on download: local = '808f25f096c591d9dff20e080d7248aa8cb2cec0';
remote = 'a05056ad5d5a76a2b354882ee6dbc444e30d5a1a' - IGNORING
[INFO] Uploading repository metadata for: 'snapshot org.apache.tuscany.sca:tuscany-quickstart-bpel:2.5-SNAPSHOT'
[INFO] Retrieving previous metadata from apache.snapshots.https
[INFO] Uploading repository metadata for: 'artifact org.apache.tuscany.sca:tuscany-quickstart-bpel'
[INFO] Uploading project information for tuscany-quickstart-bpel 2.5-SNAPSHOT
[JENKINS] Archiving disabled - not archiving <https://builds.apache.org/job/Tuscany-2x-deploy/ws/sca-2x/maven/archetypes/quickstart-bpel/pom.xml>
[JENKINS] Archiving disabled - not archiving <https://builds.apache.org/job/Tuscany-2x-deploy/ws/sca-2x/maven/archetypes/quickstart-bpel/target/tuscany-quickstart-bpel-2.5-SNAPSHOT.jar>
[INFO] ------------------------------------------------------------------------
[INFO] Building Apache Tuscany SCA Maven Archetypes
[INFO]    task-segment: [clean, deploy]
[INFO] ------------------------------------------------------------------------
[INFO] [clean:clean {execution: default-clean}]
[INFO] Deleting <https://builds.apache.org/job/Tuscany-2x-deploy/ws/sca-2x/maven/archetypes/target>
[INFO] [enforcer:enforce {execution: enforce-plugin-versions}]
[INFO] [remote-resources:process {execution: default}]
[INFO] [site:attach-descriptor {execution: default-attach-descriptor}]
[INFO] [install:install {execution: default-install}]
[INFO] Installing <https://builds.apache.org/job/Tuscany-2x-deploy/ws/sca-2x/maven/archetypes/pom.xml>
to <https://builds.apache.org/job/Tuscany-2x-deploy/ws/.repository/org/apache/tuscany/sca/tuscany-archetype/2.5-SNAPSHOT/tuscany-archetype-2.5-SNAPSHOT.pom>
[INFO] [deploy:deploy {execution: default-deploy}]
[INFO] Retrieving previous build number from apache.snapshots.https
[WARNING] *** CHECKSUM FAILED - Checksum failed on download: local = '1cedd97edeed52b5e9a22b1dac7eef3c6b2638af';
remote = '3cc8d74ca8b543a993bfb4cc3b28e0c77c4adaad' - RETRYING
[WARNING] *** CHECKSUM FAILED - Checksum failed on download: local = '1cedd97edeed52b5e9a22b1dac7eef3c6b2638af';
remote = '3cc8d74ca8b543a993bfb4cc3b28e0c77c4adaad' - IGNORING
Uploading: https://repository.apache.org/content/repositories/snapshots/org/apache/tuscany/sca/tuscany-archetype/2.5-SNAPSHOT/tuscany-archetype-2.5-SNAPSHOT.pom
1K uploaded  (tuscany-archetype-2.5-SNAPSHOT.pom)
[INFO] Retrieving previous metadata from apache.snapshots.https
[INFO] Uploading repository metadata for: 'artifact org.apache.tuscany.sca:tuscany-archetype'
[INFO] Retrieving previous metadata from apache.snapshots.https
[WARNING] *** CHECKSUM FAILED - Checksum failed on download: local = '1cedd97edeed52b5e9a22b1dac7eef3c6b2638af';
remote = '3cc8d74ca8b543a993bfb4cc3b28e0c77c4adaad' - RETRYING
[WARNING] *** CHECKSUM FAILED - Checksum failed on download: local = '1cedd97edeed52b5e9a22b1dac7eef3c6b2638af';
remote = '3cc8d74ca8b543a993bfb4cc3b28e0c77c4adaad' - IGNORING
[INFO] Uploading repository metadata for: 'snapshot org.apache.tuscany.sca:tuscany-archetype:2.5-SNAPSHOT'
[JENKINS] Archiving disabled - not archiving <https://builds.apache.org/job/Tuscany-2x-deploy/ws/sca-2x/maven/archetypes/pom.xml>
[JENKINS] Archiving disabled - not archiving <https://builds.apache.org/job/Tuscany-2x-deploy/ws/.repository/org/apache/tuscany/sca/tuscany-archetype/2.5-SNAPSHOT/tuscany-archetype-2.5-SNAPSHOT.pom>
[INFO] ------------------------------------------------------------------------
[INFO] Building Apache Tuscany SCA Web JavaScript
[INFO]    task-segment: [clean, deploy]
[INFO] ------------------------------------------------------------------------
[INFO] [clean:clean {execution: default-clean}]
[INFO] Deleting <https://builds.apache.org/job/Tuscany-2x-deploy/ws/sca-2x/modules/web-javascript/target>
[INFO] [enforcer:enforce {execution: enforce-plugin-versions}]
[INFO] [remote-resources:process {execution: default}]
[INFO] [resources:resources {execution: default-resources}]
[INFO] Using 'UTF-8' encoding to copy filtered resources.
[INFO] Copying 3 resources
[INFO] Copying 3 resources
[INFO] Copying 3 resources
[INFO] [compiler:compile {execution: default-compile}]
[INFO] Compiling 6 source files to <https://builds.apache.org/job/Tuscany-2x-deploy/ws/sca-2x/modules/web-javascript/target/classes>
[JENKINS] Archiving disabled - not archiving <https://builds.apache.org/job/Tuscany-2x-deploy/ws/sca-2x/modules/web-javascript/pom.xml>
[INFO] ------------------------------------------------------------------------
[ERROR] BUILD ERROR
[INFO] ------------------------------------------------------------------------
[INFO] Fatal error compiling

Embedded error: Error while executing the external compiler.
error=12, Not enough space
[INFO] ------------------------------------------------------------------------
[INFO] For more information, run Maven with the -e switch
[INFO] ------------------------------------------------------------------------
[INFO] Total time: 28 minutes 27 seconds
[INFO] Finished at: Thu Sep 06 00:52:26 GMT+00:00 2012
[INFO] Final Memory: 328M/659M
[INFO] ------------------------------------------------------------------------
channel stopped

Mime
View raw message