tuscany-commits mailing list archives

Site index · List index
Message view « Date » · « Thread »
Top « Date » · « Thread »
From Apache Jenkins Server <jenk...@builds.apache.org>
Subject Build failed in Jenkins: Tuscany-2x-deploy #919
Date Mon, 10 Sep 2012 01:17:09 GMT
See <https://builds.apache.org/job/Tuscany-2x-deploy/919/>

------------------------------------------
[...truncated 3668 lines...]
[INFO] Copying 3 resources
[INFO] [resources:testResources {execution: default-testResources}]
[INFO] Using 'UTF-8' encoding to copy filtered resources.
[INFO] skip non existing resourceDirectory <https://builds.apache.org/job/Tuscany-2x-deploy/ws/sca-2x/maven/archetypes/quickstart/src/test/resources>
[INFO] Copying 3 resources
[INFO] [archetype:jar {execution: default-jar}]
[INFO] Building archetype jar: <https://builds.apache.org/job/Tuscany-2x-deploy/ws/sca-2x/maven/archetypes/quickstart/target/tuscany-quickstart-2.5-SNAPSHOT>
[INFO] [archetype:integration-test {execution: default-integration-test}]
[WARNING] No Archetype IT projects: root 'projects' directory not found.
[INFO] [install:install {execution: default-install}]
[INFO] Installing <https://builds.apache.org/job/Tuscany-2x-deploy/ws/sca-2x/maven/archetypes/quickstart/target/tuscany-quickstart-2.5-SNAPSHOT.jar>
to <https://builds.apache.org/job/Tuscany-2x-deploy/ws/.repository/org/apache/tuscany/sca/tuscany-quickstart/2.5-SNAPSHOT/tuscany-quickstart-2.5-SNAPSHOT.jar>
[INFO] [archetype:update-local-catalog {execution: default-update-local-catalog}]
[INFO] [deploy:deploy {execution: default-deploy}]
[INFO] Retrieving previous build number from apache.snapshots.https
[WARNING] *** CHECKSUM FAILED - Checksum failed on download: local = 'd9436cd2c2747e761c78286b82e0a49235815940';
remote = '8bd9f3a1477e78051b8a61c011ad722ee48608bc' - RETRYING
[WARNING] *** CHECKSUM FAILED - Checksum failed on download: local = 'd9436cd2c2747e761c78286b82e0a49235815940';
remote = '8bd9f3a1477e78051b8a61c011ad722ee48608bc' - IGNORING
Uploading: https://repository.apache.org/content/repositories/snapshots/org/apache/tuscany/sca/tuscany-quickstart/2.5-SNAPSHOT/tuscany-quickstart-2.5-SNAPSHOT.jar
12K uploaded  (tuscany-quickstart-2.5-SNAPSHOT.jar)
[INFO] Retrieving previous metadata from apache.snapshots.https
[INFO] Uploading repository metadata for: 'artifact org.apache.tuscany.sca:tuscany-quickstart'
[INFO] Retrieving previous metadata from apache.snapshots.https
[WARNING] *** CHECKSUM FAILED - Checksum failed on download: local = 'd9436cd2c2747e761c78286b82e0a49235815940';
remote = '8bd9f3a1477e78051b8a61c011ad722ee48608bc' - RETRYING
[WARNING] *** CHECKSUM FAILED - Checksum failed on download: local = 'd9436cd2c2747e761c78286b82e0a49235815940';
remote = '8bd9f3a1477e78051b8a61c011ad722ee48608bc' - IGNORING
[INFO] Uploading repository metadata for: 'snapshot org.apache.tuscany.sca:tuscany-quickstart:2.5-SNAPSHOT'
[INFO] Uploading project information for tuscany-quickstart 2.5-SNAPSHOT
[JENKINS] Archiving disabled - not archiving <https://builds.apache.org/job/Tuscany-2x-deploy/ws/sca-2x/maven/archetypes/quickstart/pom.xml>
[JENKINS] Archiving disabled - not archiving <https://builds.apache.org/job/Tuscany-2x-deploy/ws/sca-2x/maven/archetypes/quickstart/target/tuscany-quickstart-2.5-SNAPSHOT.jar>
[INFO] ------------------------------------------------------------------------
[INFO] Building Create a Tuscany SCA and JSF project
[INFO]    task-segment: [clean, deploy]
[INFO] ------------------------------------------------------------------------
[INFO] [clean:clean {execution: default-clean}]
[INFO] Deleting <https://builds.apache.org/job/Tuscany-2x-deploy/ws/sca-2x/maven/archetypes/quickstart-jsf/target>
[INFO] [enforcer:enforce {execution: enforce-plugin-versions}]
[INFO] [remote-resources:process {execution: default}]
[INFO] [resources:resources {execution: default-resources}]
[INFO] Using 'UTF-8' encoding to copy filtered resources.
[INFO] Copying 12 resources
[INFO] Copying 0 resource
[INFO] Copying 3 resources
[INFO] [resources:testResources {execution: default-testResources}]
[INFO] Using 'UTF-8' encoding to copy filtered resources.
[INFO] skip non existing resourceDirectory <https://builds.apache.org/job/Tuscany-2x-deploy/ws/sca-2x/maven/archetypes/quickstart-jsf/src/test/resources>
[INFO] Copying 3 resources
[INFO] [archetype:jar {execution: default-jar}]
[INFO] Building archetype jar: <https://builds.apache.org/job/Tuscany-2x-deploy/ws/sca-2x/maven/archetypes/quickstart-jsf/target/tuscany-quickstart-jsf-2.5-SNAPSHOT>
[INFO] [archetype:integration-test {execution: default-integration-test}]
[WARNING] No Archetype IT projects: root 'projects' directory not found.
[INFO] [install:install {execution: default-install}]
[INFO] Installing <https://builds.apache.org/job/Tuscany-2x-deploy/ws/sca-2x/maven/archetypes/quickstart-jsf/target/tuscany-quickstart-jsf-2.5-SNAPSHOT.jar>
to <https://builds.apache.org/job/Tuscany-2x-deploy/ws/.repository/org/apache/tuscany/sca/tuscany-quickstart-jsf/2.5-SNAPSHOT/tuscany-quickstart-jsf-2.5-SNAPSHOT.jar>
[INFO] [archetype:update-local-catalog {execution: default-update-local-catalog}]
[INFO] [deploy:deploy {execution: default-deploy}]
[INFO] Retrieving previous build number from apache.snapshots.https
[WARNING] *** CHECKSUM FAILED - Checksum failed on download: local = '00fbeb9029724706c082c1af9ea53cc3a30a887e';
remote = '45cb262261b42dfc0cfcdc486b72e3e2a5b24c3e' - RETRYING
[WARNING] *** CHECKSUM FAILED - Checksum failed on download: local = '00fbeb9029724706c082c1af9ea53cc3a30a887e';
remote = '45cb262261b42dfc0cfcdc486b72e3e2a5b24c3e' - IGNORING
Uploading: https://repository.apache.org/content/repositories/snapshots/org/apache/tuscany/sca/tuscany-quickstart-jsf/2.5-SNAPSHOT/tuscany-quickstart-jsf-2.5-SNAPSHOT.jar
17K uploaded  (tuscany-quickstart-jsf-2.5-SNAPSHOT.jar)
[INFO] Uploading project information for tuscany-quickstart-jsf 2.5-SNAPSHOT
[INFO] Retrieving previous metadata from apache.snapshots.https
[WARNING] *** CHECKSUM FAILED - Checksum failed on download: local = '00fbeb9029724706c082c1af9ea53cc3a30a887e';
remote = '45cb262261b42dfc0cfcdc486b72e3e2a5b24c3e' - RETRYING
[WARNING] *** CHECKSUM FAILED - Checksum failed on download: local = '00fbeb9029724706c082c1af9ea53cc3a30a887e';
remote = '45cb262261b42dfc0cfcdc486b72e3e2a5b24c3e' - IGNORING
[INFO] Uploading repository metadata for: 'snapshot org.apache.tuscany.sca:tuscany-quickstart-jsf:2.5-SNAPSHOT'
[INFO] Retrieving previous metadata from apache.snapshots.https
[INFO] Uploading repository metadata for: 'artifact org.apache.tuscany.sca:tuscany-quickstart-jsf'
[JENKINS] Archiving disabled - not archiving <https://builds.apache.org/job/Tuscany-2x-deploy/ws/sca-2x/maven/archetypes/quickstart-jsf/pom.xml>
[JENKINS] Archiving disabled - not archiving <https://builds.apache.org/job/Tuscany-2x-deploy/ws/sca-2x/maven/archetypes/quickstart-jsf/target/tuscany-quickstart-jsf-2.5-SNAPSHOT.jar>
[INFO] ------------------------------------------------------------------------
[INFO] Building Create a simple Apache Tuscany SCA webapp project using the Stripes Web Framework
[INFO]    task-segment: [clean, deploy]
[INFO] ------------------------------------------------------------------------
[INFO] [clean:clean {execution: default-clean}]
[INFO] Deleting <https://builds.apache.org/job/Tuscany-2x-deploy/ws/sca-2x/maven/archetypes/quickstart-stripes/target>
[INFO] [enforcer:enforce {execution: enforce-plugin-versions}]
[INFO] [remote-resources:process {execution: default}]
[INFO] [resources:resources {execution: default-resources}]
[INFO] Using 'UTF-8' encoding to copy filtered resources.
[INFO] Copying 15 resources
[INFO] Copying 1 resource
[INFO] Copying 3 resources
[INFO] [resources:testResources {execution: default-testResources}]
[INFO] Using 'UTF-8' encoding to copy filtered resources.
[INFO] skip non existing resourceDirectory <https://builds.apache.org/job/Tuscany-2x-deploy/ws/sca-2x/maven/archetypes/quickstart-stripes/src/test/resources>
[INFO] Copying 3 resources
[INFO] [archetype:jar {execution: default-jar}]
[INFO] Building archetype jar: <https://builds.apache.org/job/Tuscany-2x-deploy/ws/sca-2x/maven/archetypes/quickstart-stripes/target/tuscany-quickstart-stripes-2.5-SNAPSHOT>
[INFO] [archetype:integration-test {execution: default-integration-test}]
[WARNING] No Archetype IT projects: root 'projects' directory not found.
[INFO] [install:install {execution: default-install}]
[INFO] Installing <https://builds.apache.org/job/Tuscany-2x-deploy/ws/sca-2x/maven/archetypes/quickstart-stripes/target/tuscany-quickstart-stripes-2.5-SNAPSHOT.jar>
to <https://builds.apache.org/job/Tuscany-2x-deploy/ws/.repository/org/apache/tuscany/sca/tuscany-quickstart-stripes/2.5-SNAPSHOT/tuscany-quickstart-stripes-2.5-SNAPSHOT.jar>
[INFO] [archetype:update-local-catalog {execution: default-update-local-catalog}]
[INFO] [deploy:deploy {execution: default-deploy}]
[INFO] Retrieving previous build number from apache.snapshots.https
[WARNING] *** CHECKSUM FAILED - Checksum failed on download: local = '0594dd1ad1d3347a30ef59d644f8db6db65ee970';
remote = '3d0008fee0bfec1bfefdb809a3c3bad128b70723' - RETRYING
[WARNING] *** CHECKSUM FAILED - Checksum failed on download: local = '0594dd1ad1d3347a30ef59d644f8db6db65ee970';
remote = '3d0008fee0bfec1bfefdb809a3c3bad128b70723' - IGNORING
Uploading: https://repository.apache.org/content/repositories/snapshots/org/apache/tuscany/sca/tuscany-quickstart-stripes/2.5-SNAPSHOT/tuscany-quickstart-stripes-2.5-SNAPSHOT.jar
19K uploaded  (tuscany-quickstart-stripes-2.5-SNAPSHOT.jar)
[INFO] Uploading project information for tuscany-quickstart-stripes 2.5-SNAPSHOT
[INFO] Retrieving previous metadata from apache.snapshots.https
[INFO] Uploading repository metadata for: 'artifact org.apache.tuscany.sca:tuscany-quickstart-stripes'
[INFO] Retrieving previous metadata from apache.snapshots.https
[WARNING] *** CHECKSUM FAILED - Checksum failed on download: local = '0594dd1ad1d3347a30ef59d644f8db6db65ee970';
remote = '3d0008fee0bfec1bfefdb809a3c3bad128b70723' - RETRYING
[WARNING] *** CHECKSUM FAILED - Checksum failed on download: local = '0594dd1ad1d3347a30ef59d644f8db6db65ee970';
remote = '3d0008fee0bfec1bfefdb809a3c3bad128b70723' - IGNORING
[INFO] Uploading repository metadata for: 'snapshot org.apache.tuscany.sca:tuscany-quickstart-stripes:2.5-SNAPSHOT'
[JENKINS] Archiving disabled - not archiving <https://builds.apache.org/job/Tuscany-2x-deploy/ws/sca-2x/maven/archetypes/quickstart-stripes/pom.xml>
[JENKINS] Archiving disabled - not archiving <https://builds.apache.org/job/Tuscany-2x-deploy/ws/sca-2x/maven/archetypes/quickstart-stripes/target/tuscany-quickstart-stripes-2.5-SNAPSHOT.jar>
[INFO] ------------------------------------------------------------------------
[INFO] Building Create an SCA Webapp project using BPEL
[INFO]    task-segment: [clean, deploy]
[INFO] ------------------------------------------------------------------------
[INFO] [clean:clean {execution: default-clean}]
[INFO] Deleting <https://builds.apache.org/job/Tuscany-2x-deploy/ws/sca-2x/maven/archetypes/quickstart-bpel/target>
[INFO] [enforcer:enforce {execution: enforce-plugin-versions}]
[INFO] [remote-resources:process {execution: default}]
[INFO] [resources:resources {execution: default-resources}]
[INFO] Using 'UTF-8' encoding to copy filtered resources.
[INFO] Copying 9 resources
[INFO] Copying 1 resource
[INFO] Copying 3 resources
[INFO] [resources:testResources {execution: default-testResources}]
[INFO] Using 'UTF-8' encoding to copy filtered resources.
[INFO] skip non existing resourceDirectory <https://builds.apache.org/job/Tuscany-2x-deploy/ws/sca-2x/maven/archetypes/quickstart-bpel/src/test/resources>
[INFO] Copying 3 resources
[INFO] [archetype:jar {execution: default-jar}]
[INFO] Building archetype jar: <https://builds.apache.org/job/Tuscany-2x-deploy/ws/sca-2x/maven/archetypes/quickstart-bpel/target/tuscany-quickstart-bpel-2.5-SNAPSHOT>
[INFO] [archetype:integration-test {execution: default-integration-test}]
[WARNING] No Archetype IT projects: root 'projects' directory not found.
[INFO] [install:install {execution: default-install}]
[INFO] Installing <https://builds.apache.org/job/Tuscany-2x-deploy/ws/sca-2x/maven/archetypes/quickstart-bpel/target/tuscany-quickstart-bpel-2.5-SNAPSHOT.jar>
to <https://builds.apache.org/job/Tuscany-2x-deploy/ws/.repository/org/apache/tuscany/sca/tuscany-quickstart-bpel/2.5-SNAPSHOT/tuscany-quickstart-bpel-2.5-SNAPSHOT.jar>
[INFO] [archetype:update-local-catalog {execution: default-update-local-catalog}]
[INFO] [deploy:deploy {execution: default-deploy}]
[INFO] Retrieving previous build number from apache.snapshots.https
[WARNING] *** CHECKSUM FAILED - Checksum failed on download: local = '51665f288685c870848f42b77d2bed22ee4f1d8d';
remote = 'f58418745289f351e0bf234fdcabe7f49c7070ad' - RETRYING
[WARNING] *** CHECKSUM FAILED - Checksum failed on download: local = '51665f288685c870848f42b77d2bed22ee4f1d8d';
remote = 'f58418745289f351e0bf234fdcabe7f49c7070ad' - IGNORING
Uploading: https://repository.apache.org/content/repositories/snapshots/org/apache/tuscany/sca/tuscany-quickstart-bpel/2.5-SNAPSHOT/tuscany-quickstart-bpel-2.5-SNAPSHOT.jar
14K uploaded  (tuscany-quickstart-bpel-2.5-SNAPSHOT.jar)
[INFO] Retrieving previous metadata from apache.snapshots.https
[WARNING] *** CHECKSUM FAILED - Checksum failed on download: local = '51665f288685c870848f42b77d2bed22ee4f1d8d';
remote = 'f58418745289f351e0bf234fdcabe7f49c7070ad' - RETRYING
[WARNING] *** CHECKSUM FAILED - Checksum failed on download: local = '51665f288685c870848f42b77d2bed22ee4f1d8d';
remote = 'f58418745289f351e0bf234fdcabe7f49c7070ad' - IGNORING
[INFO] Uploading repository metadata for: 'snapshot org.apache.tuscany.sca:tuscany-quickstart-bpel:2.5-SNAPSHOT'
[INFO] Retrieving previous metadata from apache.snapshots.https
[INFO] Uploading repository metadata for: 'artifact org.apache.tuscany.sca:tuscany-quickstart-bpel'
[INFO] Uploading project information for tuscany-quickstart-bpel 2.5-SNAPSHOT
[JENKINS] Archiving disabled - not archiving <https://builds.apache.org/job/Tuscany-2x-deploy/ws/sca-2x/maven/archetypes/quickstart-bpel/pom.xml>
[JENKINS] Archiving disabled - not archiving <https://builds.apache.org/job/Tuscany-2x-deploy/ws/sca-2x/maven/archetypes/quickstart-bpel/target/tuscany-quickstart-bpel-2.5-SNAPSHOT.jar>
[INFO] ------------------------------------------------------------------------
[INFO] Building Apache Tuscany SCA Maven Archetypes
[INFO]    task-segment: [clean, deploy]
[INFO] ------------------------------------------------------------------------
[INFO] [clean:clean {execution: default-clean}]
[INFO] Deleting <https://builds.apache.org/job/Tuscany-2x-deploy/ws/sca-2x/maven/archetypes/target>
[INFO] [enforcer:enforce {execution: enforce-plugin-versions}]
[INFO] [remote-resources:process {execution: default}]
[INFO] [site:attach-descriptor {execution: default-attach-descriptor}]
[INFO] [install:install {execution: default-install}]
[INFO] Installing <https://builds.apache.org/job/Tuscany-2x-deploy/ws/sca-2x/maven/archetypes/pom.xml>
to <https://builds.apache.org/job/Tuscany-2x-deploy/ws/.repository/org/apache/tuscany/sca/tuscany-archetype/2.5-SNAPSHOT/tuscany-archetype-2.5-SNAPSHOT.pom>
[INFO] [deploy:deploy {execution: default-deploy}]
[INFO] Retrieving previous build number from apache.snapshots.https
[WARNING] *** CHECKSUM FAILED - Checksum failed on download: local = '30fb7f23c237a8fb0e381e275ac31880b147f3a9';
remote = '3a659c736a02185f7abb9bb4cc2d113921b214e3' - RETRYING
[WARNING] *** CHECKSUM FAILED - Checksum failed on download: local = '30fb7f23c237a8fb0e381e275ac31880b147f3a9';
remote = '3a659c736a02185f7abb9bb4cc2d113921b214e3' - IGNORING
Uploading: https://repository.apache.org/content/repositories/snapshots/org/apache/tuscany/sca/tuscany-archetype/2.5-SNAPSHOT/tuscany-archetype-2.5-SNAPSHOT.pom
1K uploaded  (tuscany-archetype-2.5-SNAPSHOT.pom)
[INFO] Retrieving previous metadata from apache.snapshots.https
[INFO] Uploading repository metadata for: 'artifact org.apache.tuscany.sca:tuscany-archetype'
[INFO] Retrieving previous metadata from apache.snapshots.https
[WARNING] *** CHECKSUM FAILED - Checksum failed on download: local = '30fb7f23c237a8fb0e381e275ac31880b147f3a9';
remote = '3a659c736a02185f7abb9bb4cc2d113921b214e3' - RETRYING
[WARNING] *** CHECKSUM FAILED - Checksum failed on download: local = '30fb7f23c237a8fb0e381e275ac31880b147f3a9';
remote = '3a659c736a02185f7abb9bb4cc2d113921b214e3' - IGNORING
[INFO] Uploading repository metadata for: 'snapshot org.apache.tuscany.sca:tuscany-archetype:2.5-SNAPSHOT'
[JENKINS] Archiving disabled - not archiving <https://builds.apache.org/job/Tuscany-2x-deploy/ws/sca-2x/maven/archetypes/pom.xml>
[JENKINS] Archiving disabled - not archiving <https://builds.apache.org/job/Tuscany-2x-deploy/ws/.repository/org/apache/tuscany/sca/tuscany-archetype/2.5-SNAPSHOT/tuscany-archetype-2.5-SNAPSHOT.pom>
[INFO] ------------------------------------------------------------------------
[INFO] Building Apache Tuscany SCA Web JavaScript
[INFO]    task-segment: [clean, deploy]
[INFO] ------------------------------------------------------------------------
[INFO] [clean:clean {execution: default-clean}]
[INFO] Deleting <https://builds.apache.org/job/Tuscany-2x-deploy/ws/sca-2x/modules/web-javascript/target>
[INFO] [enforcer:enforce {execution: enforce-plugin-versions}]
[INFO] [remote-resources:process {execution: default}]
[INFO] [resources:resources {execution: default-resources}]
[INFO] Using 'UTF-8' encoding to copy filtered resources.
[INFO] Copying 3 resources
[INFO] Copying 3 resources
[INFO] Copying 3 resources
[INFO] [compiler:compile {execution: default-compile}]
[INFO] Compiling 6 source files to <https://builds.apache.org/job/Tuscany-2x-deploy/ws/sca-2x/modules/web-javascript/target/classes>
[INFO] [resources:testResources {execution: default-testResources}]
[INFO] Using 'UTF-8' encoding to copy filtered resources.
[INFO] skip non existing resourceDirectory <https://builds.apache.org/job/Tuscany-2x-deploy/ws/sca-2x/modules/web-javascript/src/test/resources>
[INFO] Copying 3 resources
[INFO] [compiler:testCompile {execution: default-testCompile}]
[INFO] No sources to compile
[INFO] [surefire:test {execution: default-test}]
[INFO] Tests are skipped.
[INFO] [jar:jar {execution: default-jar}]
[INFO] Building jar: <https://builds.apache.org/job/Tuscany-2x-deploy/ws/sca-2x/modules/web-javascript/target/tuscany-web-javascript-2.5-SNAPSHOT.jar>
[INFO] [source:jar-no-fork {execution: attach-sources}]
[INFO] Building jar: <https://builds.apache.org/job/Tuscany-2x-deploy/ws/sca-2x/modules/web-javascript/target/tuscany-web-javascript-2.5-SNAPSHOT-sources.jar>
[INFO] [install:install {execution: default-install}]
[INFO] Installing <https://builds.apache.org/job/Tuscany-2x-deploy/ws/sca-2x/modules/web-javascript/target/tuscany-web-javascript-2.5-SNAPSHOT.jar>
to <https://builds.apache.org/job/Tuscany-2x-deploy/ws/.repository/org/apache/tuscany/sca/tuscany-web-javascript/2.5-SNAPSHOT/tuscany-web-javascript-2.5-SNAPSHOT.jar>
[INFO] Installing <https://builds.apache.org/job/Tuscany-2x-deploy/ws/sca-2x/modules/web-javascript/target/tuscany-web-javascript-2.5-SNAPSHOT-sources.jar>
to <https://builds.apache.org/job/Tuscany-2x-deploy/ws/.repository/org/apache/tuscany/sca/tuscany-web-javascript/2.5-SNAPSHOT/tuscany-web-javascript-2.5-SNAPSHOT-sources.jar>
[INFO] [deploy:deploy {execution: default-deploy}]
[INFO] Retrieving previous build number from apache.snapshots.https
[WARNING] *** CHECKSUM FAILED - Checksum failed on download: local = '1afbb545b14e5d28481c883dc052d0a8ae8c6295';
remote = '3e8362b6ce05b3aa77d00aab022d78b4c50ac388' - RETRYING
[WARNING] *** CHECKSUM FAILED - Checksum failed on download: local = '1afbb545b14e5d28481c883dc052d0a8ae8c6295';
remote = '3e8362b6ce05b3aa77d00aab022d78b4c50ac388' - IGNORING
Uploading: https://repository.apache.org/content/repositories/snapshots/org/apache/tuscany/sca/tuscany-web-javascript/2.5-SNAPSHOT/tuscany-web-javascript-2.5-SNAPSHOT.jar
22K uploaded  (tuscany-web-javascript-2.5-SNAPSHOT.jar)
[INFO] Retrieving previous metadata from apache.snapshots.https
[WARNING] *** CHECKSUM FAILED - Checksum failed on download: local = '1afbb545b14e5d28481c883dc052d0a8ae8c6295';
remote = '3e8362b6ce05b3aa77d00aab022d78b4c50ac388' - RETRYING
[WARNING] *** CHECKSUM FAILED - Checksum failed on download: local = '1afbb545b14e5d28481c883dc052d0a8ae8c6295';
remote = '3e8362b6ce05b3aa77d00aab022d78b4c50ac388' - IGNORING
[INFO] Uploading repository metadata for: 'snapshot org.apache.tuscany.sca:tuscany-web-javascript:2.5-SNAPSHOT'
[INFO] Uploading project information for tuscany-web-javascript 2.5-SNAPSHOT
[INFO] Retrieving previous metadata from apache.snapshots.https
[INFO] Uploading repository metadata for: 'artifact org.apache.tuscany.sca:tuscany-web-javascript'
[INFO] Retrieving previous build number from apache.snapshots.https
Uploading: https://repository.apache.org/content/repositories/snapshots/org/apache/tuscany/sca/tuscany-web-javascript/2.5-SNAPSHOT/tuscany-web-javascript-2.5-SNAPSHOT-sources.jar
21K uploaded  (tuscany-web-javascript-2.5-SNAPSHOT-sources.jar)
[JENKINS] Archiving disabled - not archiving <https://builds.apache.org/job/Tuscany-2x-deploy/ws/sca-2x/modules/web-javascript/pom.xml>
[JENKINS] Archiving disabled - not archiving <https://builds.apache.org/job/Tuscany-2x-deploy/ws/sca-2x/modules/web-javascript/target/tuscany-web-javascript-2.5-SNAPSHOT.jar>
[JENKINS] Archiving disabled - not archiving <https://builds.apache.org/job/Tuscany-2x-deploy/ws/sca-2x/modules/web-javascript/target/tuscany-web-javascript-2.5-SNAPSHOT-sources.jar>
[INFO] ------------------------------------------------------------------------
[INFO] Building Apache Tuscany SCA Abdera Atom Feed Binding Extension
[INFO]    task-segment: [clean, deploy]
[INFO] ------------------------------------------------------------------------
[INFO] [clean:clean {execution: default-clean}]
[INFO] Deleting <https://builds.apache.org/job/Tuscany-2x-deploy/ws/sca-2x/modules/binding-atom-runtime/target>
[INFO] [enforcer:enforce {execution: enforce-plugin-versions}]
[INFO] [remote-resources:process {execution: default}]
[INFO] [resources:resources {execution: default-resources}]
[INFO] Using 'UTF-8' encoding to copy filtered resources.
[INFO] Copying 2 resources
[INFO] Copying 3 resources
[INFO] Copying 3 resources
[INFO] [compiler:compile {execution: default-compile}]
[INFO] Compiling 11 source files to <https://builds.apache.org/job/Tuscany-2x-deploy/ws/sca-2x/modules/binding-atom-runtime/target/classes>
[JENKINS] Archiving disabled - not archiving <https://builds.apache.org/job/Tuscany-2x-deploy/ws/sca-2x/modules/binding-atom-runtime/pom.xml>
[INFO] ------------------------------------------------------------------------
[ERROR] BUILD ERROR
[INFO] ------------------------------------------------------------------------
[INFO] Fatal error compiling

Embedded error: Error while executing the external compiler.
error=12, Not enough space
[INFO] ------------------------------------------------------------------------
[INFO] For more information, run Maven with the -e switch
[INFO] ------------------------------------------------------------------------
[INFO] Total time: 37 minutes 15 seconds
[INFO] Finished at: Mon Sep 10 01:17:23 GMT+00:00 2012
[INFO] Final Memory: 331M/660M
[INFO] ------------------------------------------------------------------------
channel stopped

Mime
View raw message