tuscany-commits mailing list archives

Site index · List index
Message view « Date » · « Thread »
Top « Date » · « Thread »
From Apache Jenkins Server <jenk...@builds.apache.org>
Subject Build failed in Jenkins: Tuscany-2x-deploy #918
Date Sun, 09 Sep 2012 01:10:35 GMT
See <https://builds.apache.org/job/Tuscany-2x-deploy/918/>

------------------------------------------
[...truncated 308 lines...]
[WARNING] *** CHECKSUM FAILED - Checksum failed on download: local = '824fc3542465bc83eb4717262f0067ada82023d6';
remote = 'b62a906cf23f3ad2b5cb241f46c9b1f1d78b66d4' - IGNORING
Uploading: https://repository.apache.org/content/repositories/snapshots/org/apache/tuscany/sca/tuscany-extensibility/2.5-SNAPSHOT/tuscany-extensibility-2.5-SNAPSHOT.jar
71K uploaded  (tuscany-extensibility-2.5-SNAPSHOT.jar)
[INFO] Retrieving previous metadata from apache.snapshots.https
[WARNING] *** CHECKSUM FAILED - Checksum failed on download: local = '824fc3542465bc83eb4717262f0067ada82023d6';
remote = 'b62a906cf23f3ad2b5cb241f46c9b1f1d78b66d4' - RETRYING
[WARNING] *** CHECKSUM FAILED - Checksum failed on download: local = '824fc3542465bc83eb4717262f0067ada82023d6';
remote = 'b62a906cf23f3ad2b5cb241f46c9b1f1d78b66d4' - IGNORING
[INFO] Uploading repository metadata for: 'snapshot org.apache.tuscany.sca:tuscany-extensibility:2.5-SNAPSHOT'
[INFO] Retrieving previous metadata from apache.snapshots.https
[INFO] Uploading repository metadata for: 'artifact org.apache.tuscany.sca:tuscany-extensibility'
[INFO] Uploading project information for tuscany-extensibility 2.5-SNAPSHOT
[INFO] Retrieving previous build number from apache.snapshots.https
Uploading: https://repository.apache.org/content/repositories/snapshots/org/apache/tuscany/sca/tuscany-extensibility/2.5-SNAPSHOT/tuscany-extensibility-2.5-SNAPSHOT-sources.jar
53K uploaded  (tuscany-extensibility-2.5-SNAPSHOT-sources.jar)
[JENKINS] Archiving disabled - not archiving <https://builds.apache.org/job/Tuscany-2x-deploy/ws/sca-2x/modules/extensibility/pom.xml>
[JENKINS] Archiving disabled - not archiving <https://builds.apache.org/job/Tuscany-2x-deploy/ws/sca-2x/modules/extensibility/target/tuscany-extensibility-2.5-SNAPSHOT.jar>
[JENKINS] Archiving disabled - not archiving <https://builds.apache.org/job/Tuscany-2x-deploy/ws/sca-2x/modules/extensibility/target/tuscany-extensibility-2.5-SNAPSHOT-sources.jar>
[INFO] ------------------------------------------------------------------------
[INFO] Building Apache Tuscany SCA Assembly Model
[INFO]    task-segment: [clean, deploy]
[INFO] ------------------------------------------------------------------------
[INFO] [clean:clean {execution: default-clean}]
[INFO] Deleting <https://builds.apache.org/job/Tuscany-2x-deploy/ws/sca-2x/modules/assembly/target>
[INFO] [enforcer:enforce {execution: enforce-plugin-versions}]
[INFO] [remote-resources:process {execution: default}]
[INFO] [resources:resources {execution: default-resources}]
[INFO] Using 'UTF-8' encoding to copy filtered resources.
[INFO] Copying 9 resources
[INFO] Copying 3 resources
[INFO] Copying 3 resources
[INFO] [compiler:compile {execution: default-compile}]
[INFO] Compiling 136 source files to <https://builds.apache.org/job/Tuscany-2x-deploy/ws/sca-2x/modules/assembly/target/classes>
[INFO] [resources:testResources {execution: default-testResources}]
[INFO] Using 'UTF-8' encoding to copy filtered resources.
[INFO] skip non existing resourceDirectory <https://builds.apache.org/job/Tuscany-2x-deploy/ws/sca-2x/modules/assembly/src/test/resources>
[INFO] Copying 3 resources
[INFO] [compiler:testCompile {execution: default-testCompile}]
[INFO] Compiling 9 source files to <https://builds.apache.org/job/Tuscany-2x-deploy/ws/sca-2x/modules/assembly/target/test-classes>
[INFO] [surefire:test {execution: default-test}]
[INFO] Tests are skipped.
[INFO] [jar:jar {execution: default-jar}]
[INFO] Building jar: <https://builds.apache.org/job/Tuscany-2x-deploy/ws/sca-2x/modules/assembly/target/tuscany-assembly-2.5-SNAPSHOT.jar>
[INFO] [source:jar-no-fork {execution: attach-sources}]
[INFO] Building jar: <https://builds.apache.org/job/Tuscany-2x-deploy/ws/sca-2x/modules/assembly/target/tuscany-assembly-2.5-SNAPSHOT-sources.jar>
[INFO] [install:install {execution: default-install}]
[INFO] Installing <https://builds.apache.org/job/Tuscany-2x-deploy/ws/sca-2x/modules/assembly/target/tuscany-assembly-2.5-SNAPSHOT.jar>
to <https://builds.apache.org/job/Tuscany-2x-deploy/ws/.repository/org/apache/tuscany/sca/tuscany-assembly/2.5-SNAPSHOT/tuscany-assembly-2.5-SNAPSHOT.jar>
[INFO] Installing <https://builds.apache.org/job/Tuscany-2x-deploy/ws/sca-2x/modules/assembly/target/tuscany-assembly-2.5-SNAPSHOT-sources.jar>
to <https://builds.apache.org/job/Tuscany-2x-deploy/ws/.repository/org/apache/tuscany/sca/tuscany-assembly/2.5-SNAPSHOT/tuscany-assembly-2.5-SNAPSHOT-sources.jar>
[INFO] [deploy:deploy {execution: default-deploy}]
[INFO] Retrieving previous build number from apache.snapshots.https
[WARNING] *** CHECKSUM FAILED - Checksum failed on download: local = '18def8706f5ebca6dc763d93a626e373990ecd61';
remote = 'd8e73559a3f45296bf50d865963a1561d461417b' - RETRYING
[WARNING] *** CHECKSUM FAILED - Checksum failed on download: local = '18def8706f5ebca6dc763d93a626e373990ecd61';
remote = 'd8e73559a3f45296bf50d865963a1561d461417b' - IGNORING
Uploading: https://repository.apache.org/content/repositories/snapshots/org/apache/tuscany/sca/tuscany-assembly/2.5-SNAPSHOT/tuscany-assembly-2.5-SNAPSHOT.jar
162K uploaded  (tuscany-assembly-2.5-SNAPSHOT.jar)
[INFO] Retrieving previous metadata from apache.snapshots.https
[WARNING] *** CHECKSUM FAILED - Checksum failed on download: local = '18def8706f5ebca6dc763d93a626e373990ecd61';
remote = 'd8e73559a3f45296bf50d865963a1561d461417b' - RETRYING
[WARNING] *** CHECKSUM FAILED - Checksum failed on download: local = '18def8706f5ebca6dc763d93a626e373990ecd61';
remote = 'd8e73559a3f45296bf50d865963a1561d461417b' - IGNORING
[INFO] Uploading repository metadata for: 'snapshot org.apache.tuscany.sca:tuscany-assembly:2.5-SNAPSHOT'
[INFO] Retrieving previous metadata from apache.snapshots.https
[INFO] Uploading repository metadata for: 'artifact org.apache.tuscany.sca:tuscany-assembly'
[INFO] Uploading project information for tuscany-assembly 2.5-SNAPSHOT
[INFO] Retrieving previous build number from apache.snapshots.https
Uploading: https://repository.apache.org/content/repositories/snapshots/org/apache/tuscany/sca/tuscany-assembly/2.5-SNAPSHOT/tuscany-assembly-2.5-SNAPSHOT-sources.jar
187K uploaded  (tuscany-assembly-2.5-SNAPSHOT-sources.jar)
[JENKINS] Archiving disabled - not archiving <https://builds.apache.org/job/Tuscany-2x-deploy/ws/sca-2x/modules/assembly/pom.xml>
[JENKINS] Archiving disabled - not archiving <https://builds.apache.org/job/Tuscany-2x-deploy/ws/sca-2x/modules/assembly/target/tuscany-assembly-2.5-SNAPSHOT.jar>
[JENKINS] Archiving disabled - not archiving <https://builds.apache.org/job/Tuscany-2x-deploy/ws/sca-2x/modules/assembly/target/tuscany-assembly-2.5-SNAPSHOT-sources.jar>
[INFO] ------------------------------------------------------------------------
[INFO] Building Apache Tuscany SCA Assembly Model XSD Files
[INFO]    task-segment: [clean, deploy]
[INFO] ------------------------------------------------------------------------
[INFO] [clean:clean {execution: default-clean}]
[INFO] Deleting <https://builds.apache.org/job/Tuscany-2x-deploy/ws/sca-2x/modules/assembly-xsd/target>
[INFO] [enforcer:enforce {execution: enforce-plugin-versions}]
[INFO] [remote-resources:process {execution: default}]
[INFO] [resources:resources {execution: default-resources}]
[INFO] Using 'UTF-8' encoding to copy filtered resources.
[INFO] Copying 51 resources
[INFO] Copying 3 resources
[INFO] Copying 3 resources
[INFO] [compiler:compile {execution: default-compile}]
[INFO] Compiling 1 source file to <https://builds.apache.org/job/Tuscany-2x-deploy/ws/sca-2x/modules/assembly-xsd/target/classes>
[INFO] [resources:testResources {execution: default-testResources}]
[INFO] Using 'UTF-8' encoding to copy filtered resources.
[INFO] skip non existing resourceDirectory <https://builds.apache.org/job/Tuscany-2x-deploy/ws/sca-2x/modules/assembly-xsd/src/test/resources>
[INFO] Copying 3 resources
[INFO] [compiler:testCompile {execution: default-testCompile}]
[INFO] No sources to compile
[INFO] [surefire:test {execution: default-test}]
[INFO] Tests are skipped.
[INFO] [jar:jar {execution: default-jar}]
[INFO] Building jar: <https://builds.apache.org/job/Tuscany-2x-deploy/ws/sca-2x/modules/assembly-xsd/target/tuscany-assembly-xsd-2.5-SNAPSHOT.jar>
[INFO] [source:jar-no-fork {execution: attach-sources}]
[INFO] Building jar: <https://builds.apache.org/job/Tuscany-2x-deploy/ws/sca-2x/modules/assembly-xsd/target/tuscany-assembly-xsd-2.5-SNAPSHOT-sources.jar>
[INFO] [install:install {execution: default-install}]
[INFO] Installing <https://builds.apache.org/job/Tuscany-2x-deploy/ws/sca-2x/modules/assembly-xsd/target/tuscany-assembly-xsd-2.5-SNAPSHOT.jar>
to <https://builds.apache.org/job/Tuscany-2x-deploy/ws/.repository/org/apache/tuscany/sca/tuscany-assembly-xsd/2.5-SNAPSHOT/tuscany-assembly-xsd-2.5-SNAPSHOT.jar>
[INFO] Installing <https://builds.apache.org/job/Tuscany-2x-deploy/ws/sca-2x/modules/assembly-xsd/target/tuscany-assembly-xsd-2.5-SNAPSHOT-sources.jar>
to <https://builds.apache.org/job/Tuscany-2x-deploy/ws/.repository/org/apache/tuscany/sca/tuscany-assembly-xsd/2.5-SNAPSHOT/tuscany-assembly-xsd-2.5-SNAPSHOT-sources.jar>
[INFO] [deploy:deploy {execution: default-deploy}]
[INFO] Retrieving previous build number from apache.snapshots.https
[WARNING] *** CHECKSUM FAILED - Checksum failed on download: local = 'ee325abb01bb54f4d5abe90a12d01285534ec587';
remote = '1ab5cc7348397bde875c98632048cad5cd93465a' - RETRYING
[WARNING] *** CHECKSUM FAILED - Checksum failed on download: local = 'ee325abb01bb54f4d5abe90a12d01285534ec587';
remote = '1ab5cc7348397bde875c98632048cad5cd93465a' - IGNORING
Uploading: https://repository.apache.org/content/repositories/snapshots/org/apache/tuscany/sca/tuscany-assembly-xsd/2.5-SNAPSHOT/tuscany-assembly-xsd-2.5-SNAPSHOT.jar
75K uploaded  (tuscany-assembly-xsd-2.5-SNAPSHOT.jar)
[INFO] Retrieving previous metadata from apache.snapshots.https
[WARNING] *** CHECKSUM FAILED - Checksum failed on download: local = 'ee325abb01bb54f4d5abe90a12d01285534ec587';
remote = '1ab5cc7348397bde875c98632048cad5cd93465a' - RETRYING
[WARNING] *** CHECKSUM FAILED - Checksum failed on download: local = 'ee325abb01bb54f4d5abe90a12d01285534ec587';
remote = '1ab5cc7348397bde875c98632048cad5cd93465a' - IGNORING
[INFO] Uploading repository metadata for: 'snapshot org.apache.tuscany.sca:tuscany-assembly-xsd:2.5-SNAPSHOT'
[INFO] Retrieving previous metadata from apache.snapshots.https
[INFO] Uploading repository metadata for: 'artifact org.apache.tuscany.sca:tuscany-assembly-xsd'
[INFO] Uploading project information for tuscany-assembly-xsd 2.5-SNAPSHOT
[INFO] Retrieving previous build number from apache.snapshots.https
Uploading: https://repository.apache.org/content/repositories/snapshots/org/apache/tuscany/sca/tuscany-assembly-xsd/2.5-SNAPSHOT/tuscany-assembly-xsd-2.5-SNAPSHOT-sources.jar
72K uploaded  (tuscany-assembly-xsd-2.5-SNAPSHOT-sources.jar)
[JENKINS] Archiving disabled - not archiving <https://builds.apache.org/job/Tuscany-2x-deploy/ws/sca-2x/modules/assembly-xsd/pom.xml>
[JENKINS] Archiving disabled - not archiving <https://builds.apache.org/job/Tuscany-2x-deploy/ws/sca-2x/modules/assembly-xsd/target/tuscany-assembly-xsd-2.5-SNAPSHOT.jar>
[JENKINS] Archiving disabled - not archiving <https://builds.apache.org/job/Tuscany-2x-deploy/ws/sca-2x/modules/assembly-xsd/target/tuscany-assembly-xsd-2.5-SNAPSHOT-sources.jar>
[INFO] ------------------------------------------------------------------------
[INFO] Building Apache Tuscany SCA Common XML
[INFO]    task-segment: [clean, deploy]
[INFO] ------------------------------------------------------------------------
[INFO] [clean:clean {execution: default-clean}]
[INFO] Deleting <https://builds.apache.org/job/Tuscany-2x-deploy/ws/sca-2x/modules/common-xml/target>
[INFO] [enforcer:enforce {execution: enforce-plugin-versions}]
[INFO] [remote-resources:process {execution: default}]
[INFO] [resources:resources {execution: default-resources}]
[INFO] Using 'UTF-8' encoding to copy filtered resources.
[INFO] Copying 0 resource
[INFO] Copying 1 resource
[INFO] Copying 3 resources
[INFO] [compiler:compile {execution: default-compile}]
[INFO] Compiling 27 source files to <https://builds.apache.org/job/Tuscany-2x-deploy/ws/sca-2x/modules/common-xml/target/classes>
[INFO] [resources:testResources {execution: default-testResources}]
[INFO] Using 'UTF-8' encoding to copy filtered resources.
[INFO] Copying 2 resources
[INFO] Copying 3 resources
[INFO] [compiler:testCompile {execution: default-testCompile}]
[INFO] Compiling 4 source files to <https://builds.apache.org/job/Tuscany-2x-deploy/ws/sca-2x/modules/common-xml/target/test-classes>
[INFO] [surefire:test {execution: default-test}]
[INFO] Tests are skipped.
[INFO] [jar:jar {execution: default-jar}]
[INFO] Building jar: <https://builds.apache.org/job/Tuscany-2x-deploy/ws/sca-2x/modules/common-xml/target/tuscany-common-xml-2.5-SNAPSHOT.jar>
[INFO] [source:jar-no-fork {execution: attach-sources}]
[INFO] Building jar: <https://builds.apache.org/job/Tuscany-2x-deploy/ws/sca-2x/modules/common-xml/target/tuscany-common-xml-2.5-SNAPSHOT-sources.jar>
[INFO] [install:install {execution: default-install}]
[INFO] Installing <https://builds.apache.org/job/Tuscany-2x-deploy/ws/sca-2x/modules/common-xml/target/tuscany-common-xml-2.5-SNAPSHOT.jar>
to <https://builds.apache.org/job/Tuscany-2x-deploy/ws/.repository/org/apache/tuscany/sca/tuscany-common-xml/2.5-SNAPSHOT/tuscany-common-xml-2.5-SNAPSHOT.jar>
[INFO] Installing <https://builds.apache.org/job/Tuscany-2x-deploy/ws/sca-2x/modules/common-xml/target/tuscany-common-xml-2.5-SNAPSHOT-sources.jar>
to <https://builds.apache.org/job/Tuscany-2x-deploy/ws/.repository/org/apache/tuscany/sca/tuscany-common-xml/2.5-SNAPSHOT/tuscany-common-xml-2.5-SNAPSHOT-sources.jar>
[INFO] [deploy:deploy {execution: default-deploy}]
[INFO] Retrieving previous build number from apache.snapshots.https
[WARNING] *** CHECKSUM FAILED - Checksum failed on download: local = '0f679b8e22a0fd5dd592483b5ac1aa68b44772d2';
remote = '1c03450803bd15b98746013cddad7bdada059b94' - RETRYING
[WARNING] *** CHECKSUM FAILED - Checksum failed on download: local = '0f679b8e22a0fd5dd592483b5ac1aa68b44772d2';
remote = '1c03450803bd15b98746013cddad7bdada059b94' - IGNORING
Uploading: https://repository.apache.org/content/repositories/snapshots/org/apache/tuscany/sca/tuscany-common-xml/2.5-SNAPSHOT/tuscany-common-xml-2.5-SNAPSHOT.jar
90K uploaded  (tuscany-common-xml-2.5-SNAPSHOT.jar)
[INFO] Uploading project information for tuscany-common-xml 2.5-SNAPSHOT
[INFO] Retrieving previous metadata from apache.snapshots.https
[INFO] Uploading repository metadata for: 'artifact org.apache.tuscany.sca:tuscany-common-xml'
[INFO] Retrieving previous metadata from apache.snapshots.https
[WARNING] *** CHECKSUM FAILED - Checksum failed on download: local = '0f679b8e22a0fd5dd592483b5ac1aa68b44772d2';
remote = '1c03450803bd15b98746013cddad7bdada059b94' - RETRYING
[WARNING] *** CHECKSUM FAILED - Checksum failed on download: local = '0f679b8e22a0fd5dd592483b5ac1aa68b44772d2';
remote = '1c03450803bd15b98746013cddad7bdada059b94' - IGNORING
[INFO] Uploading repository metadata for: 'snapshot org.apache.tuscany.sca:tuscany-common-xml:2.5-SNAPSHOT'
[INFO] Retrieving previous build number from apache.snapshots.https
Uploading: https://repository.apache.org/content/repositories/snapshots/org/apache/tuscany/sca/tuscany-common-xml/2.5-SNAPSHOT/tuscany-common-xml-2.5-SNAPSHOT-sources.jar
68K uploaded  (tuscany-common-xml-2.5-SNAPSHOT-sources.jar)
[JENKINS] Archiving disabled - not archiving <https://builds.apache.org/job/Tuscany-2x-deploy/ws/sca-2x/modules/common-xml/pom.xml>
[JENKINS] Archiving disabled - not archiving <https://builds.apache.org/job/Tuscany-2x-deploy/ws/sca-2x/modules/common-xml/target/tuscany-common-xml-2.5-SNAPSHOT.jar>
[JENKINS] Archiving disabled - not archiving <https://builds.apache.org/job/Tuscany-2x-deploy/ws/sca-2x/modules/common-xml/target/tuscany-common-xml-2.5-SNAPSHOT-sources.jar>
[INFO] ------------------------------------------------------------------------
[INFO] Building Apache Tuscany SCA API
[INFO]    task-segment: [clean, deploy]
[INFO] ------------------------------------------------------------------------
[INFO] [clean:clean {execution: default-clean}]
[INFO] Deleting <https://builds.apache.org/job/Tuscany-2x-deploy/ws/sca-2x/modules/sca-api/target>
[INFO] [enforcer:enforce {execution: enforce-plugin-versions}]
[INFO] [remote-resources:process {execution: default}]
[INFO] [resources:resources {execution: default-resources}]
[INFO] Using 'UTF-8' encoding to copy filtered resources.
[INFO] skip non existing resourceDirectory <https://builds.apache.org/job/Tuscany-2x-deploy/ws/sca-2x/modules/sca-api/src/main/resources>
[INFO] Copying 3 resources
[INFO] Copying 3 resources
[INFO] [compiler:compile {execution: default-compile}]
[INFO] Compiling 41 source files to <https://builds.apache.org/job/Tuscany-2x-deploy/ws/sca-2x/modules/sca-api/target/classes>
[INFO] [resources:testResources {execution: default-testResources}]
[INFO] Using 'UTF-8' encoding to copy filtered resources.
[INFO] skip non existing resourceDirectory <https://builds.apache.org/job/Tuscany-2x-deploy/ws/sca-2x/modules/sca-api/src/test/resources>
[INFO] Copying 3 resources
[INFO] [compiler:testCompile {execution: default-testCompile}]
[INFO] No sources to compile
[INFO] [surefire:test {execution: default-test}]
[INFO] Tests are skipped.
[INFO] [jar:jar {execution: default-jar}]
[INFO] Building jar: <https://builds.apache.org/job/Tuscany-2x-deploy/ws/sca-2x/modules/sca-api/target/tuscany-sca-api-2.5-SNAPSHOT.jar>
[INFO] [source:jar-no-fork {execution: attach-sources}]
[INFO] Building jar: <https://builds.apache.org/job/Tuscany-2x-deploy/ws/sca-2x/modules/sca-api/target/tuscany-sca-api-2.5-SNAPSHOT-sources.jar>
[INFO] [install:install {execution: default-install}]
[INFO] Installing <https://builds.apache.org/job/Tuscany-2x-deploy/ws/sca-2x/modules/sca-api/target/tuscany-sca-api-2.5-SNAPSHOT.jar>
to <https://builds.apache.org/job/Tuscany-2x-deploy/ws/.repository/org/apache/tuscany/sca/tuscany-sca-api/2.5-SNAPSHOT/tuscany-sca-api-2.5-SNAPSHOT.jar>
[INFO] Installing <https://builds.apache.org/job/Tuscany-2x-deploy/ws/sca-2x/modules/sca-api/target/tuscany-sca-api-2.5-SNAPSHOT-sources.jar>
to <https://builds.apache.org/job/Tuscany-2x-deploy/ws/.repository/org/apache/tuscany/sca/tuscany-sca-api/2.5-SNAPSHOT/tuscany-sca-api-2.5-SNAPSHOT-sources.jar>
[INFO] [deploy:deploy {execution: default-deploy}]
[INFO] Retrieving previous build number from apache.snapshots.https
[WARNING] *** CHECKSUM FAILED - Checksum failed on download: local = '9608833d53dded27ffbd616682e9b03d12e4a4c5';
remote = 'ecd518dff35faa6d264d9263e6f43e870a1b2ca5' - RETRYING
[WARNING] *** CHECKSUM FAILED - Checksum failed on download: local = '9608833d53dded27ffbd616682e9b03d12e4a4c5';
remote = 'ecd518dff35faa6d264d9263e6f43e870a1b2ca5' - IGNORING
Uploading: https://repository.apache.org/content/repositories/snapshots/org/apache/tuscany/sca/tuscany-sca-api/2.5-SNAPSHOT/tuscany-sca-api-2.5-SNAPSHOT.jar
37K uploaded  (tuscany-sca-api-2.5-SNAPSHOT.jar)
[INFO] Retrieving previous metadata from apache.snapshots.https
[WARNING] *** CHECKSUM FAILED - Checksum failed on download: local = '9608833d53dded27ffbd616682e9b03d12e4a4c5';
remote = 'ecd518dff35faa6d264d9263e6f43e870a1b2ca5' - RETRYING
[WARNING] *** CHECKSUM FAILED - Checksum failed on download: local = '9608833d53dded27ffbd616682e9b03d12e4a4c5';
remote = 'ecd518dff35faa6d264d9263e6f43e870a1b2ca5' - IGNORING
[INFO] Uploading repository metadata for: 'snapshot org.apache.tuscany.sca:tuscany-sca-api:2.5-SNAPSHOT'
[INFO] Uploading project information for tuscany-sca-api 2.5-SNAPSHOT
[INFO] Retrieving previous metadata from apache.snapshots.https
[INFO] Uploading repository metadata for: 'artifact org.apache.tuscany.sca:tuscany-sca-api'
[INFO] Retrieving previous build number from apache.snapshots.https
Uploading: https://repository.apache.org/content/repositories/snapshots/org/apache/tuscany/sca/tuscany-sca-api/2.5-SNAPSHOT/tuscany-sca-api-2.5-SNAPSHOT-sources.jar
42K uploaded  (tuscany-sca-api-2.5-SNAPSHOT-sources.jar)
[JENKINS] Archiving disabled - not archiving <https://builds.apache.org/job/Tuscany-2x-deploy/ws/sca-2x/modules/sca-api/pom.xml>
[JENKINS] Archiving disabled - not archiving <https://builds.apache.org/job/Tuscany-2x-deploy/ws/sca-2x/modules/sca-api/target/tuscany-sca-api-2.5-SNAPSHOT.jar>
[JENKINS] Archiving disabled - not archiving <https://builds.apache.org/job/Tuscany-2x-deploy/ws/sca-2x/modules/sca-api/target/tuscany-sca-api-2.5-SNAPSHOT-sources.jar>
[INFO] ------------------------------------------------------------------------
[INFO] Building Apache Tuscany SCA Common Java
[INFO]    task-segment: [clean, deploy]
[INFO] ------------------------------------------------------------------------
[INFO] [clean:clean {execution: default-clean}]
[INFO] Deleting <https://builds.apache.org/job/Tuscany-2x-deploy/ws/sca-2x/modules/common-java/target>
[INFO] [enforcer:enforce {execution: enforce-plugin-versions}]
[INFO] [remote-resources:process {execution: default}]
[INFO] [resources:resources {execution: default-resources}]
[INFO] Using 'UTF-8' encoding to copy filtered resources.
[INFO] Copying 0 resource
[INFO] Copying 1 resource
[INFO] Copying 3 resources
[INFO] [compiler:compile {execution: default-compile}]
[INFO] Compiling 7 source files to <https://builds.apache.org/job/Tuscany-2x-deploy/ws/sca-2x/modules/common-java/target/classes>
[INFO] [resources:testResources {execution: default-testResources}]
[INFO] Using 'UTF-8' encoding to copy filtered resources.
[INFO] skip non existing resourceDirectory <https://builds.apache.org/job/Tuscany-2x-deploy/ws/sca-2x/modules/common-java/src/test/resources>
[INFO] Copying 3 resources
[INFO] [compiler:testCompile {execution: default-testCompile}]
[INFO] Compiling 5 source files to <https://builds.apache.org/job/Tuscany-2x-deploy/ws/sca-2x/modules/common-java/target/test-classes>
[JENKINS] Archiving disabled - not archiving <https://builds.apache.org/job/Tuscany-2x-deploy/ws/sca-2x/modules/common-java/pom.xml>
[INFO] ------------------------------------------------------------------------
[ERROR] BUILD ERROR
[INFO] ------------------------------------------------------------------------
[INFO] Fatal error compiling

Embedded error: Error while executing the external compiler.
error=12, Not enough space
[INFO] ------------------------------------------------------------------------
[INFO] For more information, run Maven with the -e switch
[INFO] ------------------------------------------------------------------------
[INFO] Total time: 6 minutes 37 seconds
[INFO] Finished at: Sun Sep 09 01:10:57 GMT+00:00 2012
[INFO] Final Memory: 66M/716M
[INFO] ------------------------------------------------------------------------
channel stopped

Mime
View raw message