tuscany-commits mailing list archives

Site index · List index
Message view « Date » · « Thread »
Top « Date » · « Thread »
From Apache Jenkins Server <jenk...@builds.apache.org>
Subject Build failed in Jenkins: Tuscany-2x-deploy #917
Date Sat, 08 Sep 2012 00:35:59 GMT
See <https://builds.apache.org/job/Tuscany-2x-deploy/917/changes>

Changes:

[antelder] TUSCANY-4069: Apply patch from Rashmi Hunt to fix Issue with resolving autowired
reference when binding is not defined to a target service exposed over multiple bindings

[antelder] remove comet binding as its not in the build now

[antelder] remove comet binding as its not in the build now

------------------------------------------
[...truncated 114 lines...]
[INFO]   Apache Tuscany SCA Tomcat Tribes Based EndPoint Registry
[INFO]   Apache Tuscany SCA Extensibility for Eclipse Equinox
[INFO]   Apache Tuscany SCA Node Equinox OSGi Launcher
[INFO]   Apache Tuscany SCA OSGi HTTP Service Based Servlet Host Extension
[INFO]   Apache Tuscany SCA BPEL ODE Implementation Extension
[INFO]   Apache Tuscany SCA JAX-RS Implementation Runtime
[INFO]   Apache Tuscany SCA Python Implementation Extension
[INFO]   Apache Tuscany SCA Script Implementation Extension
[INFO]   Apache Tuscany SCA Spring Implementation Runtime Model
[INFO]   Apache Tuscany SCA Spring Implementation WebApp Integration
[INFO]   Apache Tuscany SCA Spring Implementation Runtime Stub
[INFO]   Apache Tuscany SCA Spring Implementation Runtime Tie
[INFO]   Apache Tuscany SCA Web Implementation Client
[INFO]   Apache Tuscany SCA Widget Implementation Runtime
[INFO]   Apache Tuscany SCA Web JavaScript for DOJO
[INFO]   Apache Tuscany SCA Widget Implementation Runtime (Dojo)
[INFO]   Apache Tuscany SCA MyFaces JSF Integration
[INFO]   Apache Tuscany SCA Node Launcher
[INFO]   Apache Tuscany SCA Node Manager
[INFO]   Apache Tuscany SCA Extension Policy Logging Model
[INFO]   Apache Tuscany SCA Java JSR250 Implementation
[INFO]   Apache Tuscany SCA Transaction Policy Model
[INFO]   Apache Tuscany SCA Transaction Policy Runtime
[INFO]   Apache Tuscany SCA Transaction Policy Runtime (Geronimo)
[INFO]   Apache Tuscany SCA AOP-based Logging and Tracing
[INFO]   Apache Tuscany SCA Contribution OSGi Bundle
[INFO]   Apache Tuscany SCA OSGi Implementation Extension
[INFO]   Apache Tuscany SCA OSGi Implementation Extension Runtime
[INFO]   Apache Tuscany SCA OSGi Node Implementation
[INFO]   Apache Tuscany SCA JSE built-in CORBA Host
[INFO]   Apache Tuscany SCA JEE environment CORBA Host
[INFO]   Apache Tuscany SCA CORBA Binding Runtime
[INFO]   Apache Tuscany SCA Transient Name Server CORBA Host
[INFO]   Apache Tuscany SCA Composite Diagram Generator Application
[INFO]   Apache Tuscany SCA OSGi Runtime POM
[INFO]   Apache Tuscany SCA Samples
[INFO]   Apache Tuscany SCA Sample Getting Started Online Store
[INFO]   Apache Tuscany SCA Sample Applications
[INFO]   Apache Tuscany SCA Samples Helloworld
[INFO]   Apache Tuscany SCA Samples Helloworld JAX-RS
[INFO]   Apache Tuscany SCA Samples Helloworld JSONP
[INFO]   Apache Tuscany SCA Samples Helloworld JSON-RPC
[INFO]   Apache Tuscany SCA Samples Helloworld SCAClient
[INFO]   Apache Tuscany SCA Samples Helloworld Spring
[INFO]   Apache Tuscany SCA Samples Helloworld WebApp
[INFO]   Apache Tuscany SCA Samples Helloworld Web Service
[INFO]   Apache Tuscany SCA Samples Helloworld With Dependencies
[INFO]   Apache Tuscany SCA Samples Getting Started
[INFO]   Apache Tuscany SCA Samples Running Tuscany
[INFO]   Apache Tuscany SCA Samples JSE
[INFO]   Apache Tuscany SCA Samples JUnit
[INFO]   Apache Tuscany SCA Sample Async Invocation
[INFO]   Apache Tuscany SCA Sample Learning More
[INFO]   Apache Tuscany SCA Sample binding.websocket
[INFO]   Apache Tuscany SCA Sample binding.websocket Autocomplete Webapp
[INFO]   Apache Tuscany SCA Sample binding.websocket Weather Monitor Webapp
[INFO]   Apache Tuscany SCA Sample binding.websocket Chat Webapp
[INFO]   Apache Tuscany SCA Sample binding.websocket PubSub Webapp
[INFO]   Apache Tuscany SCA Sample Calculator OSGi
[INFO]   Apache Tuscany SCA Sample OSGi Remote Services Calculator
[INFO]   Apache Tuscany SCA Sample OSGi Remote Services Calculator Operations
[INFO]   Apache Tuscany SCA Distributed OSGI Statically Configured Samples
[INFO]   Apache Tuscany SCA All-in-one Distribution
[INFO] ------------------------------------------------------------------------
[INFO] Building Apache Tuscany SCA Implementation Project (2.x)
[INFO]    task-segment: [clean, deploy]
[INFO] ------------------------------------------------------------------------
[INFO] [clean:clean {execution: default-clean}]
[INFO] Deleting <https://builds.apache.org/job/Tuscany-2x-deploy/ws/sca-2x/target>
[INFO] [enforcer:enforce {execution: enforce-plugin-versions}]
[INFO] [remote-resources:process {execution: default}]
[INFO] [site:attach-descriptor {execution: default-attach-descriptor}]
[INFO] [install:install {execution: default-install}]
[INFO] Installing <https://builds.apache.org/job/Tuscany-2x-deploy/ws/sca-2x/pom.xml>
to <https://builds.apache.org/job/Tuscany-2x-deploy/ws/.repository/org/apache/tuscany/sca/tuscany-sca/2.5-SNAPSHOT/tuscany-sca-2.5-SNAPSHOT.pom>
[INFO] [deploy:deploy {execution: default-deploy}]
[INFO] Retrieving previous build number from apache.snapshots.https
[WARNING] *** CHECKSUM FAILED - Checksum failed on download: local = 'c80ad32e01af5bd9cafc09517961be9b93be0b20';
remote = 'b00aeb4328fb9477a3d02cac54c188b8e8b6cde0' - RETRYING
[WARNING] *** CHECKSUM FAILED - Checksum failed on download: local = 'c80ad32e01af5bd9cafc09517961be9b93be0b20';
remote = 'b00aeb4328fb9477a3d02cac54c188b8e8b6cde0' - IGNORING
Uploading: https://repository.apache.org/content/repositories/snapshots/org/apache/tuscany/sca/tuscany-sca/2.5-SNAPSHOT/tuscany-sca-2.5-SNAPSHOT.pom
40K uploaded  (tuscany-sca-2.5-SNAPSHOT.pom)
[INFO] Retrieving previous metadata from apache.snapshots.https
[WARNING] *** CHECKSUM FAILED - Checksum failed on download: local = 'c80ad32e01af5bd9cafc09517961be9b93be0b20';
remote = 'b00aeb4328fb9477a3d02cac54c188b8e8b6cde0' - RETRYING
[WARNING] *** CHECKSUM FAILED - Checksum failed on download: local = 'c80ad32e01af5bd9cafc09517961be9b93be0b20';
remote = 'b00aeb4328fb9477a3d02cac54c188b8e8b6cde0' - IGNORING
[INFO] Uploading repository metadata for: 'snapshot org.apache.tuscany.sca:tuscany-sca:2.5-SNAPSHOT'
[INFO] Retrieving previous metadata from apache.snapshots.https
[INFO] Uploading repository metadata for: 'artifact org.apache.tuscany.sca:tuscany-sca'
[JENKINS] Archiving disabled - not archiving <https://builds.apache.org/job/Tuscany-2x-deploy/ws/sca-2x/pom.xml>
[JENKINS] Archiving disabled - not archiving <https://builds.apache.org/job/Tuscany-2x-deploy/ws/.repository/org/apache/tuscany/sca/tuscany-sca/2.5-SNAPSHOT/tuscany-sca-2.5-SNAPSHOT.pom>
[INFO] ------------------------------------------------------------------------
[INFO] Building Apache Tuscany SCA Implementation Modules
[INFO]    task-segment: [clean, deploy]
[INFO] ------------------------------------------------------------------------
[INFO] [clean:clean {execution: default-clean}]
[INFO] Deleting <https://builds.apache.org/job/Tuscany-2x-deploy/ws/sca-2x/modules/target>
[INFO] [enforcer:enforce {execution: enforce-plugin-versions}]
[INFO] [remote-resources:process {execution: default}]
[INFO] [site:attach-descriptor {execution: default-attach-descriptor}]
[INFO] [source:jar-no-fork {execution: attach-sources}]
[INFO] [install:install {execution: default-install}]
[INFO] Installing <https://builds.apache.org/job/Tuscany-2x-deploy/ws/sca-2x/modules/pom.xml>
to <https://builds.apache.org/job/Tuscany-2x-deploy/ws/.repository/org/apache/tuscany/sca/tuscany-modules/2.5-SNAPSHOT/tuscany-modules-2.5-SNAPSHOT.pom>
[INFO] [deploy:deploy {execution: default-deploy}]
[INFO] Retrieving previous build number from apache.snapshots.https
[WARNING] *** CHECKSUM FAILED - Checksum failed on download: local = '3b876451a9389a57122222bfdbea75945c74a196';
remote = '42072945427c1aa07ba46b08e08dfd643b902547' - RETRYING
[WARNING] *** CHECKSUM FAILED - Checksum failed on download: local = '3b876451a9389a57122222bfdbea75945c74a196';
remote = '42072945427c1aa07ba46b08e08dfd643b902547' - IGNORING
Uploading: https://repository.apache.org/content/repositories/snapshots/org/apache/tuscany/sca/tuscany-modules/2.5-SNAPSHOT/tuscany-modules-2.5-SNAPSHOT.pom
9K uploaded  (tuscany-modules-2.5-SNAPSHOT.pom)
[INFO] Retrieving previous metadata from apache.snapshots.https
[WARNING] *** CHECKSUM FAILED - Checksum failed on download: local = '3b876451a9389a57122222bfdbea75945c74a196';
remote = '42072945427c1aa07ba46b08e08dfd643b902547' - RETRYING
[WARNING] *** CHECKSUM FAILED - Checksum failed on download: local = '3b876451a9389a57122222bfdbea75945c74a196';
remote = '42072945427c1aa07ba46b08e08dfd643b902547' - IGNORING
[INFO] Uploading repository metadata for: 'snapshot org.apache.tuscany.sca:tuscany-modules:2.5-SNAPSHOT'
[INFO] Retrieving previous metadata from apache.snapshots.https
[INFO] Uploading repository metadata for: 'artifact org.apache.tuscany.sca:tuscany-modules'
[JENKINS] Archiving disabled - not archiving <https://builds.apache.org/job/Tuscany-2x-deploy/ws/sca-2x/modules/pom.xml>
[JENKINS] Archiving disabled - not archiving <https://builds.apache.org/job/Tuscany-2x-deploy/ws/.repository/org/apache/tuscany/sca/tuscany-modules/2.5-SNAPSHOT/tuscany-modules-2.5-SNAPSHOT.pom>
[INFO] ------------------------------------------------------------------------
[INFO] Building Apache Tuscany SCA Monitor
[INFO]    task-segment: [clean, deploy]
[INFO] ------------------------------------------------------------------------
[INFO] [clean:clean {execution: default-clean}]
[INFO] Deleting <https://builds.apache.org/job/Tuscany-2x-deploy/ws/sca-2x/modules/monitor/target>
[INFO] [enforcer:enforce {execution: enforce-plugin-versions}]
[INFO] [remote-resources:process {execution: default}]
[INFO] [resources:resources {execution: default-resources}]
[INFO] Using 'UTF-8' encoding to copy filtered resources.
[INFO] Copying 1 resource
[INFO] Copying 3 resources
[INFO] Copying 3 resources
[INFO] [compiler:compile {execution: default-compile}]
[INFO] Compiling 7 source files to <https://builds.apache.org/job/Tuscany-2x-deploy/ws/sca-2x/modules/monitor/target/classes>
[INFO] [resources:testResources {execution: default-testResources}]
[INFO] Using 'UTF-8' encoding to copy filtered resources.
[INFO] Copying 2 resources
[INFO] Copying 3 resources
[INFO] [compiler:testCompile {execution: default-testCompile}]
[INFO] Compiling 1 source file to <https://builds.apache.org/job/Tuscany-2x-deploy/ws/sca-2x/modules/monitor/target/test-classes>
[INFO] [surefire:test {execution: default-test}]
[INFO] Tests are skipped.
[INFO] [jar:jar {execution: default-jar}]
[INFO] Building jar: <https://builds.apache.org/job/Tuscany-2x-deploy/ws/sca-2x/modules/monitor/target/tuscany-monitor-2.5-SNAPSHOT.jar>
[INFO] [source:jar-no-fork {execution: attach-sources}]
[INFO] Building jar: <https://builds.apache.org/job/Tuscany-2x-deploy/ws/sca-2x/modules/monitor/target/tuscany-monitor-2.5-SNAPSHOT-sources.jar>
[INFO] [install:install {execution: default-install}]
[INFO] Installing <https://builds.apache.org/job/Tuscany-2x-deploy/ws/sca-2x/modules/monitor/target/tuscany-monitor-2.5-SNAPSHOT.jar>
to <https://builds.apache.org/job/Tuscany-2x-deploy/ws/.repository/org/apache/tuscany/sca/tuscany-monitor/2.5-SNAPSHOT/tuscany-monitor-2.5-SNAPSHOT.jar>
[INFO] Installing <https://builds.apache.org/job/Tuscany-2x-deploy/ws/sca-2x/modules/monitor/target/tuscany-monitor-2.5-SNAPSHOT-sources.jar>
to <https://builds.apache.org/job/Tuscany-2x-deploy/ws/.repository/org/apache/tuscany/sca/tuscany-monitor/2.5-SNAPSHOT/tuscany-monitor-2.5-SNAPSHOT-sources.jar>
[INFO] [deploy:deploy {execution: default-deploy}]
[INFO] Retrieving previous build number from apache.snapshots.https
[WARNING] *** CHECKSUM FAILED - Checksum failed on download: local = 'f38cf48ad992c786d9f5215cd749ef8e847e4396';
remote = '814551def4a2d8e953359191b1270c40514f2342' - RETRYING
[WARNING] *** CHECKSUM FAILED - Checksum failed on download: local = 'f38cf48ad992c786d9f5215cd749ef8e847e4396';
remote = '814551def4a2d8e953359191b1270c40514f2342' - IGNORING
Uploading: https://repository.apache.org/content/repositories/snapshots/org/apache/tuscany/sca/tuscany-monitor/2.5-SNAPSHOT/tuscany-monitor-2.5-SNAPSHOT.jar
22K uploaded  (tuscany-monitor-2.5-SNAPSHOT.jar)
[INFO] Retrieving previous metadata from apache.snapshots.https
[INFO] Uploading repository metadata for: 'artifact org.apache.tuscany.sca:tuscany-monitor'
[INFO] Retrieving previous metadata from apache.snapshots.https
[WARNING] *** CHECKSUM FAILED - Checksum failed on download: local = 'f38cf48ad992c786d9f5215cd749ef8e847e4396';
remote = '814551def4a2d8e953359191b1270c40514f2342' - RETRYING
[WARNING] *** CHECKSUM FAILED - Checksum failed on download: local = 'f38cf48ad992c786d9f5215cd749ef8e847e4396';
remote = '814551def4a2d8e953359191b1270c40514f2342' - IGNORING
[INFO] Uploading repository metadata for: 'snapshot org.apache.tuscany.sca:tuscany-monitor:2.5-SNAPSHOT'
[INFO] Uploading project information for tuscany-monitor 2.5-SNAPSHOT
[INFO] Retrieving previous build number from apache.snapshots.https
Uploading: https://repository.apache.org/content/repositories/snapshots/org/apache/tuscany/sca/tuscany-monitor/2.5-SNAPSHOT/tuscany-monitor-2.5-SNAPSHOT-sources.jar
19K uploaded  (tuscany-monitor-2.5-SNAPSHOT-sources.jar)
[JENKINS] Archiving disabled - not archiving <https://builds.apache.org/job/Tuscany-2x-deploy/ws/sca-2x/modules/monitor/pom.xml>
[JENKINS] Archiving disabled - not archiving <https://builds.apache.org/job/Tuscany-2x-deploy/ws/sca-2x/modules/monitor/target/tuscany-monitor-2.5-SNAPSHOT.jar>
[JENKINS] Archiving disabled - not archiving <https://builds.apache.org/job/Tuscany-2x-deploy/ws/sca-2x/modules/monitor/target/tuscany-monitor-2.5-SNAPSHOT-sources.jar>
[INFO] ------------------------------------------------------------------------
[INFO] Building Apache Tuscany SCA Extensibility
[INFO]    task-segment: [clean, deploy]
[INFO] ------------------------------------------------------------------------
[INFO] [clean:clean {execution: default-clean}]
[INFO] Deleting <https://builds.apache.org/job/Tuscany-2x-deploy/ws/sca-2x/modules/extensibility/target>
[INFO] [enforcer:enforce {execution: enforce-plugin-versions}]
[INFO] [remote-resources:process {execution: default}]
[INFO] [resources:resources {execution: default-resources}]
[INFO] Using 'UTF-8' encoding to copy filtered resources.
[INFO] Copying 3 resources
[INFO] Copying 3 resources
[INFO] Copying 3 resources
[INFO] [compiler:compile {execution: default-compile}]
[INFO] Compiling 21 source files to <https://builds.apache.org/job/Tuscany-2x-deploy/ws/sca-2x/modules/extensibility/target/classes>
[INFO] [resources:testResources {execution: default-testResources}]
[INFO] Using 'UTF-8' encoding to copy filtered resources.
[INFO] Copying 1 resource
[INFO] Copying 3 resources
[INFO] [compiler:testCompile {execution: default-testCompile}]
[INFO] Compiling 9 source files to <https://builds.apache.org/job/Tuscany-2x-deploy/ws/sca-2x/modules/extensibility/target/test-classes>
[INFO] [surefire:test {execution: default-test}]
[INFO] Tests are skipped.
[INFO] [jar:jar {execution: default-jar}]
[INFO] Building jar: <https://builds.apache.org/job/Tuscany-2x-deploy/ws/sca-2x/modules/extensibility/target/tuscany-extensibility-2.5-SNAPSHOT.jar>
[INFO] [source:jar-no-fork {execution: attach-sources}]
[INFO] Building jar: <https://builds.apache.org/job/Tuscany-2x-deploy/ws/sca-2x/modules/extensibility/target/tuscany-extensibility-2.5-SNAPSHOT-sources.jar>
[INFO] [install:install {execution: default-install}]
[INFO] Installing <https://builds.apache.org/job/Tuscany-2x-deploy/ws/sca-2x/modules/extensibility/target/tuscany-extensibility-2.5-SNAPSHOT.jar>
to <https://builds.apache.org/job/Tuscany-2x-deploy/ws/.repository/org/apache/tuscany/sca/tuscany-extensibility/2.5-SNAPSHOT/tuscany-extensibility-2.5-SNAPSHOT.jar>
[INFO] Installing <https://builds.apache.org/job/Tuscany-2x-deploy/ws/sca-2x/modules/extensibility/target/tuscany-extensibility-2.5-SNAPSHOT-sources.jar>
to <https://builds.apache.org/job/Tuscany-2x-deploy/ws/.repository/org/apache/tuscany/sca/tuscany-extensibility/2.5-SNAPSHOT/tuscany-extensibility-2.5-SNAPSHOT-sources.jar>
[INFO] [deploy:deploy {execution: default-deploy}]
[INFO] Retrieving previous build number from apache.snapshots.https
[WARNING] *** CHECKSUM FAILED - Checksum failed on download: local = '16f28d6a5d03aa28722542057641dc1eb1f4cd0e';
remote = '3baa91d4237a512dfe5ac8bd589ca2cadb82b262' - RETRYING
[WARNING] *** CHECKSUM FAILED - Checksum failed on download: local = '16f28d6a5d03aa28722542057641dc1eb1f4cd0e';
remote = '3baa91d4237a512dfe5ac8bd589ca2cadb82b262' - IGNORING
Uploading: https://repository.apache.org/content/repositories/snapshots/org/apache/tuscany/sca/tuscany-extensibility/2.5-SNAPSHOT/tuscany-extensibility-2.5-SNAPSHOT.jar
71K uploaded  (tuscany-extensibility-2.5-SNAPSHOT.jar)
[INFO] Retrieving previous metadata from apache.snapshots.https
[WARNING] *** CHECKSUM FAILED - Checksum failed on download: local = '16f28d6a5d03aa28722542057641dc1eb1f4cd0e';
remote = '3baa91d4237a512dfe5ac8bd589ca2cadb82b262' - RETRYING
[WARNING] *** CHECKSUM FAILED - Checksum failed on download: local = '16f28d6a5d03aa28722542057641dc1eb1f4cd0e';
remote = '3baa91d4237a512dfe5ac8bd589ca2cadb82b262' - IGNORING
[INFO] Uploading repository metadata for: 'snapshot org.apache.tuscany.sca:tuscany-extensibility:2.5-SNAPSHOT'
[INFO] Retrieving previous metadata from apache.snapshots.https
[INFO] Uploading repository metadata for: 'artifact org.apache.tuscany.sca:tuscany-extensibility'
[INFO] Uploading project information for tuscany-extensibility 2.5-SNAPSHOT
[INFO] Retrieving previous build number from apache.snapshots.https
Uploading: https://repository.apache.org/content/repositories/snapshots/org/apache/tuscany/sca/tuscany-extensibility/2.5-SNAPSHOT/tuscany-extensibility-2.5-SNAPSHOT-sources.jar
53K uploaded  (tuscany-extensibility-2.5-SNAPSHOT-sources.jar)
[JENKINS] Archiving disabled - not archiving <https://builds.apache.org/job/Tuscany-2x-deploy/ws/sca-2x/modules/extensibility/pom.xml>
[JENKINS] Archiving disabled - not archiving <https://builds.apache.org/job/Tuscany-2x-deploy/ws/sca-2x/modules/extensibility/target/tuscany-extensibility-2.5-SNAPSHOT.jar>
[JENKINS] Archiving disabled - not archiving <https://builds.apache.org/job/Tuscany-2x-deploy/ws/sca-2x/modules/extensibility/target/tuscany-extensibility-2.5-SNAPSHOT-sources.jar>
[INFO] ------------------------------------------------------------------------
[INFO] Building Apache Tuscany SCA Assembly Model
[INFO]    task-segment: [clean, deploy]
[INFO] ------------------------------------------------------------------------
[INFO] [clean:clean {execution: default-clean}]
[INFO] Deleting <https://builds.apache.org/job/Tuscany-2x-deploy/ws/sca-2x/modules/assembly/target>
[INFO] [enforcer:enforce {execution: enforce-plugin-versions}]
[INFO] [remote-resources:process {execution: default}]
[INFO] [resources:resources {execution: default-resources}]
[INFO] Using 'UTF-8' encoding to copy filtered resources.
[INFO] Copying 9 resources
[INFO] Copying 3 resources
[INFO] Copying 3 resources
[INFO] [compiler:compile {execution: default-compile}]
[INFO] Compiling 136 source files to <https://builds.apache.org/job/Tuscany-2x-deploy/ws/sca-2x/modules/assembly/target/classes>
[INFO] [resources:testResources {execution: default-testResources}]
[INFO] Using 'UTF-8' encoding to copy filtered resources.
[INFO] skip non existing resourceDirectory <https://builds.apache.org/job/Tuscany-2x-deploy/ws/sca-2x/modules/assembly/src/test/resources>
[INFO] Copying 3 resources
[INFO] [compiler:testCompile {execution: default-testCompile}]
[INFO] Compiling 9 source files to <https://builds.apache.org/job/Tuscany-2x-deploy/ws/sca-2x/modules/assembly/target/test-classes>
[JENKINS] Archiving disabled - not archiving <https://builds.apache.org/job/Tuscany-2x-deploy/ws/sca-2x/modules/assembly/pom.xml>
[INFO] ------------------------------------------------------------------------
[ERROR] BUILD ERROR
[INFO] ------------------------------------------------------------------------
[INFO] Fatal error compiling

Embedded error: Error while executing the external compiler.
error=12, Not enough space
[INFO] ------------------------------------------------------------------------
[INFO] For more information, run Maven with the -e switch
[INFO] ------------------------------------------------------------------------
[INFO] Total time: 2 minutes 52 seconds
[INFO] Finished at: Sat Sep 08 00:36:20 GMT+00:00 2012
[INFO] Final Memory: 57M/714M
[INFO] ------------------------------------------------------------------------
channel stopped

Mime
View raw message