tuscany-commits mailing list archives

Site index · List index
Message view « Date » · « Thread »
Top « Date » · « Thread »
From Apache Jenkins Server <jenk...@builds.apache.org>
Subject Build failed in Jenkins: Tuscany-2x-deploy #1023
Date Tue, 25 Dec 2012 01:06:56 GMT
See <https://builds.apache.org/job/Tuscany-2x-deploy/1023/>

------------------------------------------
[...truncated 4606 lines...]
[WARNING] *** CHECKSUM FAILED - Checksum failed on download: local = 'ea4be05f039cac20a7e9ae2d6d913215c6f0c579';
remote = '3af714e3f9937f162238346b232f017f025af65c' - IGNORING
[INFO] Uploading repository metadata for: 'snapshot org.apache.tuscany.sca:tuscany-binding-rmi-runtime:2.5-SNAPSHOT'
[INFO] Retrieving previous metadata from apache.snapshots.https
[INFO] Uploading repository metadata for: 'artifact org.apache.tuscany.sca:tuscany-binding-rmi-runtime'
[INFO] Uploading project information for tuscany-binding-rmi-runtime 2.5-SNAPSHOT
[INFO] Retrieving previous build number from apache.snapshots.https
Uploading: https://repository.apache.org/content/repositories/snapshots/org/apache/tuscany/sca/tuscany-binding-rmi-runtime/2.5-SNAPSHOT/tuscany-binding-rmi-runtime-2.5-SNAPSHOT-sources.jar
19K uploaded  (tuscany-binding-rmi-runtime-2.5-SNAPSHOT-sources.jar)
[JENKINS] Archiving disabled
[INFO] ------------------------------------------------------------------------
[INFO] Building Apache Tuscany SCA Websocket Binding Extension
[INFO]    task-segment: [clean, deploy]
[INFO] ------------------------------------------------------------------------
[INFO] [clean:clean {execution: default-clean}]
[INFO] Deleting <https://builds.apache.org/job/Tuscany-2x-deploy/ws/sca-2x/modules/binding-websocket/target>
[INFO] [enforcer:enforce {execution: enforce-plugin-versions}]
[INFO] [remote-resources:process {execution: default}]
[INFO] [resources:resources {execution: default-resources}]
[INFO] Using 'UTF-8' encoding to copy filtered resources.
[INFO] Copying 6 resources
[INFO] Copying 3 resources
[INFO] Copying 3 resources
[INFO] [compiler:compile {execution: default-compile}]
[INFO] Compiling 17 source files to <https://builds.apache.org/job/Tuscany-2x-deploy/ws/sca-2x/modules/binding-websocket/target/classes>
[INFO] [resources:testResources {execution: default-testResources}]
[INFO] Using 'UTF-8' encoding to copy filtered resources.
[INFO] Copying 2 resources
[INFO] Copying 3 resources
[INFO] [compiler:testCompile {execution: default-testCompile}]
[INFO] Compiling 5 source files to <https://builds.apache.org/job/Tuscany-2x-deploy/ws/sca-2x/modules/binding-websocket/target/test-classes>
[INFO] [surefire:test {execution: default-test}]
[INFO] Tests are skipped.
[INFO] [jar:jar {execution: default-jar}]
[INFO] Building jar: <https://builds.apache.org/job/Tuscany-2x-deploy/ws/sca-2x/modules/binding-websocket/target/tuscany-binding-websocket-2.5-SNAPSHOT.jar>
[INFO] [source:jar-no-fork {execution: attach-sources}]
[INFO] Building jar: <https://builds.apache.org/job/Tuscany-2x-deploy/ws/sca-2x/modules/binding-websocket/target/tuscany-binding-websocket-2.5-SNAPSHOT-sources.jar>
[INFO] [install:install {execution: default-install}]
[INFO] Installing <https://builds.apache.org/job/Tuscany-2x-deploy/ws/sca-2x/modules/binding-websocket/target/tuscany-binding-websocket-2.5-SNAPSHOT.jar>
to <https://builds.apache.org/job/Tuscany-2x-deploy/ws/.repository/org/apache/tuscany/sca/tuscany-binding-websocket/2.5-SNAPSHOT/tuscany-binding-websocket-2.5-SNAPSHOT.jar>
[INFO] Installing <https://builds.apache.org/job/Tuscany-2x-deploy/ws/sca-2x/modules/binding-websocket/target/tuscany-binding-websocket-2.5-SNAPSHOT-sources.jar>
to <https://builds.apache.org/job/Tuscany-2x-deploy/ws/.repository/org/apache/tuscany/sca/tuscany-binding-websocket/2.5-SNAPSHOT/tuscany-binding-websocket-2.5-SNAPSHOT-sources.jar>
[INFO] [deploy:deploy {execution: default-deploy}]
[INFO] Retrieving previous build number from apache.snapshots.https
[WARNING] *** CHECKSUM FAILED - Checksum failed on download: local = 'aa18ed6f00f26e197da0a8fa6982cd466a96e3ca';
remote = 'd83273a712aa9a7d3150a41a8aade2cb1930cbb6' - RETRYING
[WARNING] *** CHECKSUM FAILED - Checksum failed on download: local = 'aa18ed6f00f26e197da0a8fa6982cd466a96e3ca';
remote = 'd83273a712aa9a7d3150a41a8aade2cb1930cbb6' - IGNORING
Uploading: https://repository.apache.org/content/repositories/snapshots/org/apache/tuscany/sca/tuscany-binding-websocket/2.5-SNAPSHOT/tuscany-binding-websocket-2.5-SNAPSHOT.jar
38K uploaded  (tuscany-binding-websocket-2.5-SNAPSHOT.jar)
[INFO] Retrieving previous metadata from apache.snapshots.https
[WARNING] *** CHECKSUM FAILED - Checksum failed on download: local = 'aa18ed6f00f26e197da0a8fa6982cd466a96e3ca';
remote = 'd83273a712aa9a7d3150a41a8aade2cb1930cbb6' - RETRYING
[WARNING] *** CHECKSUM FAILED - Checksum failed on download: local = 'aa18ed6f00f26e197da0a8fa6982cd466a96e3ca';
remote = 'd83273a712aa9a7d3150a41a8aade2cb1930cbb6' - IGNORING
[INFO] Uploading repository metadata for: 'snapshot org.apache.tuscany.sca:tuscany-binding-websocket:2.5-SNAPSHOT'
[INFO] Retrieving previous metadata from apache.snapshots.https
[INFO] Uploading repository metadata for: 'artifact org.apache.tuscany.sca:tuscany-binding-websocket'
[INFO] Uploading project information for tuscany-binding-websocket 2.5-SNAPSHOT
[INFO] Retrieving previous build number from apache.snapshots.https
Uploading: https://repository.apache.org/content/repositories/snapshots/org/apache/tuscany/sca/tuscany-binding-websocket/2.5-SNAPSHOT/tuscany-binding-websocket-2.5-SNAPSHOT-sources.jar
34K uploaded  (tuscany-binding-websocket-2.5-SNAPSHOT-sources.jar)
[JENKINS] Archiving disabled
[INFO] ------------------------------------------------------------------------
[INFO] Building Apache Tuscany SCA Policy WS-Policy Model
[INFO]    task-segment: [clean, deploy]
[INFO] ------------------------------------------------------------------------
[INFO] [clean:clean {execution: default-clean}]
[INFO] Deleting <https://builds.apache.org/job/Tuscany-2x-deploy/ws/sca-2x/modules/policy-wspolicy/target>
[INFO] [enforcer:enforce {execution: enforce-plugin-versions}]
[INFO] [remote-resources:process {execution: default}]
[INFO] [resources:resources {execution: default-resources}]
[INFO] Using 'UTF-8' encoding to copy filtered resources.
[INFO] Copying 2 resources
[INFO] Copying 3 resources
[INFO] Copying 3 resources
[INFO] [compiler:compile {execution: default-compile}]
[INFO] Compiling 3 source files to <https://builds.apache.org/job/Tuscany-2x-deploy/ws/sca-2x/modules/policy-wspolicy/target/classes>
[INFO] [resources:testResources {execution: default-testResources}]
[INFO] Using 'UTF-8' encoding to copy filtered resources.
[INFO] Copying 1 resource
[INFO] Copying 3 resources
[INFO] [compiler:testCompile {execution: default-testCompile}]
[INFO] Compiling 5 source files to <https://builds.apache.org/job/Tuscany-2x-deploy/ws/sca-2x/modules/policy-wspolicy/target/test-classes>
[INFO] [surefire:test {execution: default-test}]
[INFO] Tests are skipped.
[INFO] [jar:jar {execution: default-jar}]
[INFO] Building jar: <https://builds.apache.org/job/Tuscany-2x-deploy/ws/sca-2x/modules/policy-wspolicy/target/tuscany-policy-wspolicy-2.5-SNAPSHOT.jar>
[INFO] [source:jar-no-fork {execution: attach-sources}]
[INFO] Building jar: <https://builds.apache.org/job/Tuscany-2x-deploy/ws/sca-2x/modules/policy-wspolicy/target/tuscany-policy-wspolicy-2.5-SNAPSHOT-sources.jar>
[INFO] [install:install {execution: default-install}]
[INFO] Installing <https://builds.apache.org/job/Tuscany-2x-deploy/ws/sca-2x/modules/policy-wspolicy/target/tuscany-policy-wspolicy-2.5-SNAPSHOT.jar>
to <https://builds.apache.org/job/Tuscany-2x-deploy/ws/.repository/org/apache/tuscany/sca/tuscany-policy-wspolicy/2.5-SNAPSHOT/tuscany-policy-wspolicy-2.5-SNAPSHOT.jar>
[INFO] Installing <https://builds.apache.org/job/Tuscany-2x-deploy/ws/sca-2x/modules/policy-wspolicy/target/tuscany-policy-wspolicy-2.5-SNAPSHOT-sources.jar>
to <https://builds.apache.org/job/Tuscany-2x-deploy/ws/.repository/org/apache/tuscany/sca/tuscany-policy-wspolicy/2.5-SNAPSHOT/tuscany-policy-wspolicy-2.5-SNAPSHOT-sources.jar>
[INFO] [deploy:deploy {execution: default-deploy}]
[INFO] Retrieving previous build number from apache.snapshots.https
[WARNING] *** CHECKSUM FAILED - Checksum failed on download: local = '86c03d2ab40eb1e44c58f5fec9499f901117328a';
remote = '3769b440a06b535bd328e19c4b353437e6dae5dd' - RETRYING
[WARNING] *** CHECKSUM FAILED - Checksum failed on download: local = '86c03d2ab40eb1e44c58f5fec9499f901117328a';
remote = '3769b440a06b535bd328e19c4b353437e6dae5dd' - IGNORING
Uploading: https://repository.apache.org/content/repositories/snapshots/org/apache/tuscany/sca/tuscany-policy-wspolicy/2.5-SNAPSHOT/tuscany-policy-wspolicy-2.5-SNAPSHOT.jar
21K uploaded  (tuscany-policy-wspolicy-2.5-SNAPSHOT.jar)
[INFO] Retrieving previous metadata from apache.snapshots.https
[WARNING] *** CHECKSUM FAILED - Checksum failed on download: local = '86c03d2ab40eb1e44c58f5fec9499f901117328a';
remote = '3769b440a06b535bd328e19c4b353437e6dae5dd' - RETRYING
[WARNING] *** CHECKSUM FAILED - Checksum failed on download: local = '86c03d2ab40eb1e44c58f5fec9499f901117328a';
remote = '3769b440a06b535bd328e19c4b353437e6dae5dd' - IGNORING
[INFO] Uploading repository metadata for: 'snapshot org.apache.tuscany.sca:tuscany-policy-wspolicy:2.5-SNAPSHOT'
[INFO] Uploading project information for tuscany-policy-wspolicy 2.5-SNAPSHOT
[INFO] Retrieving previous metadata from apache.snapshots.https
[INFO] Uploading repository metadata for: 'artifact org.apache.tuscany.sca:tuscany-policy-wspolicy'
[INFO] Retrieving previous build number from apache.snapshots.https
Uploading: https://repository.apache.org/content/repositories/snapshots/org/apache/tuscany/sca/tuscany-policy-wspolicy/2.5-SNAPSHOT/tuscany-policy-wspolicy-2.5-SNAPSHOT-sources.jar
17K uploaded  (tuscany-policy-wspolicy-2.5-SNAPSHOT-sources.jar)
[JENKINS] Archiving disabled
[INFO] ------------------------------------------------------------------------
[INFO] Building Apache Tuscany SCA Data Binding for Axiom
[INFO]    task-segment: [clean, deploy]
[INFO] ------------------------------------------------------------------------
[INFO] [clean:clean {execution: default-clean}]
[INFO] Deleting <https://builds.apache.org/job/Tuscany-2x-deploy/ws/sca-2x/modules/databinding-axiom/target>
[INFO] [enforcer:enforce {execution: enforce-plugin-versions}]
[INFO] [remote-resources:process {execution: default}]
[INFO] [resources:resources {execution: default-resources}]
[INFO] Using 'UTF-8' encoding to copy filtered resources.
[INFO] Copying 2 resources
[INFO] Copying 3 resources
[INFO] Copying 3 resources
[INFO] [compiler:compile {execution: default-compile}]
[INFO] Compiling 13 source files to <https://builds.apache.org/job/Tuscany-2x-deploy/ws/sca-2x/modules/databinding-axiom/target/classes>
[INFO] [resources:testResources {execution: default-testResources}]
[INFO] Using 'UTF-8' encoding to copy filtered resources.
[INFO] Copying 3 resources
[INFO] Copying 3 resources
[INFO] [compiler:testCompile {execution: default-testCompile}]
[INFO] Compiling 2 source files to <https://builds.apache.org/job/Tuscany-2x-deploy/ws/sca-2x/modules/databinding-axiom/target/test-classes>
[INFO] [surefire:test {execution: default-test}]
[INFO] Tests are skipped.
[INFO] [jar:jar {execution: default-jar}]
[INFO] Building jar: <https://builds.apache.org/job/Tuscany-2x-deploy/ws/sca-2x/modules/databinding-axiom/target/tuscany-databinding-axiom-2.5-SNAPSHOT.jar>
[INFO] [source:jar-no-fork {execution: attach-sources}]
[INFO] Building jar: <https://builds.apache.org/job/Tuscany-2x-deploy/ws/sca-2x/modules/databinding-axiom/target/tuscany-databinding-axiom-2.5-SNAPSHOT-sources.jar>
[INFO] [install:install {execution: default-install}]
[INFO] Installing <https://builds.apache.org/job/Tuscany-2x-deploy/ws/sca-2x/modules/databinding-axiom/target/tuscany-databinding-axiom-2.5-SNAPSHOT.jar>
to <https://builds.apache.org/job/Tuscany-2x-deploy/ws/.repository/org/apache/tuscany/sca/tuscany-databinding-axiom/2.5-SNAPSHOT/tuscany-databinding-axiom-2.5-SNAPSHOT.jar>
[INFO] Installing <https://builds.apache.org/job/Tuscany-2x-deploy/ws/sca-2x/modules/databinding-axiom/target/tuscany-databinding-axiom-2.5-SNAPSHOT-sources.jar>
to <https://builds.apache.org/job/Tuscany-2x-deploy/ws/.repository/org/apache/tuscany/sca/tuscany-databinding-axiom/2.5-SNAPSHOT/tuscany-databinding-axiom-2.5-SNAPSHOT-sources.jar>
[INFO] [deploy:deploy {execution: default-deploy}]
[INFO] Retrieving previous build number from apache.snapshots.https
[WARNING] *** CHECKSUM FAILED - Checksum failed on download: local = '8818380ac79d7575252bb42511432df548dbda91';
remote = 'c893503ee4bb0a8fc4a6ca1d82d36815c197aac1' - RETRYING
[WARNING] *** CHECKSUM FAILED - Checksum failed on download: local = '8818380ac79d7575252bb42511432df548dbda91';
remote = 'c893503ee4bb0a8fc4a6ca1d82d36815c197aac1' - IGNORING
Uploading: https://repository.apache.org/content/repositories/snapshots/org/apache/tuscany/sca/tuscany-databinding-axiom/2.5-SNAPSHOT/tuscany-databinding-axiom-2.5-SNAPSHOT.jar
35K uploaded  (tuscany-databinding-axiom-2.5-SNAPSHOT.jar)
[INFO] Retrieving previous metadata from apache.snapshots.https
[INFO] Uploading repository metadata for: 'artifact org.apache.tuscany.sca:tuscany-databinding-axiom'
[INFO] Retrieving previous metadata from apache.snapshots.https
[WARNING] *** CHECKSUM FAILED - Checksum failed on download: local = '8818380ac79d7575252bb42511432df548dbda91';
remote = 'c893503ee4bb0a8fc4a6ca1d82d36815c197aac1' - RETRYING
[WARNING] *** CHECKSUM FAILED - Checksum failed on download: local = '8818380ac79d7575252bb42511432df548dbda91';
remote = 'c893503ee4bb0a8fc4a6ca1d82d36815c197aac1' - IGNORING
[INFO] Uploading repository metadata for: 'snapshot org.apache.tuscany.sca:tuscany-databinding-axiom:2.5-SNAPSHOT'
[INFO] Uploading project information for tuscany-databinding-axiom 2.5-SNAPSHOT
[INFO] Retrieving previous build number from apache.snapshots.https
Uploading: https://repository.apache.org/content/repositories/snapshots/org/apache/tuscany/sca/tuscany-databinding-axiom/2.5-SNAPSHOT/tuscany-databinding-axiom-2.5-SNAPSHOT-sources.jar
31K uploaded  (tuscany-databinding-axiom-2.5-SNAPSHOT-sources.jar)
[JENKINS] Archiving disabled
[INFO] ------------------------------------------------------------------------
[INFO] Building Apache Tuscany SCA Data Binding for JAXB-AXIOM
[INFO]    task-segment: [clean, deploy]
[INFO] ------------------------------------------------------------------------
[INFO] [clean:clean {execution: default-clean}]
[INFO] Deleting <https://builds.apache.org/job/Tuscany-2x-deploy/ws/sca-2x/modules/databinding-jaxb-axiom/target>
[INFO] [enforcer:enforce {execution: enforce-plugin-versions}]
[INFO] [build-helper:add-test-source {execution: add-test-source}]
[INFO] Test Source directory: <https://builds.apache.org/job/Tuscany-2x-deploy/ws/sca-2x/modules/databinding-jaxb-axiom/target/jaxb-source>
added.
[INFO] [remote-resources:process {execution: default}]
[INFO] [resources:resources {execution: default-resources}]
[INFO] Using 'UTF-8' encoding to copy filtered resources.
[INFO] Copying 1 resource
[INFO] Copying 3 resources
[INFO] Copying 3 resources
[INFO] [compiler:compile {execution: default-compile}]
[INFO] Compiling 10 source files to <https://builds.apache.org/job/Tuscany-2x-deploy/ws/sca-2x/modules/databinding-jaxb-axiom/target/classes>
[INFO] [jaxb2:generate {execution: generate-jaxb}]
[INFO] [resources:testResources {execution: default-testResources}]
[INFO] Using 'UTF-8' encoding to copy filtered resources.
[INFO] Copying 1 resource
[INFO] Copying 3 resources
[INFO] [compiler:testCompile {execution: default-testCompile}]
[INFO] Compiling 10 source files to <https://builds.apache.org/job/Tuscany-2x-deploy/ws/sca-2x/modules/databinding-jaxb-axiom/target/test-classes>
[INFO] [surefire:test {execution: default-test}]
[INFO] Tests are skipped.
[INFO] [jar:jar {execution: default-jar}]
[INFO] Building jar: <https://builds.apache.org/job/Tuscany-2x-deploy/ws/sca-2x/modules/databinding-jaxb-axiom/target/tuscany-databinding-jaxb-axiom-2.5-SNAPSHOT.jar>
[INFO] [source:jar-no-fork {execution: attach-sources}]
[INFO] Building jar: <https://builds.apache.org/job/Tuscany-2x-deploy/ws/sca-2x/modules/databinding-jaxb-axiom/target/tuscany-databinding-jaxb-axiom-2.5-SNAPSHOT-sources.jar>
[INFO] [install:install {execution: default-install}]
[INFO] Installing <https://builds.apache.org/job/Tuscany-2x-deploy/ws/sca-2x/modules/databinding-jaxb-axiom/target/tuscany-databinding-jaxb-axiom-2.5-SNAPSHOT.jar>
to <https://builds.apache.org/job/Tuscany-2x-deploy/ws/.repository/org/apache/tuscany/sca/tuscany-databinding-jaxb-axiom/2.5-SNAPSHOT/tuscany-databinding-jaxb-axiom-2.5-SNAPSHOT.jar>
[INFO] Installing <https://builds.apache.org/job/Tuscany-2x-deploy/ws/sca-2x/modules/databinding-jaxb-axiom/target/tuscany-databinding-jaxb-axiom-2.5-SNAPSHOT-sources.jar>
to <https://builds.apache.org/job/Tuscany-2x-deploy/ws/.repository/org/apache/tuscany/sca/tuscany-databinding-jaxb-axiom/2.5-SNAPSHOT/tuscany-databinding-jaxb-axiom-2.5-SNAPSHOT-sources.jar>
[INFO] [deploy:deploy {execution: default-deploy}]
[INFO] Retrieving previous build number from apache.snapshots.https
[WARNING] *** CHECKSUM FAILED - Checksum failed on download: local = 'b7335570a96ad543f1c953ad667f088d0e5bc512';
remote = '2f1fecdee9167deb80e05bd803536b19663b90cb' - RETRYING
[WARNING] *** CHECKSUM FAILED - Checksum failed on download: local = 'b7335570a96ad543f1c953ad667f088d0e5bc512';
remote = '2f1fecdee9167deb80e05bd803536b19663b90cb' - IGNORING
Uploading: https://repository.apache.org/content/repositories/snapshots/org/apache/tuscany/sca/tuscany-databinding-jaxb-axiom/2.5-SNAPSHOT/tuscany-databinding-jaxb-axiom-2.5-SNAPSHOT.jar
38K uploaded  (tuscany-databinding-jaxb-axiom-2.5-SNAPSHOT.jar)
[INFO] Uploading project information for tuscany-databinding-jaxb-axiom 2.5-SNAPSHOT
[INFO] Retrieving previous metadata from apache.snapshots.https
[WARNING] *** CHECKSUM FAILED - Checksum failed on download: local = 'b7335570a96ad543f1c953ad667f088d0e5bc512';
remote = '2f1fecdee9167deb80e05bd803536b19663b90cb' - RETRYING
[WARNING] *** CHECKSUM FAILED - Checksum failed on download: local = 'b7335570a96ad543f1c953ad667f088d0e5bc512';
remote = '2f1fecdee9167deb80e05bd803536b19663b90cb' - IGNORING
[INFO] Uploading repository metadata for: 'snapshot org.apache.tuscany.sca:tuscany-databinding-jaxb-axiom:2.5-SNAPSHOT'
[INFO] Retrieving previous metadata from apache.snapshots.https
[INFO] Uploading repository metadata for: 'artifact org.apache.tuscany.sca:tuscany-databinding-jaxb-axiom'
[INFO] Retrieving previous build number from apache.snapshots.https
Uploading: https://repository.apache.org/content/repositories/snapshots/org/apache/tuscany/sca/tuscany-databinding-jaxb-axiom/2.5-SNAPSHOT/tuscany-databinding-jaxb-axiom-2.5-SNAPSHOT-sources.jar
36K uploaded  (tuscany-databinding-jaxb-axiom-2.5-SNAPSHOT-sources.jar)
[JENKINS] Archiving disabled
[INFO] ------------------------------------------------------------------------
[INFO] Building Apache Tuscany SCA Axis2-1.5-based WS Binding Runtime
[INFO]    task-segment: [clean, deploy]
[INFO] ------------------------------------------------------------------------
[INFO] [clean:clean {execution: default-clean}]
[INFO] Deleting <https://builds.apache.org/job/Tuscany-2x-deploy/ws/sca-2x/modules/binding-ws-runtime-axis2/target>
[WARNING] POM for 'org.apache.ws.security:wss4j:pom:1.5.10:compile' is invalid.

Its dependencies (if any) will NOT be available to the current build.
[WARNING] POM for 'org.opensaml:opensaml:pom:2.2.3:compile' is invalid.

Its dependencies (if any) will NOT be available to the current build.
[INFO] [enforcer:enforce {execution: enforce-plugin-versions}]
[INFO] [remote-resources:process {execution: default}]
[WARNING] POM for 'org.apache.ws.security:wss4j:pom:1.5.10:compile' is invalid.

Its dependencies (if any) will NOT be available to the current build.
[WARNING] POM for 'org.opensaml:opensaml:pom:2.2.3:compile' is invalid.

Its dependencies (if any) will NOT be available to the current build.
[WARNING] Invalid project model for artifact [wss4j:org.apache.ws.security:1.5.10]. It will
be ignored by the remote resources Mojo.
[INFO] [resources:resources {execution: default-resources}]
[INFO] Using 'UTF-8' encoding to copy filtered resources.
[INFO] Copying 6 resources
[INFO] Copying 3 resources
[INFO] Copying 3 resources
[INFO] [compiler:compile {execution: default-compile}]
[INFO] Compiling 29 source files to <https://builds.apache.org/job/Tuscany-2x-deploy/ws/sca-2x/modules/binding-ws-runtime-axis2/target/classes>
[INFO] -------------------------------------------------------------
[ERROR] COMPILATION ERROR : 
[INFO] -------------------------------------------------------------
[ERROR] error: error reading <https://builds.apache.org/job/Tuscany-2x-deploy/ws/.repository/org/apache/ws/security/wss4j/1.5.10/wss4j-1.5.10.jar;>
error in opening zip file
[INFO] 1error
[INFO] -------------------------------------------------------------
[JENKINS] Archiving disabled
[INFO] ------------------------------------------------------------------------
[ERROR] BUILD FAILURE
[INFO] ------------------------------------------------------------------------
[INFO] Compilation failure
error: error reading <https://builds.apache.org/job/Tuscany-2x-deploy/ws/.repository/org/apache/ws/security/wss4j/1.5.10/wss4j-1.5.10.jar;>
error in opening zip file

[INFO] ------------------------------------------------------------------------
[INFO] For more information, run Maven with the -e switch
[INFO] ------------------------------------------------------------------------
[INFO] Total time: 36 minutes 33 seconds
[INFO] Finished at: Tue Dec 25 01:07:51 GMT+00:00 2012
[INFO] Final Memory: 393M/703M
[INFO] ------------------------------------------------------------------------
channel stopped

Mime
View raw message