tuscany-commits mailing list archives

Site index · List index
Message view « Date » · « Thread »
Top « Date » · « Thread »
From Apache Jenkins Server <jenk...@builds.apache.org>
Subject Build failed in Jenkins: Tuscany-2x-deploy #1002
Date Mon, 03 Dec 2012 00:47:14 GMT
See <https://builds.apache.org/job/Tuscany-2x-deploy/1002/>

------------------------------------------
[...truncated 14583 lines...]
[INFO] Apache Tuscany SCA Samples Helloworld WebApp ...... SUCCESS [11.883s]
[INFO] Apache Tuscany SCA Samples Helloworld Web Service . SUCCESS [4.893s]
[INFO] Apache Tuscany SCA Samples Helloworld With Dependencies  SUCCESS [5.624s]
[INFO] Apache Tuscany SCA Samples Getting Started ........ SUCCESS [2.095s]
[INFO] Apache Tuscany SCA Samples Running Tuscany ........ SUCCESS [2.142s]
[INFO] Apache Tuscany SCA Samples JSE .................... SUCCESS [4.248s]
[INFO] Apache Tuscany SCA Samples JUnit .................. SUCCESS [4.464s]
[INFO] Apache Tuscany SCA Sample Async Invocation ........ SUCCESS [6.812s]
[INFO] Apache Tuscany SCA Sample Learning More ........... SUCCESS [2.528s]
[INFO] Apache Tuscany SCA Sample binding.websocket ....... SUCCESS [2.475s]
[INFO] Apache Tuscany SCA Sample binding.websocket Autocomplete Webapp  SUCCESS [6.511s]
[INFO] Apache Tuscany SCA Sample binding.websocket Weather Monitor Webapp  SUCCESS [7.286s]
[INFO] Apache Tuscany SCA Sample binding.websocket Chat Webapp  SUCCESS [6.738s]
[INFO] Apache Tuscany SCA Sample binding.websocket PubSub Webapp  SUCCESS [7.063s]
[INFO] Apache Tuscany SCA Sample Calculator OSGi ......... SUCCESS [6.080s]
[INFO] Apache Tuscany SCA Sample OSGi Remote Services Calculator  SUCCESS [9.227s]
[INFO] Apache Tuscany SCA Sample OSGi Remote Services Calculator Operations  SUCCESS [6.126s]
[INFO] Apache Tuscany SCA Distributed OSGI Statically Configured Samples  SUCCESS [2.037s]
[INFO] Apache Tuscany SCA All-in-one Distribution ........ FAILURE [3.245s]
[INFO] ------------------------------------------------------------------------
[INFO] BUILD FAILURE
[INFO] ------------------------------------------------------------------------
[INFO] Total time: 16:08.867s
[INFO] Finished at: Mon Dec 03 00:46:26 UTC 2012
[INFO] Final Memory: 90M/748M
[INFO] ------------------------------------------------------------------------
Projects to build: [MavenProject: org.apache.tuscany.sca:tuscany-sca:2.5-SNAPSHOT @ <https://builds.apache.org/job/Tuscany-2x-deploy/ws/sca-2x/pom.xml,>
MavenProject: org.apache.tuscany.sca:tuscany-modules:2.5-SNAPSHOT @ <https://builds.apache.org/job/Tuscany-2x-deploy/ws/sca-2x/modules/pom.xml,>
MavenProject: org.apache.tuscany.sca:tuscany-monitor:2.5-SNAPSHOT @ <https://builds.apache.org/job/Tuscany-2x-deploy/ws/sca-2x/modules/monitor/pom.xml,>
MavenProject: org.apache.tuscany.sca:tuscany-extensibility:2.5-SNAPSHOT @ <https://builds.apache.org/job/Tuscany-2x-deploy/ws/sca-2x/modules/extensibility/pom.xml,>
MavenProject: org.apache.tuscany.sca:tuscany-assembly:2.5-SNAPSHOT @ <https://builds.apache.org/job/Tuscany-2x-deploy/ws/sca-2x/modules/assembly/pom.xml,>
MavenProject: org.apache.tuscany.sca:tuscany-assembly-xsd:2.5-SNAPSHOT @ <https://builds.apache.org/job/Tuscany-2x-deploy/ws/sca-2x/modules/assembly-xsd/pom.xml,>
MavenProject: org.apache.tuscany.sca:tuscany-common-xml:2.5-SNAPSHOT @ <https://builds.apache.org/job/Tuscany-2x-deploy/ws/sca-2x/modules/common-xml/pom.xml,>
MavenProject: org.apache.tuscany.sca:tuscany-sca-api:2.5-SNAPSHOT @ <https://builds.apache.org/job/Tuscany-2x-deploy/ws/sca-2x/modules/sca-api/pom.xml,>
MavenProject: org.apache.tuscany.sca:tuscany-common-java:2.5-SNAPSHOT @ <https://builds.apache.org/job/Tuscany-2x-deploy/ws/sca-2x/modules/common-java/pom.xml,>
MavenProject: org.apache.tuscany.sca:tuscany-contribution:2.5-SNAPSHOT @ <https://builds.apache.org/job/Tuscany-2x-deploy/ws/sca-2x/modules/contribution/pom.xml,>
MavenProject: org.apache.tuscany.sca:tuscany-node-api:2.5-SNAPSHOT @ <https://builds.apache.org/job/Tuscany-2x-deploy/ws/sca-2x/modules/node-api/pom.xml,>
MavenProject: org.apache.tuscany.sca:tuscany-core-spi:2.5-SNAPSHOT @ <https://builds.apache.org/job/Tuscany-2x-deploy/ws/sca-2x/modules/core-spi/pom.xml,>
MavenProject: org.apache.tuscany.sca:tuscany-xsd:2.5-SNAPSHOT @ <https://builds.apache.org/job/Tuscany-2x-deploy/ws/sca-2x/modules/xsd/pom.xml,>
MavenProject: org.apache.tuscany.sca:tuscany-assembly-xml:2.5-SNAPSHOT @ <https://builds.apache.org/job/Tuscany-2x-deploy/ws/sca-2x/modules/assembly-xml/pom.xml,>
MavenProject: org.apache.tuscany.sca:tuscany-interface-wsdl:2.5-SNAPSHOT @ <https://builds.apache.org/job/Tuscany-2x-deploy/ws/sca-2x/modules/interface-wsdl/pom.xml,>
MavenProject: org.apache.tuscany.sca:tuscany-interface-java:2.5-SNAPSHOT @ <https://builds.apache.org/job/Tuscany-2x-deploy/ws/sca-2x/modules/interface-java/pom.xml,>
MavenProject: org.apache.tuscany.sca:tuscany-core:2.5-SNAPSHOT @ <https://builds.apache.org/job/Tuscany-2x-deploy/ws/sca-2x/modules/core/pom.xml,>
MavenProject: org.apache.tuscany.sca:tuscany-databinding:2.5-SNAPSHOT @ <https://builds.apache.org/job/Tuscany-2x-deploy/ws/sca-2x/modules/databinding/pom.xml,>
MavenProject: org.apache.tuscany.sca:tuscany-databinding-jaxb:2.5-SNAPSHOT @ <https://builds.apache.org/job/Tuscany-2x-deploy/ws/sca-2x/modules/databinding-jaxb/pom.xml,>
MavenProject: org.apache.tuscany.sca:tuscany-builder:2.5-SNAPSHOT @ <https://builds.apache.org/job/Tuscany-2x-deploy/ws/sca-2x/modules/builder/pom.xml,>
MavenProject: org.apache.tuscany.sca:tuscany-deployment:2.5-SNAPSHOT @ <https://builds.apache.org/job/Tuscany-2x-deploy/ws/sca-2x/modules/deployment/pom.xml,>
MavenProject: org.apache.tuscany.sca:tuscany-binding-ws:2.5-SNAPSHOT @ <https://builds.apache.org/job/Tuscany-2x-deploy/ws/sca-2x/modules/binding-ws/pom.xml,>
MavenProject: org.apache.tuscany.sca:tuscany-interface-java-jaxws:2.5-SNAPSHOT @ <https://builds.apache.org/job/Tuscany-2x-deploy/ws/sca-2x/modules/interface-java-jaxws/pom.xml,>
MavenProject: org.apache.tuscany.sca:tuscany-core-databinding:2.5-SNAPSHOT @ <https://builds.apache.org/job/Tuscany-2x-deploy/ws/sca-2x/modules/core-databinding/pom.xml,>
MavenProject: org.apache.tuscany.sca:tuscany-binding-ws-wsdlgen:2.5-SNAPSHOT @ <https://builds.apache.org/job/Tuscany-2x-deploy/ws/sca-2x/modules/binding-ws-wsdlgen/pom.xml,>
MavenProject: org.apache.tuscany.sca:tuscany-binding-sca-runtime:2.5-SNAPSHOT @ <https://builds.apache.org/job/Tuscany-2x-deploy/ws/sca-2x/modules/binding-sca-runtime/pom.xml,>
MavenProject: org.apache.tuscany.sca:tuscany-implementation-java:2.5-SNAPSHOT @ <https://builds.apache.org/job/Tuscany-2x-deploy/ws/sca-2x/modules/implementation-java/pom.xml,>
MavenProject: org.apache.tuscany.sca:tuscany-implementation-java-runtime:2.5-SNAPSHOT @ <https://builds.apache.org/job/Tuscany-2x-deploy/ws/sca-2x/modules/implementation-java-runtime/pom.xml,>
MavenProject: org.apache.tuscany.sca:tuscany-node-impl:2.5-SNAPSHOT @ <https://builds.apache.org/job/Tuscany-2x-deploy/ws/sca-2x/modules/node-impl/pom.xml,>
MavenProject: org.apache.tuscany.sca:tuscany-data-api:2.5-SNAPSHOT @ <https://builds.apache.org/job/Tuscany-2x-deploy/ws/sca-2x/modules/data-api/pom.xml,>
MavenProject: org.apache.tuscany.sca:tuscany-domain-node:2.5-SNAPSHOT @ <https://builds.apache.org/job/Tuscany-2x-deploy/ws/sca-2x/modules/domain-node/pom.xml,>
MavenProject: org.apache.tuscany.sca:tuscany-implementation-web:2.5-SNAPSHOT @ <https://builds.apache.org/job/Tuscany-2x-deploy/ws/sca-2x/modules/implementation-web/pom.xml,>
MavenProject: org.apache.tuscany.sca:tuscany-host-http:2.5-SNAPSHOT @ <https://builds.apache.org/job/Tuscany-2x-deploy/ws/sca-2x/modules/host-http/pom.xml,>
MavenProject: org.apache.tuscany.sca:tuscany-host-webapp:2.5-SNAPSHOT @ <https://builds.apache.org/job/Tuscany-2x-deploy/ws/sca-2x/modules/host-webapp/pom.xml,>
MavenProject: org.apache.tuscany.sca:tuscany-implementation-web-runtime:2.5-SNAPSHOT @ <https://builds.apache.org/job/Tuscany-2x-deploy/ws/sca-2x/modules/implementation-web-runtime/pom.xml,>
MavenProject: org.apache.tuscany.sca:tuscany-launcher:2.5-SNAPSHOT @ <https://builds.apache.org/job/Tuscany-2x-deploy/ws/sca-2x/modules/launcher/pom.xml,>
MavenProject: org.apache.tuscany.sca:tuscany-sca-client-impl:2.5-SNAPSHOT @ <https://builds.apache.org/job/Tuscany-2x-deploy/ws/sca-2x/modules/sca-client-impl/pom.xml,>
MavenProject: org.apache.tuscany.sca:tuscany-host-jetty:2.5-SNAPSHOT @ <https://builds.apache.org/job/Tuscany-2x-deploy/ws/sca-2x/modules/host-jetty/pom.xml,>
MavenProject: org.apache.tuscany.sca:tuscany-shell:2.5-SNAPSHOT @ <https://builds.apache.org/job/Tuscany-2x-deploy/ws/sca-2x/modules/shell/pom.xml,>
MavenProject: org.apache.tuscany.sca:tuscany-stripes:2.5-SNAPSHOT @ <https://builds.apache.org/job/Tuscany-2x-deploy/ws/sca-2x/modules/stripes/pom.xml,>
MavenProject: org.apache.tuscany.sca:tuscany-wink:2.5-SNAPSHOT @ <https://builds.apache.org/job/Tuscany-2x-deploy/ws/sca-2x/modules/wink/pom.xml,>
MavenProject: org.apache.tuscany.sca:tuscany-binding-ws-runtime-jaxws:2.5-SNAPSHOT @ <https://builds.apache.org/job/Tuscany-2x-deploy/ws/sca-2x/modules/binding-ws-runtime-jaxws/pom.xml,>
MavenProject: org.apache.tuscany.sca:tuscany-binding-ws-runtime-jaxws-ri:2.5-SNAPSHOT @ <https://builds.apache.org/job/Tuscany-2x-deploy/ws/sca-2x/modules/binding-ws-runtime-jaxws-ri/pom.xml,>
MavenProject: org.apache.tuscany.sca:tuscany-common-http:2.5-SNAPSHOT @ <https://builds.apache.org/job/Tuscany-2x-deploy/ws/sca-2x/modules/common-http/pom.xml,>
MavenProject: org.apache.tuscany.sca:tuscany-core-runtime-pom:2.5-SNAPSHOT @ <https://builds.apache.org/job/Tuscany-2x-deploy/ws/sca-2x/modules/core-runtime-pom/pom.xml,>
MavenProject: org.apache.tuscany.sca:tuscany-policy-security:2.5-SNAPSHOT @ <https://builds.apache.org/job/Tuscany-2x-deploy/ws/sca-2x/modules/policy-security/pom.xml,>
MavenProject: org.apache.tuscany.sca:tuscany-binding-atom:2.5-SNAPSHOT @ <https://builds.apache.org/job/Tuscany-2x-deploy/ws/sca-2x/modules/binding-atom/pom.xml,>
MavenProject: org.apache.tuscany.sca:tuscany-host-corba:2.5-SNAPSHOT @ <https://builds.apache.org/job/Tuscany-2x-deploy/ws/sca-2x/modules/host-corba/pom.xml,>
MavenProject: org.apache.tuscany.sca:tuscany-binding-corba:2.5-SNAPSHOT @ <https://builds.apache.org/job/Tuscany-2x-deploy/ws/sca-2x/modules/binding-corba/pom.xml,>
MavenProject: org.apache.tuscany.sca:tuscany-binding-ejb:2.5-SNAPSHOT @ <https://builds.apache.org/job/Tuscany-2x-deploy/ws/sca-2x/modules/binding-ejb/pom.xml,>
MavenProject: org.apache.tuscany.sca:tuscany-binding-http:2.5-SNAPSHOT @ <https://builds.apache.org/job/Tuscany-2x-deploy/ws/sca-2x/modules/binding-http/pom.xml,>
MavenProject: org.apache.tuscany.sca:tuscany-binding-jms:2.5-SNAPSHOT @ <https://builds.apache.org/job/Tuscany-2x-deploy/ws/sca-2x/modules/binding-jms/pom.xml,>
MavenProject: org.apache.tuscany.sca:tuscany-binding-jsonp:2.5-SNAPSHOT @ <https://builds.apache.org/job/Tuscany-2x-deploy/ws/sca-2x/modules/binding-jsonp/pom.xml,>
MavenProject: org.apache.tuscany.sca:tuscany-binding-jsonrpc:2.5-SNAPSHOT @ <https://builds.apache.org/job/Tuscany-2x-deploy/ws/sca-2x/modules/binding-jsonrpc/pom.xml,>
MavenProject: org.apache.tuscany.sca:tuscany-binding-rest:2.5-SNAPSHOT @ <https://builds.apache.org/job/Tuscany-2x-deploy/ws/sca-2x/modules/binding-rest/pom.xml,>
MavenProject: org.apache.tuscany.sca:tuscany-binding-rmi:2.5-SNAPSHOT @ <https://builds.apache.org/job/Tuscany-2x-deploy/ws/sca-2x/modules/binding-rmi/pom.xml,>
MavenProject: org.apache.tuscany.sca:tuscany-implementation-bpel:2.5-SNAPSHOT @ <https://builds.apache.org/job/Tuscany-2x-deploy/ws/sca-2x/modules/implementation-bpel/pom.xml,>
MavenProject: org.apache.tuscany.sca:tuscany-implementation-script:2.5-SNAPSHOT @ <https://builds.apache.org/job/Tuscany-2x-deploy/ws/sca-2x/modules/implementation-script/pom.xml,>
MavenProject: org.apache.tuscany.sca:tuscany-implementation-spring:2.5-SNAPSHOT @ <https://builds.apache.org/job/Tuscany-2x-deploy/ws/sca-2x/modules/implementation-spring/pom.xml,>
MavenProject: org.apache.tuscany.sca:tuscany-implementation-widget:2.5-SNAPSHOT @ <https://builds.apache.org/job/Tuscany-2x-deploy/ws/sca-2x/modules/implementation-widget/pom.xml,>
MavenProject: org.apache.tuscany.sca:tuscany-base-runtime:2.5-SNAPSHOT @ <https://builds.apache.org/job/Tuscany-2x-deploy/ws/sca-2x/modules/base-runtime/dependency-reduced-pom.xml,>
MavenProject: org.apache.tuscany.sca:tuscany-domain-hazelcast:2.5-SNAPSHOT @ <https://builds.apache.org/job/Tuscany-2x-deploy/ws/sca-2x/modules/domain-hazelcast/pom.xml,>
MavenProject: org.apache.tuscany.sca:tuscany-maven-plugin:2.5-SNAPSHOT @ <https://builds.apache.org/job/Tuscany-2x-deploy/ws/sca-2x/maven/tuscany-maven-plugin/pom.xml,>
MavenProject: org.apache.tuscany.sca:tuscany-binding-archetype:2.5-SNAPSHOT @ <https://builds.apache.org/job/Tuscany-2x-deploy/ws/sca-2x/maven/archetypes/binding/pom.xml,>
MavenProject: org.apache.tuscany.sca:tuscany-contribution-jar:2.5-SNAPSHOT @ <https://builds.apache.org/job/Tuscany-2x-deploy/ws/sca-2x/maven/archetypes/contribution-jar/pom.xml,>
MavenProject: org.apache.tuscany.sca:tuscany-contribution-zip:2.5-SNAPSHOT @ <https://builds.apache.org/job/Tuscany-2x-deploy/ws/sca-2x/maven/archetypes/contribution-zip/pom.xml,>
MavenProject: org.apache.tuscany.sca:tuscany-zip-contribution-descriptor:2.5-SNAPSHOT @ <https://builds.apache.org/job/Tuscany-2x-deploy/ws/sca-2x/maven/archetypes/contribution-zip-discriptor/pom.xml,>
MavenProject: org.apache.tuscany.sca:tuscany-policy-archetype:2.5-SNAPSHOT @ <https://builds.apache.org/job/Tuscany-2x-deploy/ws/sca-2x/maven/archetypes/policy/pom.xml,>
MavenProject: org.apache.tuscany.sca:tuscany-quickstart:2.5-SNAPSHOT @ <https://builds.apache.org/job/Tuscany-2x-deploy/ws/sca-2x/maven/archetypes/quickstart/pom.xml,>
MavenProject: org.apache.tuscany.sca:tuscany-quickstart-jsf:2.5-SNAPSHOT @ <https://builds.apache.org/job/Tuscany-2x-deploy/ws/sca-2x/maven/archetypes/quickstart-jsf/pom.xml,>
MavenProject: org.apache.tuscany.sca:tuscany-quickstart-stripes:2.5-SNAPSHOT @ <https://builds.apache.org/job/Tuscany-2x-deploy/ws/sca-2x/maven/archetypes/quickstart-stripes/pom.xml,>
MavenProject: org.apache.tuscany.sca:tuscany-quickstart-bpel:2.5-SNAPSHOT @ <https://builds.apache.org/job/Tuscany-2x-deploy/ws/sca-2x/maven/archetypes/quickstart-bpel/pom.xml,>
MavenProject: org.apache.tuscany.sca:tuscany-archetype:2.5-SNAPSHOT @ <https://builds.apache.org/job/Tuscany-2x-deploy/ws/sca-2x/maven/archetypes/pom.xml,>
MavenProject: org.apache.tuscany.sca:tuscany-web-javascript:2.5-SNAPSHOT @ <https://builds.apache.org/job/Tuscany-2x-deploy/ws/sca-2x/modules/web-javascript/pom.xml,>
MavenProject: org.apache.tuscany.sca:tuscany-binding-atom-runtime:2.5-SNAPSHOT @ <https://builds.apache.org/job/Tuscany-2x-deploy/ws/sca-2x/modules/binding-atom-runtime/pom.xml,>
MavenProject: org.apache.tuscany.sca:tuscany-binding-comet:2.5-SNAPSHOT @ <https://builds.apache.org/job/Tuscany-2x-deploy/ws/sca-2x/modules/binding-comet/pom.xml,>
MavenProject: org.apache.tuscany.sca:tuscany-binding-ejb-runtime:2.5-SNAPSHOT @ <https://builds.apache.org/job/Tuscany-2x-deploy/ws/sca-2x/modules/binding-ejb-runtime/pom.xml,>
MavenProject: org.apache.tuscany.sca:tuscany-databinding-json:2.5-SNAPSHOT @ <https://builds.apache.org/job/Tuscany-2x-deploy/ws/sca-2x/modules/databinding-json/pom.xml,>
MavenProject: org.apache.tuscany.sca:tuscany-binding-http-runtime:2.5-SNAPSHOT @ <https://builds.apache.org/job/Tuscany-2x-deploy/ws/sca-2x/modules/binding-http-runtime/pom.xml,>
MavenProject: org.apache.tuscany.sca:tuscany-implementation-jaxrs:2.5-SNAPSHOT @ <https://builds.apache.org/job/Tuscany-2x-deploy/ws/sca-2x/modules/implementation-jaxrs/pom.xml,>
MavenProject: org.apache.tuscany.sca:tuscany-implementation-python:2.5-SNAPSHOT @ <https://builds.apache.org/job/Tuscany-2x-deploy/ws/sca-2x/modules/implementation-python/pom.xml,>
MavenProject: org.apache.tuscany.sca:tuscany-base-runtime-pom:2.5-SNAPSHOT @ <https://builds.apache.org/job/Tuscany-2x-deploy/ws/sca-2x/modules/base-runtime-pom/pom.xml,>
MavenProject: org.apache.tuscany.sca:tuscany-binding-jms-runtime:2.5-SNAPSHOT @ <https://builds.apache.org/job/Tuscany-2x-deploy/ws/sca-2x/modules/binding-jms-runtime/pom.xml,>
MavenProject: org.apache.tuscany.sca:tuscany-binding-jms-runtime-activemq:2.5-SNAPSHOT @ <https://builds.apache.org/job/Tuscany-2x-deploy/ws/sca-2x/modules/binding-jms-runtime-activemq/pom.xml,>
MavenProject: org.apache.tuscany.sca:tuscany-binding-jsonp-runtime:2.5-SNAPSHOT @ <https://builds.apache.org/job/Tuscany-2x-deploy/ws/sca-2x/modules/binding-jsonp-runtime/pom.xml,>
MavenProject: org.apache.tuscany.sca:tuscany-binding-jsonrpc-runtime:2.5-SNAPSHOT @ <https://builds.apache.org/job/Tuscany-2x-deploy/ws/sca-2x/modules/binding-jsonrpc-runtime/pom.xml,>
MavenProject: org.apache.tuscany.sca:tuscany-interface-java-jaxrs:2.5-SNAPSHOT @ <https://builds.apache.org/job/Tuscany-2x-deploy/ws/sca-2x/modules/interface-java-jaxrs/pom.xml,>
MavenProject: org.apache.tuscany.sca:tuscany-binding-rest-runtime:2.5-SNAPSHOT @ <https://builds.apache.org/job/Tuscany-2x-deploy/ws/sca-2x/modules/binding-rest-runtime/pom.xml,>
MavenProject: org.apache.tuscany.sca:tuscany-host-rmi:2.5-SNAPSHOT @ <https://builds.apache.org/job/Tuscany-2x-deploy/ws/sca-2x/modules/host-rmi/pom.xml,>
MavenProject: org.apache.tuscany.sca:tuscany-binding-rmi-runtime:2.5-SNAPSHOT @ <https://builds.apache.org/job/Tuscany-2x-deploy/ws/sca-2x/modules/binding-rmi-runtime/pom.xml,>
MavenProject: org.apache.tuscany.sca:tuscany-binding-websocket:2.5-SNAPSHOT @ <https://builds.apache.org/job/Tuscany-2x-deploy/ws/sca-2x/modules/binding-websocket/pom.xml,>
MavenProject: org.apache.tuscany.sca:tuscany-policy-wspolicy:2.5-SNAPSHOT @ <https://builds.apache.org/job/Tuscany-2x-deploy/ws/sca-2x/modules/policy-wspolicy/pom.xml,>
MavenProject: org.apache.tuscany.sca:tuscany-databinding-axiom:2.5-SNAPSHOT @ <https://builds.apache.org/job/Tuscany-2x-deploy/ws/sca-2x/modules/databinding-axiom/pom.xml,>
MavenProject: org.apache.tuscany.sca:tuscany-databinding-jaxb-axiom:2.5-SNAPSHOT @ <https://builds.apache.org/job/Tuscany-2x-deploy/ws/sca-2x/modules/databinding-jaxb-axiom/pom.xml,>
MavenProject: org.apache.tuscany.sca:tuscany-binding-ws-runtime-axis2:2.5-SNAPSHOT @ <https://builds.apache.org/job/Tuscany-2x-deploy/ws/sca-2x/modules/binding-ws-runtime-axis2/pom.xml,>
MavenProject: org.apache.tuscany.sca:tuscany-contribution-resource:2.5-SNAPSHOT @ <https://builds.apache.org/job/Tuscany-2x-deploy/ws/sca-2x/modules/contribution-resource/pom.xml,>
MavenProject: org.apache.tuscany.sca:tuscany-databinding-sdo:2.5-SNAPSHOT @ <https://builds.apache.org/job/Tuscany-2x-deploy/ws/sca-2x/modules/databinding-sdo/pom.xml,>
MavenProject: org.apache.tuscany.sca:tuscany-databinding-sdo-axiom:2.5-SNAPSHOT @ <https://builds.apache.org/job/Tuscany-2x-deploy/ws/sca-2x/modules/databinding-sdo-axiom/pom.xml,>
MavenProject: org.apache.tuscany.sca:tuscany-endpoint-tribes:2.5-SNAPSHOT @ <https://builds.apache.org/job/Tuscany-2x-deploy/ws/sca-2x/modules/endpoint-tribes/pom.xml,>
MavenProject: org.apache.tuscany.sca:tuscany-extensibility-equinox:2.5-SNAPSHOT @ <https://builds.apache.org/job/Tuscany-2x-deploy/ws/sca-2x/modules/extensibility-equinox/pom.xml,>
MavenProject: org.apache.tuscany.sca:tuscany-node-launcher-equinox:2.5-SNAPSHOT @ <https://builds.apache.org/job/Tuscany-2x-deploy/ws/sca-2x/modules/node-launcher-equinox/pom.xml,>
MavenProject: org.apache.tuscany.sca:tuscany-host-http-osgi:2.5-SNAPSHOT @ <https://builds.apache.org/job/Tuscany-2x-deploy/ws/sca-2x/modules/host-http-osgi/pom.xml,>
MavenProject: org.apache.tuscany.sca:tuscany-implementation-bpel-runtime:2.5-SNAPSHOT @ <https://builds.apache.org/job/Tuscany-2x-deploy/ws/sca-2x/modules/implementation-bpel-runtime/pom.xml,>
MavenProject: org.apache.tuscany.sca:tuscany-implementation-jaxrs-runtime:2.5-SNAPSHOT @ <https://builds.apache.org/job/Tuscany-2x-deploy/ws/sca-2x/modules/implementation-jaxrs-runtime/pom.xml,>
MavenProject: org.apache.tuscany.sca:tuscany-implementation-python-runtime:2.5-SNAPSHOT @
<https://builds.apache.org/job/Tuscany-2x-deploy/ws/sca-2x/modules/implementation-python-runtime/pom.xml,>
MavenProject: org.apache.tuscany.sca:tuscany-implementation-script-runtime:2.5-SNAPSHOT @
<https://builds.apache.org/job/Tuscany-2x-deploy/ws/sca-2x/modules/implementation-script-runtime/pom.xml,>
MavenProject: org.apache.tuscany.sca:tuscany-implementation-spring-runtime:2.5-SNAPSHOT @
<https://builds.apache.org/job/Tuscany-2x-deploy/ws/sca-2x/modules/implementation-spring-runtime/pom.xml,>
MavenProject: org.apache.tuscany.sca:tuscany-implementation-spring-webapp:2.5-SNAPSHOT @ <https://builds.apache.org/job/Tuscany-2x-deploy/ws/sca-2x/modules/implementation-spring-webapp/pom.xml,>
MavenProject: org.apache.tuscany.sca:tuscany-implementation-spring-stub:2.5-SNAPSHOT @ <https://builds.apache.org/job/Tuscany-2x-deploy/ws/sca-2x/modules/implementation-spring-stub/pom.xml,>
MavenProject: org.apache.tuscany.sca:tuscany-implementation-spring-tie:2.5-SNAPSHOT @ <https://builds.apache.org/job/Tuscany-2x-deploy/ws/sca-2x/modules/implementation-spring-tie/pom.xml,>
MavenProject: org.apache.tuscany.sca:tuscany-implementation-web-client:2.5-SNAPSHOT @ <https://builds.apache.org/job/Tuscany-2x-deploy/ws/sca-2x/modules/implementation-web-client/pom.xml,>
MavenProject: org.apache.tuscany.sca:tuscany-implementation-widget-runtime:2.5-SNAPSHOT @
<https://builds.apache.org/job/Tuscany-2x-deploy/ws/sca-2x/modules/implementation-widget-runtime/pom.xml,>
MavenProject: org.apache.tuscany.sca:tuscany-web-javascript-dojo:2.5-SNAPSHOT @ <https://builds.apache.org/job/Tuscany-2x-deploy/ws/sca-2x/modules/web-javascript-dojo/pom.xml,>
MavenProject: org.apache.tuscany.sca:tuscany-implementation-widget-runtime-dojo:2.5-SNAPSHOT
@ <https://builds.apache.org/job/Tuscany-2x-deploy/ws/sca-2x/modules/implementation-widget-runtime-dojo/pom.xml,>
MavenProject: org.apache.tuscany.sca:tuscany-myfaces:2.5-SNAPSHOT @ <https://builds.apache.org/job/Tuscany-2x-deploy/ws/sca-2x/modules/myfaces/pom.xml,>
MavenProject: org.apache.tuscany.sca:tuscany-node-launcher:2.5-SNAPSHOT @ <https://builds.apache.org/job/Tuscany-2x-deploy/ws/sca-2x/modules/node-launcher/pom.xml,>
MavenProject: org.apache.tuscany.sca:tuscany-node-manager:2.5-SNAPSHOT @ <https://builds.apache.org/job/Tuscany-2x-deploy/ws/sca-2x/modules/node-manager/pom.xml,>
MavenProject: org.apache.tuscany.sca:tuscany-policy-logging:2.5-SNAPSHOT @ <https://builds.apache.org/job/Tuscany-2x-deploy/ws/sca-2x/modules/policy-logging/pom.xml,>
MavenProject: org.apache.tuscany.sca:tuscany-policy-security-jsr250:2.5-SNAPSHOT @ <https://builds.apache.org/job/Tuscany-2x-deploy/ws/sca-2x/modules/policy-security-jsr250/pom.xml,>
MavenProject: org.apache.tuscany.sca:tuscany-policy-transaction:2.5-SNAPSHOT @ <https://builds.apache.org/job/Tuscany-2x-deploy/ws/sca-2x/modules/policy-transaction/pom.xml,>
MavenProject: org.apache.tuscany.sca:tuscany-policy-transaction-runtime:2.5-SNAPSHOT @ <https://builds.apache.org/job/Tuscany-2x-deploy/ws/sca-2x/modules/policy-transaction-runtime/pom.xml,>
MavenProject: org.apache.tuscany.sca:tuscany-policy-transaction-runtime-geronimo:2.5-SNAPSHOT
@ <https://builds.apache.org/job/Tuscany-2x-deploy/ws/sca-2x/modules/policy-transaction-runtime-geronimo/pom.xml,>
MavenProject: org.apache.tuscany.sca:tuscany-tracing-aspectj:2.5-SNAPSHOT @ <https://builds.apache.org/job/Tuscany-2x-deploy/ws/sca-2x/modules/tracing-aspectj/pom.xml,>
MavenProject: org.apache.tuscany.sca:tuscany-contribution-osgi:2.5-SNAPSHOT @ <https://builds.apache.org/job/Tuscany-2x-deploy/ws/sca-2x/modules/contribution-osgi/pom.xml,>
MavenProject: org.apache.tuscany.sca:tuscany-implementation-osgi:2.5-SNAPSHOT @ <https://builds.apache.org/job/Tuscany-2x-deploy/ws/sca-2x/modules/implementation-osgi/pom.xml,>
MavenProject: org.apache.tuscany.sca:tuscany-implementation-osgi-runtime:2.5-SNAPSHOT @ <https://builds.apache.org/job/Tuscany-2x-deploy/ws/sca-2x/modules/implementation-osgi-runtime/pom.xml,>
MavenProject: org.apache.tuscany.sca:tuscany-node-impl-osgi:2.5-SNAPSHOT @ <https://builds.apache.org/job/Tuscany-2x-deploy/ws/sca-2x/modules/node-impl-osgi/pom.xml,>
MavenProject: org.apache.tuscany.sca:tuscany-host-corba-jse:2.5-SNAPSHOT @ <https://builds.apache.org/job/Tuscany-2x-deploy/ws/sca-2x/modules/host-corba-jse/pom.xml,>
MavenProject: org.apache.tuscany.sca:tuscany-host-corba-jee:2.5-SNAPSHOT @ <https://builds.apache.org/job/Tuscany-2x-deploy/ws/sca-2x/modules/host-corba-jee/pom.xml,>
MavenProject: org.apache.tuscany.sca:tuscany-binding-corba-runtime:2.5-SNAPSHOT @ <https://builds.apache.org/job/Tuscany-2x-deploy/ws/sca-2x/modules/binding-corba-runtime/pom.xml,>
MavenProject: org.apache.tuscany.sca:tuscany-host-corba-jse-tns:2.5-SNAPSHOT @ <https://builds.apache.org/job/Tuscany-2x-deploy/ws/sca-2x/modules/host-corba-jse-tns/pom.xml,>
MavenProject: org.apache.tuscany.sca:tuscany-composite-diagram:2.5-SNAPSHOT @ <https://builds.apache.org/job/Tuscany-2x-deploy/ws/sca-2x/modules/composite-diagram/pom.xml,>
MavenProject: org.apache.tuscany.sca:tuscany-osgi-runtime-pom:2.5-SNAPSHOT @ <https://builds.apache.org/job/Tuscany-2x-deploy/ws/sca-2x/modules/osgi-runtime-pom/pom.xml,>
MavenProject: org.apache.tuscany.sca.samples:tuscany-samples:2.5-SNAPSHOT @ <https://builds.apache.org/job/Tuscany-2x-deploy/ws/sca-2x/samples/pom.xml,>
MavenProject: org.apache.tuscany.sca.samples:sample-store:2.5-SNAPSHOT @ <https://builds.apache.org/job/Tuscany-2x-deploy/ws/sca-2x/samples/applications/store/pom.xml,>
MavenProject: org.apache.tuscany.sca.samples:tuscany-samples-applications:2.5-SNAPSHOT @ <https://builds.apache.org/job/Tuscany-2x-deploy/ws/sca-2x/samples/applications/pom.xml,>
MavenProject: org.apache.tuscany.sca.samples:helloworld:2.5-SNAPSHOT @ <https://builds.apache.org/job/Tuscany-2x-deploy/ws/sca-2x/samples/getting-started/helloworld/pom.xml,>
MavenProject: org.apache.tuscany.sca.samples:helloworld-jaxrs:2.5-SNAPSHOT @ <https://builds.apache.org/job/Tuscany-2x-deploy/ws/sca-2x/samples/getting-started/helloworld-jaxrs/pom.xml,>
MavenProject: org.apache.tuscany.sca.samples:helloworld-jsonp:2.5-SNAPSHOT @ <https://builds.apache.org/job/Tuscany-2x-deploy/ws/sca-2x/samples/getting-started/helloworld-jsonp/pom.xml,>
MavenProject: org.apache.tuscany.sca.samples:helloworld-jsonrpc:2.5-SNAPSHOT @ <https://builds.apache.org/job/Tuscany-2x-deploy/ws/sca-2x/samples/getting-started/helloworld-jsonrpc/pom.xml,>
MavenProject: org.apache.tuscany.sca.samples:helloworld-scaclient:2.5-SNAPSHOT @ <https://builds.apache.org/job/Tuscany-2x-deploy/ws/sca-2x/samples/getting-started/helloworld-scaclient/pom.xml,>
MavenProject: org.apache.tuscany.sca.samples:helloworld-spring:2.5-SNAPSHOT @ <https://builds.apache.org/job/Tuscany-2x-deploy/ws/sca-2x/samples/getting-started/helloworld-spring/pom.xml,>
MavenProject: org.apache.tuscany.sca.samples:helloworld-webapp:2.5-SNAPSHOT @ <https://builds.apache.org/job/Tuscany-2x-deploy/ws/sca-2x/samples/getting-started/helloworld-webapp/pom.xml,>
MavenProject: org.apache.tuscany.sca.samples:helloworld-webservice:2.5-SNAPSHOT @ <https://builds.apache.org/job/Tuscany-2x-deploy/ws/sca-2x/samples/getting-started/helloworld-webservice/pom.xml,>
MavenProject: org.apache.tuscany.sca.samples:helloworld-withdeps:2.5-SNAPSHOT @ <https://builds.apache.org/job/Tuscany-2x-deploy/ws/sca-2x/samples/getting-started/helloworld-withdeps/pom.xml,>
MavenProject: org.apache.tuscany.sca.samples:tuscany-samples-getting-started:2.5-SNAPSHOT
@ <https://builds.apache.org/job/Tuscany-2x-deploy/ws/sca-2x/samples/getting-started/pom.xml,>
MavenProject: org.apache.tuscany.sca.samples:tuscany-samples-running-tuscany:2.5-SNAPSHOT
@ <https://builds.apache.org/job/Tuscany-2x-deploy/ws/sca-2x/samples/running-tuscany/pom.xml,>
MavenProject: org.apache.tuscany.sca.samples:jse:2.5-SNAPSHOT @ <https://builds.apache.org/job/Tuscany-2x-deploy/ws/sca-2x/samples/running-tuscany/jse/pom.xml,>
MavenProject: org.apache.tuscany.sca.samples:junit:2.5-SNAPSHOT @ <https://builds.apache.org/job/Tuscany-2x-deploy/ws/sca-2x/samples/running-tuscany/junit/pom.xml,>
MavenProject: org.apache.tuscany.sca.samples:sample-async-invocation:2.5-SNAPSHOT @ <https://builds.apache.org/job/Tuscany-2x-deploy/ws/sca-2x/samples/learning-more/async-invocation/pom.xml,>
MavenProject: org.apache.tuscany.sca.samples:tuscany-samples-learning-more:2.5-SNAPSHOT @
<https://builds.apache.org/job/Tuscany-2x-deploy/ws/sca-2x/samples/learning-more/pom.xml,>
MavenProject: org.apache.tuscany.sca.samples:tuscany-samples-binding-websocket:2.5-SNAPSHOT
@ <https://builds.apache.org/job/Tuscany-2x-deploy/ws/sca-2x/samples/learning-more/binding-websocket/pom.xml,>
MavenProject: org.apache.tuscany.sca.samples:sample-binding-websocket-autocomplete-webapp:2.5-SNAPSHOT
@ <https://builds.apache.org/job/Tuscany-2x-deploy/ws/sca-2x/samples/learning-more/binding-websocket/autocomplete-webapp/pom.xml,>
MavenProject: org.apache.tuscany.sca.samples:sample-binding-websocket-weather-webapp:2.5-SNAPSHOT
@ <https://builds.apache.org/job/Tuscany-2x-deploy/ws/sca-2x/samples/learning-more/binding-websocket/weather-webapp/pom.xml,>
MavenProject: org.apache.tuscany.sca.samples:sample-binding-websocket-chat-webapp:2.5-SNAPSHOT
@ <https://builds.apache.org/job/Tuscany-2x-deploy/ws/sca-2x/samples/learning-more/binding-websocket/chat-webapp/pom.xml,>
MavenProject: org.apache.tuscany.sca.samples:sample-binding-websocket-pubsub-webapp:2.5-SNAPSHOT
@ <https://builds.apache.org/job/Tuscany-2x-deploy/ws/sca-2x/samples/learning-more/binding-websocket/pubsub-webapp/pom.xml,>
MavenProject: org.apache.tuscany.sca.samples:sample-contribution-osgi:2.5-SNAPSHOT @ <https://builds.apache.org/job/Tuscany-2x-deploy/ws/sca-2x/samples/learning-more/contribution-osgi/pom.xml,>
MavenProject: org.apache.tuscany.sca.samples:sample-calculator-bundle:2.5-SNAPSHOT @ <https://builds.apache.org/job/Tuscany-2x-deploy/ws/sca-2x/samples/learning-more/distributed-osgi-static/calculator-bundle/pom.xml,>
MavenProject: org.apache.tuscany.sca.samples:sample-operations-bundle:2.5-SNAPSHOT @ <https://builds.apache.org/job/Tuscany-2x-deploy/ws/sca-2x/samples/learning-more/distributed-osgi-static/operations-bundle/pom.xml,>
MavenProject: org.apache.tuscany.sca.samples:tuscany-samples-distributed-osgi-static:2.5-SNAPSHOT
@ <https://builds.apache.org/job/Tuscany-2x-deploy/ws/sca-2x/samples/learning-more/distributed-osgi-static/pom.xml,>
MavenProject: org.apache.tuscany.sca:tuscany-distribution-all:2.5-SNAPSHOT @ <https://builds.apache.org/job/Tuscany-2x-deploy/ws/sca-2x/distribution/all/pom.xml]>
[JENKINS] Archiving disabled
[JENKINS] Archiving disabled
[JENKINS] Archiving disabled
[JENKINS] Archiving disabled
[JENKINS] Archiving disabled
[JENKINS] Archiving disabled
[JENKINS] Archiving disabled
[JENKINS] Archiving disabled
[JENKINS] Archiving disabled
[JENKINS] Archiving disabled
[JENKINS] Archiving disabled
[JENKINS] Archiving disabled
[JENKINS] Archiving disabled
[JENKINS] Archiving disabled
[JENKINS] Archiving disabled
[JENKINS] Archiving disabled
[JENKINS] Archiving disabled
[JENKINS] Archiving disabled
[JENKINS] Archiving disabled
[JENKINS] Archiving disabled
[JENKINS] Archiving disabled
[JENKINS] Archiving disabled
[JENKINS] Archiving disabled
[JENKINS] Archiving disabled
[JENKINS] Archiving disabled
[JENKINS] Archiving disabled
[JENKINS] Archiving disabled
[JENKINS] Archiving disabled
[JENKINS] Archiving disabled
[JENKINS] Archiving disabled
[JENKINS] Archiving disabled
[JENKINS] Archiving disabled
[JENKINS] Archiving disabled
[JENKINS] Archiving disabled
[JENKINS] Archiving disabled
[JENKINS] Archiving disabled
[JENKINS] Archiving disabled
[JENKINS] Archiving disabled
[JENKINS] Archiving disabled
[JENKINS] Archiving disabled
[JENKINS] Archiving disabled
[JENKINS] Archiving disabled
[JENKINS] Archiving disabled
[JENKINS] Archiving disabled
[JENKINS] Archiving disabled
[JENKINS] Archiving disabled
[JENKINS] Archiving disabled
[JENKINS] Archiving disabled
[JENKINS] Archiving disabled
[JENKINS] Archiving disabled
[JENKINS] Archiving disabled
[JENKINS] Archiving disabled
[JENKINS] Archiving disabled
[JENKINS] Archiving disabled
[JENKINS] Archiving disabled
[JENKINS] Archiving disabled
[JENKINS] Archiving disabled
[JENKINS] Archiving disabled
[JENKINS] Archiving disabled
[JENKINS] Archiving disabled
[JENKINS] Archiving disabled
[JENKINS] Archiving disabled
[JENKINS] Archiving disabled
[JENKINS] Archiving disabled
[JENKINS] Archiving disabled
[JENKINS] Archiving disabled
[JENKINS] Archiving disabled
[JENKINS] Archiving disabled
[JENKINS] Archiving disabled
[JENKINS] Archiving disabled
[JENKINS] Archiving disabled
[JENKINS] Archiving disabled
[JENKINS] Archiving disabled
[JENKINS] Archiving disabled
[JENKINS] Archiving disabled
[JENKINS] Archiving disabled
[JENKINS] Archiving disabled
[JENKINS] Archiving disabled
[JENKINS] Archiving disabled
[JENKINS] Archiving disabled
[JENKINS] Archiving disabled
[JENKINS] Archiving disabled
[JENKINS] Archiving disabled
[JENKINS] Archiving disabled
[JENKINS] Archiving disabled
[JENKINS] Archiving disabled
[JENKINS] Archiving disabled
[JENKINS] Archiving disabled
[JENKINS] Archiving disabled
[JENKINS] Archiving disabled
[JENKINS] Archiving disabled
[JENKINS] Archiving disabled
[JENKINS] Archiving disabled
[JENKINS] Archiving disabled
[JENKINS] Archiving disabled
[JENKINS] Archiving disabled
[JENKINS] Archiving disabled
[JENKINS] Archiving disabled
[JENKINS] Archiving disabled
[JENKINS] Archiving disabled
[JENKINS] Archiving disabled
[JENKINS] Archiving disabled
[JENKINS] Archiving disabled
[JENKINS] Archiving disabled
[JENKINS] Archiving disabled
[JENKINS] Archiving disabled
[JENKINS] Archiving disabled
[JENKINS] Archiving disabled
[JENKINS] Archiving disabled
[JENKINS] Archiving disabled
[JENKINS] Archiving disabled
[JENKINS] Archiving disabled
[JENKINS] Archiving disabled
[JENKINS] Archiving disabled
[JENKINS] Archiving disabled
[JENKINS] Archiving disabled
[JENKINS] Archiving disabled
[JENKINS] Archiving disabled
[JENKINS] Archiving disabled
[JENKINS] Archiving disabled
[JENKINS] Archiving disabled
[JENKINS] Archiving disabled
[JENKINS] Archiving disabled
[JENKINS] Archiving disabled
[JENKINS] Archiving disabled
[JENKINS] Archiving disabled
[JENKINS] Archiving disabled
[JENKINS] Archiving disabled
[JENKINS] Archiving disabled
[JENKINS] Archiving disabled
[JENKINS] Archiving disabled
[JENKINS] Archiving disabled
[JENKINS] Archiving disabled
[JENKINS] Archiving disabled
[JENKINS] Archiving disabled
[JENKINS] Archiving disabled
[JENKINS] Archiving disabled
[JENKINS] Archiving disabled
[JENKINS] Archiving disabled
[JENKINS] Archiving disabled
[JENKINS] Archiving disabled
[JENKINS] Archiving disabled
[JENKINS] Archiving disabled
[JENKINS] Archiving disabled
[JENKINS] Archiving disabled
[JENKINS] Archiving disabled
[JENKINS] Archiving disabled
[JENKINS] Archiving disabled
[JENKINS] Archiving disabled
[JENKINS] Archiving disabled
[JENKINS] Archiving disabled
[JENKINS] Archiving disabled
[JENKINS] Archiving disabled
[JENKINS] Archiving disabled
[JENKINS] Archiving disabled
[JENKINS] Archiving disabled
[JENKINS] Archiving disabled
[JENKINS] Archiving disabled
[JENKINS] Archiving disabled
[JENKINS] Archiving disabled
[JENKINS] Archiving disabled
Waiting for Jenkins to finish collecting data
mavenExecutionResult exceptions not empty
message : Failed to execute goal on project tuscany-distribution-all: Could not resolve dependencies
for project org.apache.tuscany.sca:tuscany-distribution-all:pom:2.5-SNAPSHOT: The following
artifacts could not be resolved: org.apache.tuscany.sca.aggregation:tuscany-base-runtime-aggregation:jar:2.5-SNAPSHOT,
org.apache.tuscany.sca.aggregation:tuscany-binding-rmi-runtime-aggregation:jar:2.5-SNAPSHOT,
org.apache.tuscany.sca.aggregation:tuscany-binding-ws-runtime-axis2-aggregation:jar:2.5-SNAPSHOT:
Could not find artifact org.apache.tuscany.sca.aggregation:tuscany-base-runtime-aggregation:jar:2.5-SNAPSHOT
in java.net2 (http://download.java.net/maven/2)
cause : Could not resolve dependencies for project org.apache.tuscany.sca:tuscany-distribution-all:pom:2.5-SNAPSHOT:
The following artifacts could not be resolved: org.apache.tuscany.sca.aggregation:tuscany-base-runtime-aggregation:jar:2.5-SNAPSHOT,
org.apache.tuscany.sca.aggregation:tuscany-binding-rmi-runtime-aggregation:jar:2.5-SNAPSHOT,
org.apache.tuscany.sca.aggregation:tuscany-binding-ws-runtime-axis2-aggregation:jar:2.5-SNAPSHOT:
Could not find artifact org.apache.tuscany.sca.aggregation:tuscany-base-runtime-aggregation:jar:2.5-SNAPSHOT
in java.net2 (http://download.java.net/maven/2)
Stack trace : 
org.apache.maven.lifecycle.LifecycleExecutionException: Failed to execute goal on project
tuscany-distribution-all: Could not resolve dependencies for project org.apache.tuscany.sca:tuscany-distribution-all:pom:2.5-SNAPSHOT:
The following artifacts could not be resolved: org.apache.tuscany.sca.aggregation:tuscany-base-runtime-aggregation:jar:2.5-SNAPSHOT,
org.apache.tuscany.sca.aggregation:tuscany-binding-rmi-runtime-aggregation:jar:2.5-SNAPSHOT,
org.apache.tuscany.sca.aggregation:tuscany-binding-ws-runtime-axis2-aggregation:jar:2.5-SNAPSHOT:
Could not find artifact org.apache.tuscany.sca.aggregation:tuscany-base-runtime-aggregation:jar:2.5-SNAPSHOT
in java.net2 (http://download.java.net/maven/2)
	at org.apache.maven.lifecycle.internal.LifecycleDependencyResolver.getDependencies(LifecycleDependencyResolver.java:196)
	at org.apache.maven.lifecycle.internal.LifecycleDependencyResolver.resolveProjectDependencies(LifecycleDependencyResolver.java:108)
	at org.apache.maven.lifecycle.internal.MojoExecutor.ensureDependenciesAreResolved(MojoExecutor.java:258)
	at org.apache.maven.lifecycle.internal.MojoExecutor.execute(MojoExecutor.java:201)
	at org.apache.maven.lifecycle.internal.MojoExecutor.execute(MojoExecutor.java:153)
	at org.apache.maven.lifecycle.internal.MojoExecutor.execute(MojoExecutor.java:145)
	at org.apache.maven.lifecycle.internal.LifecycleModuleBuilder.buildProject(LifecycleModuleBuilder.java:84)
	at org.apache.maven.lifecycle.internal.LifecycleModuleBuilder.buildProject(LifecycleModuleBuilder.java:59)
	at org.apache.maven.lifecycle.internal.LifecycleStarter.singleThreadedBuild(LifecycleStarter.java:183)
	at org.apache.maven.lifecycle.internal.LifecycleStarter.execute(LifecycleStarter.java:161)
	at org.apache.maven.DefaultMaven.doExecute(DefaultMaven.java:319)
	at org.apache.maven.DefaultMaven.execute(DefaultMaven.java:156)
	at org.jvnet.hudson.maven3.launcher.Maven3Launcher.main(Maven3Launcher.java:79)
	at sun.reflect.NativeMethodAccessorImpl.invoke0(Native Method)
	at sun.reflect.NativeMethodAccessorImpl.invoke(NativeMethodAccessorImpl.java:39)
	at sun.reflect.DelegatingMethodAccessorImpl.invoke(DelegatingMethodAccessorImpl.java:25)
	at java.lang.reflect.Method.invoke(Method.java:597)
	at org.codehaus.plexus.classworlds.launcher.Launcher.launchStandard(Launcher.java:329)
	at org.codehaus.plexus.classworlds.launcher.Launcher.launch(Launcher.java:239)
	at org.jvnet.hudson.maven3.agent.Maven3Main.launch(Maven3Main.java:158)
	at hudson.maven.Maven3Builder.call(Maven3Builder.java:98)
	at hudson.maven.Maven3Builder.call(Maven3Builder.java:64)
	at hudson.remoting.UserRequest.perform(UserRequest.java:118)
	at hudson.remoting.UserRequest.perform(UserRequest.java:48)
	at hudson.remoting.Request$2.run(Request.java:326)
	at hudson.remoting.InterceptingExecutorService$1.call(InterceptingExecutorService.java:72)
	at java.util.concurrent.FutureTask$Sync.innerRun(FutureTask.java:303)
	at java.util.concurrent.FutureTask.run(FutureTask.java:138)
	at java.util.concurrent.ThreadPoolExecutor$Worker.runTask(ThreadPoolExecutor.java:886)
	at java.util.concurrent.ThreadPoolExecutor$Worker.run(ThreadPoolExecutor.java:908)
	at java.lang.Thread.run(Thread.java:662)
Caused by: org.apache.maven.project.DependencyResolutionException: Could not resolve dependencies
for project org.apache.tuscany.sca:tuscany-distribution-all:pom:2.5-SNAPSHOT: The following
artifacts could not be resolved: org.apache.tuscany.sca.aggregation:tuscany-base-runtime-aggregation:jar:2.5-SNAPSHOT,
org.apache.tuscany.sca.aggregation:tuscany-binding-rmi-runtime-aggregation:jar:2.5-SNAPSHOT,
org.apache.tuscany.sca.aggregation:tuscany-binding-ws-runtime-axis2-aggregation:jar:2.5-SNAPSHOT:
Could not find artifact org.apache.tuscany.sca.aggregation:tuscany-base-runtime-aggregation:jar:2.5-SNAPSHOT
in java.net2 (http://download.java.net/maven/2)
	at org.apache.maven.project.DefaultProjectDependenciesResolver.resolve(DefaultProjectDependenciesResolver.java:170)
	at org.apache.maven.lifecycle.internal.LifecycleDependencyResolver.getDependencies(LifecycleDependencyResolver.java:171)
	... 30 more
Caused by: org.sonatype.aether.resolution.DependencyResolutionException: The following artifacts
could not be resolved: org.apache.tuscany.sca.aggregation:tuscany-base-runtime-aggregation:jar:2.5-SNAPSHOT,
org.apache.tuscany.sca.aggregation:tuscany-binding-rmi-runtime-aggregation:jar:2.5-SNAPSHOT,
org.apache.tuscany.sca.aggregation:tuscany-binding-ws-runtime-axis2-aggregation:jar:2.5-SNAPSHOT:
Could not find artifact org.apache.tuscany.sca.aggregation:tuscany-base-runtime-aggregation:jar:2.5-SNAPSHOT
in java.net2 (http://download.java.net/maven/2)
	at org.sonatype.aether.impl.internal.DefaultRepositorySystem.resolveDependencies(DefaultRepositorySystem.java:412)
	at org.apache.maven.project.DefaultProjectDependenciesResolver.resolve(DefaultProjectDependenciesResolver.java:164)
	... 31 more
Caused by: org.sonatype.aether.resolution.ArtifactResolutionException: The following artifacts
could not be resolved: org.apache.tuscany.sca.aggregation:tuscany-base-runtime-aggregation:jar:2.5-SNAPSHOT,
org.apache.tuscany.sca.aggregation:tuscany-binding-rmi-runtime-aggregation:jar:2.5-SNAPSHOT,
org.apache.tuscany.sca.aggregation:tuscany-binding-ws-runtime-axis2-aggregation:jar:2.5-SNAPSHOT:
Could not find artifact org.apache.tuscany.sca.aggregation:tuscany-base-runtime-aggregation:jar:2.5-SNAPSHOT
in java.net2 (http://download.java.net/maven/2)
	at org.sonatype.aether.impl.internal.DefaultArtifactResolver.resolve(DefaultArtifactResolver.java:541)
	at org.sonatype.aether.impl.internal.DefaultArtifactResolver.resolveArtifacts(DefaultArtifactResolver.java:220)
	at org.sonatype.aether.impl.internal.DefaultRepositorySystem.resolveDependencies(DefaultRepositorySystem.java:395)
	... 32 more
Caused by: org.sonatype.aether.transfer.ArtifactNotFoundException: Could not find artifact
org.apache.tuscany.sca.aggregation:tuscany-base-runtime-aggregation:jar:2.5-SNAPSHOT in java.net2
(http://download.java.net/maven/2)
	at org.sonatype.aether.connector.wagon.WagonRepositoryConnector$4.wrap(WagonRepositoryConnector.java:945)
	at org.sonatype.aether.connector.wagon.WagonRepositoryConnector$4.wrap(WagonRepositoryConnector.java:940)
	at org.sonatype.aether.connector.wagon.WagonRepositoryConnector$GetTask.flush(WagonRepositoryConnector.java:695)
	at org.sonatype.aether.connector.wagon.WagonRepositoryConnector$GetTask.flush(WagonRepositoryConnector.java:689)
	at org.sonatype.aether.connector.wagon.WagonRepositoryConnector.get(WagonRepositoryConnector.java:445)
	at org.sonatype.aether.impl.internal.DefaultArtifactResolver.resolve(DefaultArtifactResolver.java:460)
	... 34 more
channel stopped
2012-12-03 00:47:10.846:INFO::Shutdown hook executing
2012-12-03 00:47:10.846:INFO::Shutdown hook complete

Mime
View raw message