tuscany-commits mailing list archives

Site index · List index
Message view « Date » · « Thread »
Top « Date » · « Thread »
From Apache Jenkins Server <jenk...@builds.apache.org>
Subject Build failed in Jenkins: Tuscany-2x-deploy #1009
Date Tue, 11 Dec 2012 01:56:20 GMT
See <https://builds.apache.org/job/Tuscany-2x-deploy/1009/>

------------------------------------------
[...truncated 23809 lines...]
[INFO] [build-helper:add-test-source {execution: add-test-source}]
[INFO] Test Source directory: <https://builds.apache.org/job/Tuscany-2x-deploy/ws/sca-2x/modules/databinding-jaxb-axiom/target/jaxb-source>
added.
[INFO] [remote-resources:process {execution: default}]
[INFO] [resources:resources {execution: default-resources}]
[INFO] Using 'UTF-8' encoding to copy filtered resources.
[INFO] Copying 1 resource
[INFO] Copying 3 resources
[INFO] Copying 3 resources
[INFO] [compiler:compile {execution: default-compile}]
[INFO] Compiling 10 source files to <https://builds.apache.org/job/Tuscany-2x-deploy/ws/sca-2x/modules/databinding-jaxb-axiom/target/classes>
[INFO] [jaxb2:generate {execution: generate-jaxb}]
[INFO] [resources:testResources {execution: default-testResources}]
[INFO] Using 'UTF-8' encoding to copy filtered resources.
[INFO] Copying 1 resource
[INFO] Copying 3 resources
[INFO] [compiler:testCompile {execution: default-testCompile}]
[INFO] Compiling 10 source files to <https://builds.apache.org/job/Tuscany-2x-deploy/ws/sca-2x/modules/databinding-jaxb-axiom/target/test-classes>
[INFO] [surefire:test {execution: default-test}]
[INFO] Tests are skipped.
[INFO] [jar:jar {execution: default-jar}]
[INFO] Building jar: <https://builds.apache.org/job/Tuscany-2x-deploy/ws/sca-2x/modules/databinding-jaxb-axiom/target/tuscany-databinding-jaxb-axiom-2.5-SNAPSHOT.jar>
[INFO] [source:jar-no-fork {execution: attach-sources}]
[INFO] Building jar: <https://builds.apache.org/job/Tuscany-2x-deploy/ws/sca-2x/modules/databinding-jaxb-axiom/target/tuscany-databinding-jaxb-axiom-2.5-SNAPSHOT-sources.jar>
[INFO] [install:install {execution: default-install}]
[INFO] Installing <https://builds.apache.org/job/Tuscany-2x-deploy/ws/sca-2x/modules/databinding-jaxb-axiom/target/tuscany-databinding-jaxb-axiom-2.5-SNAPSHOT.jar>
to <https://builds.apache.org/job/Tuscany-2x-deploy/ws/.repository/org/apache/tuscany/sca/tuscany-databinding-jaxb-axiom/2.5-SNAPSHOT/tuscany-databinding-jaxb-axiom-2.5-SNAPSHOT.jar>
[INFO] Installing <https://builds.apache.org/job/Tuscany-2x-deploy/ws/sca-2x/modules/databinding-jaxb-axiom/target/tuscany-databinding-jaxb-axiom-2.5-SNAPSHOT-sources.jar>
to <https://builds.apache.org/job/Tuscany-2x-deploy/ws/.repository/org/apache/tuscany/sca/tuscany-databinding-jaxb-axiom/2.5-SNAPSHOT/tuscany-databinding-jaxb-axiom-2.5-SNAPSHOT-sources.jar>
[INFO] [deploy:deploy {execution: default-deploy}]
[INFO] Retrieving previous build number from apache.snapshots.https
[WARNING] *** CHECKSUM FAILED - Checksum failed on download: local = '582a30c2a92f96142a15a6e92e044167734d0f5a';
remote = '31e8c4422d21fe34b5f3b11aab69e90a49d6caa4' - RETRYING
[WARNING] *** CHECKSUM FAILED - Checksum failed on download: local = '582a30c2a92f96142a15a6e92e044167734d0f5a';
remote = '31e8c4422d21fe34b5f3b11aab69e90a49d6caa4' - IGNORING
Uploading: https://repository.apache.org/content/repositories/snapshots/org/apache/tuscany/sca/tuscany-databinding-jaxb-axiom/2.5-SNAPSHOT/tuscany-databinding-jaxb-axiom-2.5-SNAPSHOT.jar
38K uploaded  (tuscany-databinding-jaxb-axiom-2.5-SNAPSHOT.jar)
[INFO] Uploading project information for tuscany-databinding-jaxb-axiom 2.5-SNAPSHOT
[INFO] Retrieving previous metadata from apache.snapshots.https
[WARNING] *** CHECKSUM FAILED - Checksum failed on download: local = '582a30c2a92f96142a15a6e92e044167734d0f5a';
remote = '31e8c4422d21fe34b5f3b11aab69e90a49d6caa4' - RETRYING
[WARNING] *** CHECKSUM FAILED - Checksum failed on download: local = '582a30c2a92f96142a15a6e92e044167734d0f5a';
remote = '31e8c4422d21fe34b5f3b11aab69e90a49d6caa4' - IGNORING
[INFO] Uploading repository metadata for: 'snapshot org.apache.tuscany.sca:tuscany-databinding-jaxb-axiom:2.5-SNAPSHOT'
[INFO] Retrieving previous metadata from apache.snapshots.https
[INFO] Uploading repository metadata for: 'artifact org.apache.tuscany.sca:tuscany-databinding-jaxb-axiom'
[INFO] Retrieving previous build number from apache.snapshots.https
Uploading: https://repository.apache.org/content/repositories/snapshots/org/apache/tuscany/sca/tuscany-databinding-jaxb-axiom/2.5-SNAPSHOT/tuscany-databinding-jaxb-axiom-2.5-SNAPSHOT-sources.jar
36K uploaded  (tuscany-databinding-jaxb-axiom-2.5-SNAPSHOT-sources.jar)
[JENKINS] Archiving disabled
[INFO] ------------------------------------------------------------------------
[INFO] Building Apache Tuscany SCA Axis2-1.5-based WS Binding Runtime
[INFO]    task-segment: [clean, deploy]
[INFO] ------------------------------------------------------------------------
[INFO] [clean:clean {execution: default-clean}]
Downloading: http://svn.apache.org/repos/asf/tuscany/maven/org/apache/apache/8/apache-8.pom
[INFO] Unable to find resource 'org.apache:apache:pom:8' in repository tuscany.repo (http://svn.apache.org/repos/asf/tuscany/maven)
Downloading: https://repository.apache.org/content/groups/public//org/apache/apache/8/apache-8.pom

Downloading: http://svn.apache.org/repos/asf/tuscany/maven/org/apache/axis2/org.apache.axis2.osgi/1.5.3/org.apache.axis2.osgi-1.5.3.pom
[INFO] Unable to find resource 'org.apache.axis2:org.apache.axis2.osgi:pom:1.5.3' in repository
tuscany.repo (http://svn.apache.org/repos/asf/tuscany/maven)
Downloading: https://repository.apache.org/content/groups/public//org/apache/axis2/org.apache.axis2.osgi/1.5.3/org.apache.axis2.osgi-1.5.3.pom

Downloading: http://svn.apache.org/repos/asf/tuscany/maven/org/apache/axis2/axis2-parent/1.5.3/axis2-parent-1.5.3.pom
[INFO] Unable to find resource 'org.apache.axis2:axis2-parent:pom:1.5.3' in repository tuscany.repo
(http://svn.apache.org/repos/asf/tuscany/maven)
Downloading: https://repository.apache.org/content/groups/public//org/apache/axis2/axis2-parent/1.5.3/axis2-parent-1.5.3.pom

Downloading: http://svn.apache.org/repos/asf/tuscany/maven/org/apache/rampart/rampart-core/1.5.1/rampart-core-1.5.1.pom
[INFO] Unable to find resource 'org.apache.rampart:rampart-core:pom:1.5.1' in repository tuscany.repo
(http://svn.apache.org/repos/asf/tuscany/maven)
Downloading: https://repository.apache.org/content/groups/public//org/apache/rampart/rampart-core/1.5.1/rampart-core-1.5.1.pom

Downloading: http://svn.apache.org/repos/asf/tuscany/maven/org/apache/rampart/rampart-project/1.5.1/rampart-project-1.5.1.pom
[INFO] Unable to find resource 'org.apache.rampart:rampart-project:pom:1.5.1' in repository
tuscany.repo (http://svn.apache.org/repos/asf/tuscany/maven)
Downloading: https://repository.apache.org/content/groups/public//org/apache/rampart/rampart-project/1.5.1/rampart-project-1.5.1.pom

Downloading: http://svn.apache.org/repos/asf/tuscany/maven/org/apache/rampart/rampart-policy/1.5.1/rampart-policy-1.5.1.pom
[INFO] Unable to find resource 'org.apache.rampart:rampart-policy:pom:1.5.1' in repository
tuscany.repo (http://svn.apache.org/repos/asf/tuscany/maven)
Downloading: https://repository.apache.org/content/groups/public//org/apache/rampart/rampart-policy/1.5.1/rampart-policy-1.5.1.pom

Downloading: http://svn.apache.org/repos/asf/tuscany/maven/org/apache/axis2/mex/1.5.4/mex-1.5.4.pom
[INFO] Unable to find resource 'org.apache.axis2:mex:pom:1.5.4' in repository tuscany.repo
(http://svn.apache.org/repos/asf/tuscany/maven)
Downloading: https://repository.apache.org/content/groups/public//org/apache/axis2/mex/1.5.4/mex-1.5.4.pom

Downloading: http://svn.apache.org/repos/asf/tuscany/maven/org/apache/axis2/axis2-parent/1.5.4/axis2-parent-1.5.4.pom
[INFO] Unable to find resource 'org.apache.axis2:axis2-parent:pom:1.5.4' in repository tuscany.repo
(http://svn.apache.org/repos/asf/tuscany/maven)
Downloading: https://repository.apache.org/content/groups/public//org/apache/axis2/axis2-parent/1.5.4/axis2-parent-1.5.4.pom

Downloading: http://svn.apache.org/repos/asf/tuscany/maven/org/apache/axis2/axis2-mtompolicy/1.5.4/axis2-mtompolicy-1.5.4.pom
[INFO] Unable to find resource 'org.apache.axis2:axis2-mtompolicy:pom:1.5.4' in repository
tuscany.repo (http://svn.apache.org/repos/asf/tuscany/maven)
Downloading: https://repository.apache.org/content/groups/public//org/apache/axis2/axis2-mtompolicy/1.5.4/axis2-mtompolicy-1.5.4.pom

Downloading: http://svn.apache.org/repos/asf/tuscany/maven/org/apache/ws/commons/axiom/axiom-dom/1.2.10/axiom-dom-1.2.10.pom
[INFO] Unable to find resource 'org.apache.ws.commons.axiom:axiom-dom:pom:1.2.10' in repository
tuscany.repo (http://svn.apache.org/repos/asf/tuscany/maven)
Downloading: https://repository.apache.org/content/groups/public//org/apache/ws/commons/axiom/axiom-dom/1.2.10/axiom-dom-1.2.10.pom

Downloading: http://svn.apache.org/repos/asf/tuscany/maven/org/apache/ws/security/wss4j/1.5.10/wss4j-1.5.10.pom
[INFO] Unable to find resource 'org.apache.ws.security:wss4j:pom:1.5.10' in repository tuscany.repo
(http://svn.apache.org/repos/asf/tuscany/maven)
Downloading: https://repository.apache.org/content/groups/public//org/apache/ws/security/wss4j/1.5.10/wss4j-1.5.10.pom
[INFO] Unable to find resource 'org.apache.ws.security:wss4j:pom:1.5.10' in repository apache.nexus
(https://repository.apache.org/content/groups/public/)
Downloading: http://shibboleth.internet2.edu/downloads/maven2//org/apache/ws/security/wss4j/1.5.10/wss4j-1.5.10.pom

[WARNING] *** CHECKSUM FAILED - Checksum failed on download: local = 'affd78577c56997305dbbf64fcff88186ee59d6c';
remote = '<!DOCTYPE' - RETRYING
Downloading: http://shibboleth.internet2.edu/downloads/maven2//org/apache/ws/security/wss4j/1.5.10/wss4j-1.5.10.pom

[WARNING] *** CHECKSUM FAILED - Checksum failed on download: local = 'affd78577c56997305dbbf64fcff88186ee59d6c';
remote = '<!DOCTYPE' - IGNORING
[WARNING] POM for 'org.apache.ws.security:wss4j:pom:1.5.10:compile' is invalid.

Its dependencies (if any) will NOT be available to the current build.
Downloading: http://svn.apache.org/repos/asf/tuscany/maven/org/opensaml/opensaml/2.2.3/opensaml-2.2.3.pom
[INFO] Unable to find resource 'org.opensaml:opensaml:pom:2.2.3' in repository tuscany.repo
(http://svn.apache.org/repos/asf/tuscany/maven)
Downloading: https://repository.apache.org/content/groups/public//org/opensaml/opensaml/2.2.3/opensaml-2.2.3.pom
[INFO] Unable to find resource 'org.opensaml:opensaml:pom:2.2.3' in repository apache.nexus
(https://repository.apache.org/content/groups/public/)
Downloading: http://shibboleth.internet2.edu/downloads/maven2//org/opensaml/opensaml/2.2.3/opensaml-2.2.3.pom

[WARNING] *** CHECKSUM FAILED - Checksum failed on download: local = 'affd78577c56997305dbbf64fcff88186ee59d6c';
remote = '<!DOCTYPE' - RETRYING
Downloading: http://shibboleth.internet2.edu/downloads/maven2//org/opensaml/opensaml/2.2.3/opensaml-2.2.3.pom

[WARNING] *** CHECKSUM FAILED - Checksum failed on download: local = 'affd78577c56997305dbbf64fcff88186ee59d6c';
remote = '<!DOCTYPE' - IGNORING
[WARNING] POM for 'org.opensaml:opensaml:pom:2.2.3:compile' is invalid.

Its dependencies (if any) will NOT be available to the current build.
Downloading: http://svn.apache.org/repos/asf/tuscany/maven/org/apache/rampart/rampart-trust/1.5.1/rampart-trust-1.5.1.pom
[INFO] Unable to find resource 'org.apache.rampart:rampart-trust:pom:1.5.1' in repository
tuscany.repo (http://svn.apache.org/repos/asf/tuscany/maven)
Downloading: https://repository.apache.org/content/groups/public//org/apache/rampart/rampart-trust/1.5.1/rampart-trust-1.5.1.pom

Downloading: http://svn.apache.org/repos/asf/tuscany/maven/org/apache/santuario/xmlsec/1.4.4/xmlsec-1.4.4.pom
[INFO] Unable to find resource 'org.apache.santuario:xmlsec:pom:1.4.4' in repository tuscany.repo
(http://svn.apache.org/repos/asf/tuscany/maven)
Downloading: https://repository.apache.org/content/groups/public//org/apache/santuario/xmlsec/1.4.4/xmlsec-1.4.4.pom

Downloading: http://svn.apache.org/repos/asf/tuscany/maven/org/opensaml/opensaml/2.4.1/opensaml-2.4.1.pom
[INFO] Unable to find resource 'org.opensaml:opensaml:pom:2.4.1' in repository tuscany.repo
(http://svn.apache.org/repos/asf/tuscany/maven)
Downloading: https://repository.apache.org/content/groups/public//org/opensaml/opensaml/2.4.1/opensaml-2.4.1.pom
[INFO] Unable to find resource 'org.opensaml:opensaml:pom:2.4.1' in repository apache.nexus
(https://repository.apache.org/content/groups/public/)
Downloading: http://repo1.maven.org/maven2/org/opensaml/opensaml/2.4.1/opensaml-2.4.1.pom
17K downloaded  (opensaml-2.4.1.pom)
Downloading: http://svn.apache.org/repos/asf/tuscany/maven/org/opensaml/openws/1.4.1/openws-1.4.1.pom
[INFO] Unable to find resource 'org.opensaml:openws:pom:1.4.1' in repository tuscany.repo
(http://svn.apache.org/repos/asf/tuscany/maven)
Downloading: https://repository.apache.org/content/groups/public//org/opensaml/openws/1.4.1/openws-1.4.1.pom
[INFO] Unable to find resource 'org.opensaml:openws:pom:1.4.1' in repository apache.nexus
(https://repository.apache.org/content/groups/public/)
Downloading: http://repo1.maven.org/maven2/org/opensaml/openws/1.4.1/openws-1.4.1.pom
18K downloaded  (openws-1.4.1.pom)
Downloading: http://svn.apache.org/repos/asf/tuscany/maven/org/opensaml/xmltooling/1.3.1/xmltooling-1.3.1.pom
[INFO] Unable to find resource 'org.opensaml:xmltooling:pom:1.3.1' in repository tuscany.repo
(http://svn.apache.org/repos/asf/tuscany/maven)
Downloading: https://repository.apache.org/content/groups/public//org/opensaml/xmltooling/1.3.1/xmltooling-1.3.1.pom
[INFO] Unable to find resource 'org.opensaml:xmltooling:pom:1.3.1' in repository apache.nexus
(https://repository.apache.org/content/groups/public/)
Downloading: http://repo1.maven.org/maven2/org/opensaml/xmltooling/1.3.1/xmltooling-1.3.1.pom
17K downloaded  (xmltooling-1.3.1.pom)
Downloading: http://svn.apache.org/repos/asf/tuscany/maven/org/apache/ws/security/wss4j/1.5.10/wss4j-1.5.10.jar
Downloading: http://svn.apache.org/repos/asf/tuscany/maven/org/apache/santuario/xmlsec/1.4.4/xmlsec-1.4.4.jar
Downloading: http://svn.apache.org/repos/asf/tuscany/maven/org/apache/rampart/rampart-core/1.5.1/rampart-core-1.5.1.jar
Downloading: http://svn.apache.org/repos/asf/tuscany/maven/org/apache/axis2/org.apache.axis2.osgi/1.5.3/org.apache.axis2.osgi-1.5.3.jar
[INFO] Unable to find resource 'org.apache.santuario:xmlsec:jar:1.4.4' in repository tuscany.repo
(http://svn.apache.org/repos/asf/tuscany/maven)
[INFO] Unable to find resource 'org.apache.rampart:rampart-core:jar:1.5.1' in repository tuscany.repo
(http://svn.apache.org/repos/asf/tuscany/maven)
[INFO] Unable to find resource 'org.apache.axis2:org.apache.axis2.osgi:jar:1.5.3' in repository
tuscany.repo (http://svn.apache.org/repos/asf/tuscany/maven)
[INFO] Unable to find resource 'org.apache.ws.security:wss4j:jar:1.5.10' in repository tuscany.repo
(http://svn.apache.org/repos/asf/tuscany/maven)
Downloading: https://repository.apache.org/content/groups/public//org/apache/santuario/xmlsec/1.4.4/xmlsec-1.4.4.jar
Downloading: https://repository.apache.org/content/groups/public//org/apache/ws/security/wss4j/1.5.10/wss4j-1.5.10.jar
Downloading: https://repository.apache.org/content/groups/public//org/apache/axis2/org.apache.axis2.osgi/1.5.3/org.apache.axis2.osgi-1.5.3.jar
Downloading: https://repository.apache.org/content/groups/public//org/apache/rampart/rampart-core/1.5.1/rampart-core-1.5.1.jar
Downloading: http://svn.apache.org/repos/asf/tuscany/maven/xml-apis/xml-apis/1.3.04/xml-apis-1.3.04.jar
[INFO] Unable to find resource 'xml-apis:xml-apis:jar:1.3.04' in repository tuscany.repo (http://svn.apache.org/repos/asf/tuscany/maven)
Downloading: https://repository.apache.org/content/groups/public//xml-apis/xml-apis/1.3.04/xml-apis-1.3.04.jar
[INFO] Unable to find resource 'org.apache.ws.security:wss4j:jar:1.5.10' in repository apache.nexus
(https://repository.apache.org/content/groups/public/)
Downloading: http://shibboleth.internet2.edu/downloads/maven2//org/apache/ws/security/wss4j/1.5.10/wss4j-1.5.10.jar
[INFO] Unable to find resource 'xml-apis:xml-apis:jar:1.3.04' in repository apache.nexus (https://repository.apache.org/content/groups/public/)
Downloading: http://repo1.maven.org/maven2/xml-apis/xml-apis/1.3.04/xml-apis-1.3.04.jar
189K downloaded  (xml-apis-1.3.04.jar)

Downloading: http://svn.apache.org/repos/asf/tuscany/maven/org/opensaml/opensaml/2.4.1/opensaml-2.4.1.jar
[INFO] Unable to find resource 'org.opensaml:opensaml:jar:2.4.1' in repository tuscany.repo
(http://svn.apache.org/repos/asf/tuscany/maven)
Downloading: https://repository.apache.org/content/groups/public//org/opensaml/opensaml/2.4.1/opensaml-2.4.1.jar
[WARNING] *** CHECKSUM FAILED - Checksum failed on download: local = 'affd78577c56997305dbbf64fcff88186ee59d6c';
remote = '<!DOCTYPE' - RETRYING
Downloading: http://shibboleth.internet2.edu/downloads/maven2//org/apache/ws/security/wss4j/1.5.10/wss4j-1.5.10.jar
157K downloaded  (rampart-core-1.5.1.jar)
[INFO] Unable to find resource 'org.opensaml:opensaml:jar:2.4.1' in repository apache.nexus
(https://repository.apache.org/content/groups/public/)
Downloading: http://repo1.maven.org/maven2/org/opensaml/opensaml/2.4.1/opensaml-2.4.1.jar
1259K downloaded  (opensaml-2.4.1.jar)

Downloading: http://svn.apache.org/repos/asf/tuscany/maven/org/opensaml/openws/1.4.1/openws-1.4.1.jar
Downloading: http://svn.apache.org/repos/asf/tuscany/maven/commons-codec/commons-codec/1.2/commons-codec-1.2.jar
[INFO] Unable to find resource 'org.opensaml:openws:jar:1.4.1' in repository tuscany.repo
(http://svn.apache.org/repos/asf/tuscany/maven)
Downloading: https://repository.apache.org/content/groups/public//org/opensaml/openws/1.4.1/openws-1.4.1.jar
[INFO] Unable to find resource 'commons-codec:commons-codec:jar:1.2' in repository tuscany.repo
(http://svn.apache.org/repos/asf/tuscany/maven)
Downloading: https://repository.apache.org/content/groups/public//commons-codec/commons-codec/1.2/commons-codec-1.2.jar
[WARNING] *** CHECKSUM FAILED - Checksum failed on download: local = 'affd78577c56997305dbbf64fcff88186ee59d6c';
remote = '<!DOCTYPE' - IGNORING
Downloading: http://svn.apache.org/repos/asf/tuscany/maven/org/apache/rampart/rampart-policy/1.5.1/rampart-policy-1.5.1.jar
[INFO] Unable to find resource 'org.apache.rampart:rampart-policy:jar:1.5.1' in repository
tuscany.repo (http://svn.apache.org/repos/asf/tuscany/maven)
Downloading: https://repository.apache.org/content/groups/public//org/apache/rampart/rampart-policy/1.5.1/rampart-policy-1.5.1.jar
[INFO] Unable to find resource 'org.opensaml:openws:jar:1.4.1' in repository apache.nexus
(https://repository.apache.org/content/groups/public/)
Downloading: http://repo1.maven.org/maven2/org/opensaml/openws/1.4.1/openws-1.4.1.jar
[INFO] Unable to find resource 'commons-codec:commons-codec:jar:1.2' in repository apache.nexus
(https://repository.apache.org/content/groups/public/)
Downloading: http://repo1.maven.org/maven2/commons-codec/commons-codec/1.2/commons-codec-1.2.jar
29K downloaded  (commons-codec-1.2.jar)
Downloading: http://svn.apache.org/repos/asf/tuscany/maven/org/apache/ws/commons/axiom/axiom-dom/1.2.10/axiom-dom-1.2.10.jar
551K downloaded  (openws-1.4.1.jar)
[INFO] Unable to find resource 'org.apache.ws.commons.axiom:axiom-dom:jar:1.2.10' in repository
tuscany.repo (http://svn.apache.org/repos/asf/tuscany/maven)
Downloading: https://repository.apache.org/content/groups/public//org/apache/ws/commons/axiom/axiom-dom/1.2.10/axiom-dom-1.2.10.jar
Downloading: http://svn.apache.org/repos/asf/tuscany/maven/org/opensaml/xmltooling/1.3.1/xmltooling-1.3.1.jar
[INFO] Unable to find resource 'org.opensaml:xmltooling:jar:1.3.1' in repository tuscany.repo
(http://svn.apache.org/repos/asf/tuscany/maven)
Downloading: https://repository.apache.org/content/groups/public//org/opensaml/xmltooling/1.3.1/xmltooling-1.3.1.jar
439K downloaded  (xmlsec-1.4.4.jar)
[INFO] Unable to find resource 'org.opensaml:xmltooling:jar:1.3.1' in repository apache.nexus
(https://repository.apache.org/content/groups/public/)
Downloading: http://repo1.maven.org/maven2/org/opensaml/xmltooling/1.3.1/xmltooling-1.3.1.jar
596K downloaded  (xmltooling-1.3.1.jar)
156K downloaded  (rampart-policy-1.5.1.jar)
155K downloaded  (axiom-dom-1.2.10.jar)
Downloading: http://svn.apache.org/repos/asf/tuscany/maven/org/apache/rampart/rampart-trust/1.5.1/rampart-trust-1.5.1.jar
[INFO] Unable to find resource 'org.apache.rampart:rampart-trust:jar:1.5.1' in repository
tuscany.repo (http://svn.apache.org/repos/asf/tuscany/maven)
Downloading: https://repository.apache.org/content/groups/public//org/apache/rampart/rampart-trust/1.5.1/rampart-trust-1.5.1.jar
107K downloaded  (rampart-trust-1.5.1.jar)
1909K downloaded  (org.apache.axis2.osgi-1.5.3.jar)
Downloading: http://svn.apache.org/repos/asf/tuscany/maven/org/apache/axis2/mex/1.5.4/mex-1.5.4-impl.jar
[INFO] Unable to find resource 'org.apache.axis2:mex:jar:impl:1.5.4' in repository tuscany.repo
(http://svn.apache.org/repos/asf/tuscany/maven)
Downloading: https://repository.apache.org/content/groups/public//org/apache/axis2/mex/1.5.4/mex-1.5.4-impl.jar
37K downloaded  (mex-1.5.4-impl.jar)
Downloading: http://svn.apache.org/repos/asf/tuscany/maven/org/apache/axis2/axis2-mtompolicy/1.5.4/axis2-mtompolicy-1.5.4.jar
[INFO] Unable to find resource 'org.apache.axis2:axis2-mtompolicy:jar:1.5.4' in repository
tuscany.repo (http://svn.apache.org/repos/asf/tuscany/maven)
Downloading: https://repository.apache.org/content/groups/public//org/apache/axis2/axis2-mtompolicy/1.5.4/axis2-mtompolicy-1.5.4.jar
17K downloaded  (axis2-mtompolicy-1.5.4.jar)
[INFO] [enforcer:enforce {execution: enforce-plugin-versions}]
[INFO] [remote-resources:process {execution: default}]
[WARNING] POM for 'org.apache.ws.security:wss4j:pom:1.5.10:compile' is invalid.

Its dependencies (if any) will NOT be available to the current build.
[WARNING] POM for 'org.opensaml:opensaml:pom:2.2.3:compile' is invalid.

Its dependencies (if any) will NOT be available to the current build.
[WARNING] Invalid project model for artifact [wss4j:org.apache.ws.security:1.5.10]. It will
be ignored by the remote resources Mojo.
[INFO] [resources:resources {execution: default-resources}]
[INFO] Using 'UTF-8' encoding to copy filtered resources.
[INFO] Copying 6 resources
[INFO] Copying 3 resources
[INFO] Copying 3 resources
[INFO] [compiler:compile {execution: default-compile}]
[INFO] Compiling 29 source files to <https://builds.apache.org/job/Tuscany-2x-deploy/ws/sca-2x/modules/binding-ws-runtime-axis2/target/classes>
[INFO] -------------------------------------------------------------
[ERROR] COMPILATION ERROR : 
[INFO] -------------------------------------------------------------
[ERROR] error: error reading <https://builds.apache.org/job/Tuscany-2x-deploy/ws/.repository/org/apache/ws/security/wss4j/1.5.10/wss4j-1.5.10.jar;>
error in opening zip file
[INFO] 1error
[INFO] -------------------------------------------------------------
[JENKINS] Archiving disabled
[INFO] ------------------------------------------------------------------------
[ERROR] BUILD FAILURE
[INFO] ------------------------------------------------------------------------
[INFO] Compilation failure
error: error reading <https://builds.apache.org/job/Tuscany-2x-deploy/ws/.repository/org/apache/ws/security/wss4j/1.5.10/wss4j-1.5.10.jar;>
error in opening zip file

[INFO] ------------------------------------------------------------------------
[INFO] For more information, run Maven with the -e switch
[INFO] ------------------------------------------------------------------------
[INFO] Total time: 64 minutes 
[INFO] Finished at: Tue Dec 11 01:56:10 GMT+00:00 2012
[INFO] Final Memory: 407M/703M
[INFO] ------------------------------------------------------------------------
channel stopped

Mime
View raw message