tuscany-notification mailing list archives

Site index · List index
Message view « Date » · « Thread »
Top « Date » · « Thread »
From Apache Jenkins Server <jenk...@builds.apache.org>
Subject Build failed in Jenkins: Tuscany-2x #1106
Date Wed, 07 Aug 2013 20:47:45 GMT
See <https://builds.apache.org/job/Tuscany-2x/1106/>

------------------------------------------
[...truncated 101651 lines...]
Aug 7, 2013 8:47:25 PM org.apache.tuscany.sca.core.assembly.impl.DomainRegistryImpl removeEndpoint
INFO: Remove endpoint - binding.sca - TEST_BWS_5001Component1/Service1
Aug 7, 2013 8:47:25 PM org.apache.tuscany.sca.core.assembly.impl.DomainRegistryImpl removeEndpoint
INFO: Remove endpoint - binding.ws - http://67.195.138.58:8080/TEST_BWS_5001Component1/Reference1
Aug 7, 2013 8:47:25 PM org.apache.tuscany.sca.http.jetty.JettyServer removeServletMapping
INFO: Removed Servlet mapping: /TEST_BWS_5001Component1/Reference1
Aug 7, 2013 8:47:25 PM org.apache.tuscany.sca.core.assembly.impl.DomainRegistryImpl removeEndpoint
INFO: Remove endpoint - binding.sca - TEST_BWS_5001Component1/TestComposite54TestComponent1/Service1
Aug 7, 2013 8:47:25 PM org.apache.tuscany.sca.core.assembly.impl.DomainRegistryImpl removeEndpoint
INFO: Remove endpoint - binding.sca - TEST_BWS_5001Component1/TestComposite54TestComponent1/reference1
Tests run: 1, Failures: 0, Errors: 0, Skipped: 0, Time elapsed: 0.364 sec
Running client_bws.BWS_4001_TestCase
Implementation language set to: _Java
Aug 7, 2013 8:47:25 PM org.apache.tuscany.sca.node.impl.NodeImpl start
INFO: Starting node: http://tuscany.apache.org/sca/1.1/nodes/default0 domain: default
Aug 7, 2013 8:47:25 PM org.apache.tuscany.sca.node.impl.NodeFactoryImpl loadContributions
INFO: Loading contribution: <https://builds.apache.org/job/Tuscany-2x/ws/sca-2x/testing/compliance-tests/binding-ws/target/oasis-contributions/BWS_General/target/BWS_General.zip>
Aug 7, 2013 8:47:26 PM org.apache.tuscany.sca.node.impl.NodeFactoryImpl loadContributions
INFO: Loading contribution: <https://builds.apache.org/job/Tuscany-2x/ws/sca-2x/testing/compliance-tests/binding-ws/target/oasis-contributions/BWS_General_Java/target/BWS_General_Java.zip>
Aug 7, 2013 8:47:26 PM org.apache.tuscany.sca.core.assembly.impl.DomainRegistryImpl addEndpoint
INFO: Add endpoint - binding.sca - TestClient/TestClient_0002TestClient/TestInvocation
Aug 7, 2013 8:47:26 PM org.apache.tuscany.sca.http.jetty.JettyLogger info
INFO: jetty-6.1.19
Aug 7, 2013 8:47:26 PM org.apache.tuscany.sca.http.jetty.JettyLogger info
INFO: Started SelectChannelConnector@0.0.0.0:8080
Aug 7, 2013 8:47:26 PM org.apache.tuscany.sca.http.jetty.JettyServer addServletMapping
INFO: Added Servlet mapping: http://67.195.138.58:8080/TestClient/TestInvocation
Aug 7, 2013 8:47:26 PM org.apache.tuscany.sca.core.assembly.impl.DomainRegistryImpl addEndpoint
INFO: Add endpoint - binding.ws - http://67.195.138.58:8080/TestClient/TestInvocation
Aug 7, 2013 8:47:26 PM org.apache.tuscany.sca.core.assembly.impl.DomainRegistryImpl addEndpoint
INFO: Add endpoint - binding.sca - TEST_BWS_4001Component1/TestComposite1Component1/Service1
Aug 7, 2013 8:47:26 PM org.apache.tuscany.sca.core.assembly.impl.DomainRegistryImpl addEndpoint
INFO: Add endpoint - binding.sca - TEST_BWS_4001Component1/Service1
Test BWS_4001 completed successfully
Aug 7, 2013 8:47:26 PM org.apache.tuscany.sca.node.impl.NodeImpl stop
INFO: Stopping node: http://tuscany.apache.org/sca/1.1/nodes/default0
Aug 7, 2013 8:47:26 PM org.apache.tuscany.sca.core.assembly.impl.DomainRegistryImpl removeEndpoint
INFO: Remove endpoint - binding.ws - http://67.195.138.58:8080/TestClient/TestInvocation
Aug 7, 2013 8:47:26 PM org.apache.tuscany.sca.http.jetty.JettyServer removeServletMapping
INFO: Removed Servlet mapping: /TestClient/TestInvocation
Aug 7, 2013 8:47:26 PM org.apache.tuscany.sca.core.assembly.impl.DomainRegistryImpl removeEndpoint
INFO: Remove endpoint - binding.sca - TestClient/TestClient_0002TestClient/TestInvocation
Aug 7, 2013 8:47:26 PM org.apache.tuscany.sca.core.assembly.impl.DomainRegistryImpl removeEndpoint
INFO: Remove endpoint - binding.sca - TEST_BWS_4001Component1/Service1
Aug 7, 2013 8:47:26 PM org.apache.tuscany.sca.core.assembly.impl.DomainRegistryImpl removeEndpoint
INFO: Remove endpoint - binding.sca - TEST_BWS_4001Component1/TestComposite1Component1/Service1
Tests run: 1, Failures: 0, Errors: 0, Skipped: 0, Time elapsed: 0.259 sec
Running client_bws.BWS_5006_TestCase
Implementation language set to: _Java
Aug 7, 2013 8:47:26 PM org.apache.tuscany.sca.node.impl.NodeImpl start
INFO: Starting node: http://tuscany.apache.org/sca/1.1/nodes/default0 domain: default
Aug 7, 2013 8:47:26 PM org.apache.tuscany.sca.node.impl.NodeFactoryImpl loadContributions
INFO: Loading contribution: <https://builds.apache.org/job/Tuscany-2x/ws/sca-2x/testing/compliance-tests/binding-ws/target/oasis-contributions/BWS_General/target/BWS_General.zip>
Aug 7, 2013 8:47:26 PM org.apache.tuscany.sca.node.impl.NodeFactoryImpl loadContributions
INFO: Loading contribution: <https://builds.apache.org/job/Tuscany-2x/ws/sca-2x/testing/compliance-tests/binding-ws/target/oasis-contributions/BWS_General_Java/target/BWS_General_Java.zip>
Aug 7, 2013 8:47:26 PM org.apache.tuscany.sca.core.assembly.impl.DomainRegistryImpl addEndpoint
INFO: Add endpoint - binding.sca - TEST_BWS_5006Component1/TestComposite55TestComponent1/Service5
Aug 7, 2013 8:47:26 PM org.apache.tuscany.sca.http.jetty.JettyLogger info
INFO: jetty-6.1.19
Aug 7, 2013 8:47:26 PM org.apache.tuscany.sca.http.jetty.JettyLogger info
INFO: Started SelectChannelConnector@0.0.0.0:8080
Aug 7, 2013 8:47:26 PM org.apache.tuscany.sca.http.jetty.JettyServer addServletMapping
INFO: Added Servlet mapping: http://67.195.138.58:8080/TEST_BWS_5006Component1/Service1
Aug 7, 2013 8:47:26 PM org.apache.tuscany.sca.core.assembly.impl.DomainRegistryImpl addEndpoint
INFO: Add endpoint - binding.ws - http://67.195.138.58:8080/TEST_BWS_5006Component1/Service1
>>> Starting external JAXWS service at: http://localhost:9081/JAXWS/Service5Callback
Service5 client - call address is: http://localhost:8080/TEST_BWS_5006Component1/Service1
wsa:To address found: http://localhost:9081/JAXWS/Service5Callback
wsa:Action value found: http://test.sca.oasisopen.org/TEST_BWS_5006Component1/Service1/Service5Callback/callback1Request
test:SCAProps value found: 1dce8693-d5d3-495d-b8d0-14f36a9b5890
Test BWS_5006 completed successfully
Aug 7, 2013 8:47:26 PM org.apache.tuscany.sca.node.impl.NodeImpl stop
INFO: Stopping node: http://tuscany.apache.org/sca/1.1/nodes/default0
Aug 7, 2013 8:47:26 PM org.apache.tuscany.sca.core.assembly.impl.DomainRegistryImpl removeEndpoint
INFO: Remove endpoint - binding.ws - http://67.195.138.58:8080/TEST_BWS_5006Component1/Service1
Aug 7, 2013 8:47:26 PM org.apache.tuscany.sca.http.jetty.JettyServer removeServletMapping
INFO: Removed Servlet mapping: /TEST_BWS_5006Component1/Service1
Aug 7, 2013 8:47:26 PM org.apache.tuscany.sca.core.assembly.impl.DomainRegistryImpl removeEndpoint
INFO: Remove endpoint - binding.sca - TEST_BWS_5006Component1/TestComposite55TestComponent1/Service5
Tests run: 1, Failures: 0, Errors: 0, Skipped: 0, Time elapsed: 0.281 sec
Running client_bws.BWS_4005_TestCase
Implementation language set to: _Java
Aug 7, 2013 8:47:26 PM org.apache.tuscany.sca.node.impl.NodeImpl start
INFO: Starting node: http://tuscany.apache.org/sca/1.1/nodes/default0 domain: default
Aug 7, 2013 8:47:26 PM org.apache.tuscany.sca.node.impl.NodeFactoryImpl loadContributions
INFO: Loading contribution: <https://builds.apache.org/job/Tuscany-2x/ws/sca-2x/testing/compliance-tests/binding-ws/target/oasis-contributions/BWS_General/target/BWS_General.zip>
Aug 7, 2013 8:47:26 PM org.apache.tuscany.sca.node.impl.NodeFactoryImpl loadContributions
INFO: Loading contribution: <https://builds.apache.org/job/Tuscany-2x/ws/sca-2x/testing/compliance-tests/binding-ws/target/oasis-contributions/BWS_General_Java/target/BWS_General_Java.zip>
Aug 7, 2013 8:47:26 PM org.apache.tuscany.sca.core.assembly.impl.DomainRegistryImpl addEndpoint
INFO: Add endpoint - binding.sca - TestClient/TestClient_0002TestClient/TestInvocation
Aug 7, 2013 8:47:26 PM org.apache.tuscany.sca.http.jetty.JettyLogger info
INFO: jetty-6.1.19
Aug 7, 2013 8:47:26 PM org.apache.tuscany.sca.http.jetty.JettyLogger info
INFO: Started SelectChannelConnector@0.0.0.0:8080
Aug 7, 2013 8:47:26 PM org.apache.tuscany.sca.http.jetty.JettyServer addServletMapping
INFO: Added Servlet mapping: http://67.195.138.58:8080/TestClient/TestInvocation
Aug 7, 2013 8:47:26 PM org.apache.tuscany.sca.core.assembly.impl.DomainRegistryImpl addEndpoint
INFO: Add endpoint - binding.ws - http://67.195.138.58:8080/TestClient/TestInvocation
Aug 7, 2013 8:47:26 PM org.apache.tuscany.sca.core.assembly.impl.DomainRegistryImpl addEndpoint
INFO: Add endpoint - binding.sca - TEST_BWS_4005Component1/Composite4Component1/Service1
Aug 7, 2013 8:47:26 PM org.apache.tuscany.sca.core.assembly.impl.DomainRegistryImpl addEndpoint
INFO: Add endpoint - binding.sca - TEST_BWS_4005Component1/Service1
>>> Starting external JAXWS service at: http://localhost:9081/JAXWS/Service1
Test BWS_4005 completed successfully
Aug 7, 2013 8:47:26 PM org.apache.tuscany.sca.node.impl.NodeImpl stop
INFO: Stopping node: http://tuscany.apache.org/sca/1.1/nodes/default0
Aug 7, 2013 8:47:26 PM org.apache.tuscany.sca.core.assembly.impl.DomainRegistryImpl removeEndpoint
INFO: Remove endpoint - binding.ws - http://67.195.138.58:8080/TestClient/TestInvocation
Aug 7, 2013 8:47:26 PM org.apache.tuscany.sca.http.jetty.JettyServer removeServletMapping
INFO: Removed Servlet mapping: /TestClient/TestInvocation
Aug 7, 2013 8:47:26 PM org.apache.tuscany.sca.core.assembly.impl.DomainRegistryImpl removeEndpoint
INFO: Remove endpoint - binding.sca - TestClient/TestClient_0002TestClient/TestInvocation
Aug 7, 2013 8:47:26 PM org.apache.tuscany.sca.core.assembly.impl.DomainRegistryImpl removeEndpoint
INFO: Remove endpoint - binding.sca - TEST_BWS_4005Component1/Service1
Aug 7, 2013 8:47:26 PM org.apache.tuscany.sca.core.assembly.impl.DomainRegistryImpl removeEndpoint
INFO: Remove endpoint - binding.sca - TEST_BWS_4005Component1/Composite4Component1/Service1
Tests run: 1, Failures: 0, Errors: 0, Skipped: 0, Time elapsed: 0.279 sec

Results :

Tests run: 37, Failures: 0, Errors: 0, Skipped: 0

[JENKINS] Recording test results
[INFO] [jar:jar {execution: default-jar}]
[INFO] Building jar: <https://builds.apache.org/job/Tuscany-2x/ws/sca-2x/testing/compliance-tests/binding-ws/target/tuscany-compliance-test-binding-ws.jar>
[INFO] [install:install {execution: default-install}]
[INFO] Installing <https://builds.apache.org/job/Tuscany-2x/ws/sca-2x/testing/compliance-tests/binding-ws/target/tuscany-compliance-test-binding-ws.jar>
to <https://builds.apache.org/job/Tuscany-2x/ws/.repository/org/apache/tuscany/sca/tuscany-compliance-test-binding-ws/2.5-SNAPSHOT/tuscany-compliance-test-binding-ws-2.5-SNAPSHOT.jar>
[JENKINS] Archiving disabled
[INFO] ------------------------------------------------------------------------
[INFO] Building Apache Tuscany SCA Specification Compliance Tests Binding JMS
[INFO]    task-segment: [clean, install]
[INFO] ------------------------------------------------------------------------
[INFO] [clean:clean {execution: default-clean}]
[INFO] snapshot org.apache.tuscany.sca:tuscany-otests-sca-jms-tests:2.0-SNAPSHOT: checking
for updates from oasis.contributions
[INFO] snapshot org.apache.tuscany.sca:tuscany-otests-sca-jms-tests:2.0-SNAPSHOT: checking
for updates from apache.snapshots
[INFO] snapshot org.apache.tuscany.sca:tuscany-otests-sca-jms-tests:2.0-SNAPSHOT: checking
for updates from apache.nexus
Downloading: http://svn.apache.org/repos/asf/tuscany/maven/org/apache/tuscany/sca/tuscany-otests-sca-jms-tests/2.0-SNAPSHOT/tuscany-otests-sca-jms-tests-2.0-SNAPSHOT.pom
1K downloaded  (tuscany-otests-sca-jms-tests-2.0-SNAPSHOT.pom)
[WARNING] *** CHECKSUM FAILED - Error retrieving checksum file for org/apache/tuscany/sca/tuscany-otests-sca-jms-tests/2.0-SNAPSHOT/tuscany-otests-sca-jms-tests-2.0-SNAPSHOT.pom
- IGNORING
[INFO] snapshot org.apache.tuscany.sca:tuscany-base-runtime:2.0-SNAPSHOT: checking for updates
from oasis.contributions
[INFO] snapshot org.apache.tuscany.sca:tuscany-base-runtime:2.0-SNAPSHOT: checking for updates
from apache.snapshots
[INFO] snapshot org.apache.tuscany.sca:tuscany-base-runtime:2.0-SNAPSHOT: checking for updates
from apache.nexus
Downloading: https://repository.apache.org/content/groups/public//org/apache/tuscany/sca/tuscany-base-runtime/2.0-SNAPSHOT/tuscany-base-runtime-2.0-20120722.002354-261.pom

[INFO] snapshot org.apache.tuscany.sca:tuscany-binding-jms-runtime:2.0-SNAPSHOT: checking
for updates from oasis.contributions
[INFO] snapshot org.apache.tuscany.sca:tuscany-binding-jms-runtime:2.0-SNAPSHOT: checking
for updates from apache.snapshots
[INFO] snapshot org.apache.tuscany.sca:tuscany-binding-jms-runtime:2.0-SNAPSHOT: checking
for updates from apache.nexus
Downloading: https://repository.apache.org/content/groups/public//org/apache/tuscany/sca/tuscany-binding-jms-runtime/2.0-SNAPSHOT/tuscany-binding-jms-runtime-2.0-20120722.002602-258.pom

Downloading: http://svn.apache.org/repos/asf/tuscany/maven/org/apache/activemq/activemq-all/5.2.0/activemq-all-5.2.0.pom
[INFO] Unable to find resource 'org.apache.activemq:activemq-all:pom:5.2.0' in repository
oasis.contributions (http://svn.apache.org/repos/asf/tuscany/maven)
Downloading: http://repository.apache.org/snapshots/org/apache/activemq/activemq-all/5.2.0/activemq-all-5.2.0.pom
[INFO] Unable to find resource 'org.apache.activemq:activemq-all:pom:5.2.0' in repository
apache.snapshots (http://repository.apache.org/snapshots)
Downloading: http://svn.apache.org/repos/asf/tuscany/maven/org/apache/activemq/activemq-all/5.2.0/activemq-all-5.2.0.pom
[INFO] Unable to find resource 'org.apache.activemq:activemq-all:pom:5.2.0' in repository
tuscany.repo (http://svn.apache.org/repos/asf/tuscany/maven)
Downloading: https://repository.apache.org/content/groups/public//org/apache/activemq/activemq-all/5.2.0/activemq-all-5.2.0.pom

Downloading: http://svn.apache.org/repos/asf/tuscany/maven/org/apache/activemq/activemq-all/5.2.0/activemq-all-5.2.0.jar
Downloading: http://svn.apache.org/repos/asf/tuscany/maven/org/apache/ws/security/wss4j/1.5.10/wss4j-1.5.10.jar
Downloading: http://svn.apache.org/repos/asf/tuscany/maven/org/apache/tuscany/sca/tuscany-otests-sca-jms-tests/2.0-SNAPSHOT/tuscany-otests-sca-jms-tests-2.0-SNAPSHOT.jar
[INFO] Unable to find resource 'org.apache.activemq:activemq-all:jar:5.2.0' in repository
oasis.contributions (http://svn.apache.org/repos/asf/tuscany/maven)
Downloading: http://repository.apache.org/snapshots/org/apache/activemq/activemq-all/5.2.0/activemq-all-5.2.0.jar
[INFO] Unable to find resource 'org.apache.ws.security:wss4j:jar:1.5.10' in repository oasis.contributions
(http://svn.apache.org/repos/asf/tuscany/maven)
Downloading: http://repository.apache.org/snapshots/org/apache/ws/security/wss4j/1.5.10/wss4j-1.5.10.jar
[INFO] Unable to find resource 'org.apache.activemq:activemq-all:jar:5.2.0' in repository
apache.snapshots (http://repository.apache.org/snapshots)
Downloading: http://svn.apache.org/repos/asf/tuscany/maven/org/apache/activemq/activemq-all/5.2.0/activemq-all-5.2.0.jar
[INFO] Unable to find resource 'org.apache.ws.security:wss4j:jar:1.5.10' in repository apache.snapshots
(http://repository.apache.org/snapshots)
Downloading: http://svn.apache.org/repos/asf/tuscany/maven/org/apache/ws/security/wss4j/1.5.10/wss4j-1.5.10.jar
[INFO] Unable to find resource 'org.apache.activemq:activemq-all:jar:5.2.0' in repository
tuscany.repo (http://svn.apache.org/repos/asf/tuscany/maven)
Downloading: https://repository.apache.org/content/groups/public//org/apache/activemq/activemq-all/5.2.0/activemq-all-5.2.0.jar
[INFO] Unable to find resource 'org.apache.ws.security:wss4j:jar:1.5.10' in repository tuscany.repo
(http://svn.apache.org/repos/asf/tuscany/maven)
Downloading: https://repository.apache.org/content/groups/public//org/apache/ws/security/wss4j/1.5.10/wss4j-1.5.10.jar

[INFO] Unable to find resource 'org.apache.ws.security:wss4j:jar:1.5.10' in repository apache.nexus
(https://repository.apache.org/content/groups/public/)
Downloading: http://shibboleth.internet2.edu/downloads/maven2//org/apache/ws/security/wss4j/1.5.10/wss4j-1.5.10.jar
[WARNING] *** CHECKSUM FAILED - Error retrieving checksum file for org/apache/tuscany/sca/tuscany-otests-sca-jms-tests/2.0-SNAPSHOT/tuscany-otests-sca-jms-tests-2.0-SNAPSHOT.jar
- IGNORING
Downloading: https://repository.apache.org/content/groups/public//org/apache/tuscany/sca/tuscany-base-runtime/2.0-SNAPSHOT/tuscany-base-runtime-2.0-20120722.002354-261.jar

[WARNING] *** CHECKSUM FAILED - Checksum failed on download: local = '420712511a1e1b9978e59a2cbbff75a911180f95';
remote = '<!DOCTYPE' - RETRYING
Downloading: http://shibboleth.internet2.edu/downloads/maven2//org/apache/ws/security/wss4j/1.5.10/wss4j-1.5.10.jar

[WARNING] *** CHECKSUM FAILED - Checksum failed on download: local = '420712511a1e1b9978e59a2cbbff75a911180f95';
remote = '<!DOCTYPE' - IGNORING
2485K downloaded  (tuscany-base-runtime-2.0-20120722.002354-261.jar)
Downloading: https://repository.apache.org/content/groups/public//org/apache/tuscany/sca/tuscany-binding-ws-runtime-axis2/2.0-SNAPSHOT/tuscany-binding-ws-runtime-axis2-2.0-20120722.002715-258.jar
2569K downloaded  (activemq-all-5.2.0.jar)
108K downloaded  (tuscany-binding-ws-runtime-axis2-2.0-20120722.002715-258.jar)
Downloading: https://repository.apache.org/content/groups/public//org/apache/tuscany/sca/tuscany-policy-wspolicy/2.0-SNAPSHOT/tuscany-policy-wspolicy-2.0-20120722.002657-258.jar
21K downloaded  (tuscany-policy-wspolicy-2.0-20120722.002657-258.jar)
Downloading: https://repository.apache.org/content/groups/public//org/apache/tuscany/sca/tuscany-databinding-axiom/2.0-SNAPSHOT/tuscany-databinding-axiom-2.0-20120722.002703-258.jar
35K downloaded  (tuscany-databinding-axiom-2.0-20120722.002703-258.jar)
Downloading: https://repository.apache.org/content/groups/public//org/apache/tuscany/sca/tuscany-databinding-jaxb-axiom/2.0-SNAPSHOT/tuscany-databinding-jaxb-axiom-2.0-20120722.002708-258.jar
38K downloaded  (tuscany-databinding-jaxb-axiom-2.0-20120722.002708-258.jar)
[INFO] [enforcer:enforce {execution: enforce-plugin-versions}]
[INFO] [remote-resources:process {execution: default}]
[WARNING] Invalid project model for artifact [wss4j:org.apache.ws.security:1.5.10]. It will
be ignored by the remote resources Mojo.
[INFO] [resources:resources {execution: default-resources}]
[INFO] Using 'UTF-8' encoding to copy filtered resources.
[INFO] skip non existing resourceDirectory <https://builds.apache.org/job/Tuscany-2x/ws/sca-2x/testing/compliance-tests/binding-jms/src/main/resources>
[INFO] Copying 0 resource
[INFO] Copying 3 resources
[INFO] [compiler:compile {execution: default-compile}]
[INFO] No sources to compile
[INFO] [dependency:unpack {execution: unpack}]
[INFO] Configured Artifact: org.apache.tuscany.sca:oasis-jms-contributions:2.0-SNAPSHOT:zip
[INFO] snapshot org.apache.tuscany.sca:oasis-jms-contributions:2.0-SNAPSHOT: checking for
updates from oasis.contributions
[INFO] snapshot org.apache.tuscany.sca:oasis-jms-contributions:2.0-SNAPSHOT: checking for
updates from apache.snapshots
[INFO] snapshot org.apache.tuscany.sca:oasis-jms-contributions:2.0-SNAPSHOT: checking for
updates from apache.nexus
Downloading: http://svn.apache.org/repos/asf/tuscany/maven/org/apache/tuscany/sca/oasis-jms-contributions/2.0-SNAPSHOT/oasis-jms-contributions-2.0-SNAPSHOT.zip

[WARNING] *** CHECKSUM FAILED - Error retrieving checksum file for org/apache/tuscany/sca/oasis-jms-contributions/2.0-SNAPSHOT/oasis-jms-contributions-2.0-SNAPSHOT.zip
- IGNORING
[INFO] Configured Artifact: org.apache.tuscany.sca:tuscany-otests-sca-jms-tests:2.0-SNAPSHOT:jar
Downloading: http://svn.apache.org/repos/asf/tuscany/maven/org/apache/tuscany/sca/tuscany-otests-sca-jms-tests/2.0-SNAPSHOT/tuscany-otests-sca-jms-tests-2.0-SNAPSHOT.jar
[INFO] Unpacking <https://builds.apache.org/job/Tuscany-2x/ws/.repository/org/apache/tuscany/sca/oasis-jms-contributions/2.0-SNAPSHOT/oasis-jms-contributions-2.0-SNAPSHOT.zip>
to
  <https://builds.apache.org/job/Tuscany-2x/ws/sca-2x/testing/compliance-tests/binding-jms/target/oasis-contributions>
   with includes null and excludes:null
[INFO] Unpacking <https://builds.apache.org/job/Tuscany-2x/ws/.repository/org/apache/tuscany/sca/tuscany-otests-sca-jms-tests/2.0-SNAPSHOT/tuscany-otests-sca-jms-tests-2.0-SNAPSHOT.jar>
to
  <https://builds.apache.org/job/Tuscany-2x/ws/sca-2x/testing/compliance-tests/binding-jms/target/test-classes>
   with includes null and excludes:commons-logging.properties,oasis-sca-tests.properties,tuscany-oasis-sca-tests-errors.properties
[INFO] [resources:testResources {execution: default-testResources}]
[INFO] Using 'UTF-8' encoding to copy filtered resources.
[INFO] Copying 3 resources
[INFO] Copying 3 resources
[INFO] [compiler:testCompile {execution: default-testCompile}]
[INFO] Compiling 1 source file to <https://builds.apache.org/job/Tuscany-2x/ws/sca-2x/testing/compliance-tests/binding-jms/target/test-classes>
[INFO] -------------------------------------------------------------
[ERROR] COMPILATION ERROR : 
[INFO] -------------------------------------------------------------
[ERROR] error: error reading <https://builds.apache.org/job/Tuscany-2x/ws/.repository/org/apache/ws/security/wss4j/1.5.10/wss4j-1.5.10.jar;>
error in opening zip file
[INFO] 1error
[INFO] -------------------------------------------------------------
[JENKINS] Archiving disabled
[INFO] ------------------------------------------------------------------------
[ERROR] BUILD FAILURE
[INFO] ------------------------------------------------------------------------
[INFO] Compilation failure
error: error reading <https://builds.apache.org/job/Tuscany-2x/ws/.repository/org/apache/ws/security/wss4j/1.5.10/wss4j-1.5.10.jar;>
error in opening zip file

[INFO] ------------------------------------------------------------------------
[INFO] For more information, run Maven with the -e switch
[INFO] ------------------------------------------------------------------------
[INFO] Total time: 62 minutes 46 seconds
[INFO] Finished at: Wed Aug 07 20:47:39 UTC 2013
[INFO] Final Memory: 1019M/1916M
[INFO] ------------------------------------------------------------------------
Maven failed with error.
Sending e-mails to: notification@tuscany.apache.org
channel stopped
2013-08-07 20:47:42.465:INFO::Shutdown hook executing
2013-08-07 20:47:42.465:INFO::Shutdown hook complete

Mime
View raw message