tuscany-notification mailing list archives

Site index · List index
Message view « Date » · « Thread »
Top « Date » · « Thread »
From Apache Jenkins Server <jenk...@builds.apache.org>
Subject Build failed in Jenkins: Tuscany-2x » Apache Tuscany SCA Specification Compliance Tests Binding JMS #1109
Date Sat, 10 Aug 2013 19:53:31 GMT
See <https://builds.apache.org/job/Tuscany-2x/org.apache.tuscany.sca$tuscany-compliance-test-binding-jms/1109/>

------------------------------------------
[INFO] ------------------------------------------------------------------------
[INFO] Building Apache Tuscany SCA Specification Compliance Tests Binding JMS
[INFO]    task-segment: [clean, install]
[INFO] ------------------------------------------------------------------------
[INFO] [clean:clean {execution: default-clean}]
[INFO] snapshot org.apache.tuscany.sca:tuscany-otests-sca-jms-tests:2.0-SNAPSHOT: checking
for updates from oasis.contributions
[INFO] snapshot org.apache.tuscany.sca:tuscany-otests-sca-jms-tests:2.0-SNAPSHOT: checking
for updates from apache.snapshots
[INFO] snapshot org.apache.tuscany.sca:tuscany-otests-sca-jms-tests:2.0-SNAPSHOT: checking
for updates from apache.nexus
Downloading: http://svn.apache.org/repos/asf/tuscany/maven/org/apache/tuscany/sca/tuscany-otests-sca-jms-tests/2.0-SNAPSHOT/tuscany-otests-sca-jms-tests-2.0-SNAPSHOT.pom
[INFO] snapshot org.apache.tuscany.sca:tuscany-base-runtime:2.0-SNAPSHOT: checking for updates
from oasis.contributions
[INFO] snapshot org.apache.tuscany.sca:tuscany-base-runtime:2.0-SNAPSHOT: checking for updates
from apache.snapshots
[INFO] snapshot org.apache.tuscany.sca:tuscany-base-runtime:2.0-SNAPSHOT: checking for updates
from apache.nexus
[INFO] snapshot org.apache.tuscany.sca:tuscany-binding-jms-runtime:2.0-SNAPSHOT: checking
for updates from oasis.contributions
[INFO] snapshot org.apache.tuscany.sca:tuscany-binding-jms-runtime:2.0-SNAPSHOT: checking
for updates from apache.snapshots
[INFO] snapshot org.apache.tuscany.sca:tuscany-binding-jms-runtime:2.0-SNAPSHOT: checking
for updates from apache.nexus
Downloading: http://svn.apache.org/repos/asf/tuscany/maven/org/apache/tuscany/sca/tuscany-otests-sca-jms-tests/2.0-SNAPSHOT/tuscany-otests-sca-jms-tests-2.0-SNAPSHOT.jar
[INFO] [enforcer:enforce {execution: enforce-plugin-versions}]
[INFO] [remote-resources:process {execution: default}]
[WARNING] Invalid project model for artifact [wss4j:org.apache.ws.security:1.5.10]. It will
be ignored by the remote resources Mojo.
[INFO] [resources:resources {execution: default-resources}]
[INFO] Using 'UTF-8' encoding to copy filtered resources.
[INFO] skip non existing resourceDirectory <https://builds.apache.org/job/Tuscany-2x/org.apache.tuscany.sca$tuscany-compliance-test-binding-jms/ws/src/main/resources>
[INFO] Copying 0 resource
[INFO] Copying 3 resources
[INFO] [compiler:compile {execution: default-compile}]
[INFO] No sources to compile
[INFO] [dependency:unpack {execution: unpack}]
[INFO] Configured Artifact: org.apache.tuscany.sca:oasis-jms-contributions:2.0-SNAPSHOT:zip
[INFO] snapshot org.apache.tuscany.sca:oasis-jms-contributions:2.0-SNAPSHOT: checking for
updates from oasis.contributions
[INFO] snapshot org.apache.tuscany.sca:oasis-jms-contributions:2.0-SNAPSHOT: checking for
updates from apache.snapshots
[INFO] snapshot org.apache.tuscany.sca:oasis-jms-contributions:2.0-SNAPSHOT: checking for
updates from apache.nexus
Downloading: http://svn.apache.org/repos/asf/tuscany/maven/org/apache/tuscany/sca/oasis-jms-contributions/2.0-SNAPSHOT/oasis-jms-contributions-2.0-SNAPSHOT.zip
[INFO] Configured Artifact: org.apache.tuscany.sca:tuscany-otests-sca-jms-tests:2.0-SNAPSHOT:jar
Downloading: http://svn.apache.org/repos/asf/tuscany/maven/org/apache/tuscany/sca/tuscany-otests-sca-jms-tests/2.0-SNAPSHOT/tuscany-otests-sca-jms-tests-2.0-SNAPSHOT.jar
[INFO] Unpacking /home/jenkins/jenkins-slave/workspace/Tuscany-2x/.repository/org/apache/tuscany/sca/oasis-jms-contributions/2.0-SNAPSHOT/oasis-jms-contributions-2.0-SNAPSHOT.zip
to
  <https://builds.apache.org/job/Tuscany-2x/org.apache.tuscany.sca$tuscany-compliance-test-binding-jms/ws/target/oasis-contributions>
   with includes null and excludes:null
[INFO] Unpacking /home/jenkins/jenkins-slave/workspace/Tuscany-2x/.repository/org/apache/tuscany/sca/tuscany-otests-sca-jms-tests/2.0-SNAPSHOT/tuscany-otests-sca-jms-tests-2.0-SNAPSHOT.jar
to
  <https://builds.apache.org/job/Tuscany-2x/org.apache.tuscany.sca$tuscany-compliance-test-binding-jms/ws/target/test-classes>
   with includes null and excludes:commons-logging.properties,oasis-sca-tests.properties,tuscany-oasis-sca-tests-errors.properties
[INFO] [resources:testResources {execution: default-testResources}]
[INFO] Using 'UTF-8' encoding to copy filtered resources.
[INFO] Copying 3 resources
[INFO] Copying 3 resources
[INFO] [compiler:testCompile {execution: default-testCompile}]
[INFO] Compiling 1 source file to <https://builds.apache.org/job/Tuscany-2x/org.apache.tuscany.sca$tuscany-compliance-test-binding-jms/ws/target/test-classes>
[INFO] -------------------------------------------------------------
[ERROR] COMPILATION ERROR : 
[INFO] -------------------------------------------------------------
[ERROR] error: error reading /home/jenkins/jenkins-slave/workspace/Tuscany-2x/.repository/org/apache/ws/security/wss4j/1.5.10/wss4j-1.5.10.jar;
error in opening zip file
[INFO] 1error
[INFO] -------------------------------------------------------------
[JENKINS] Archiving disabled
[INFO] ------------------------------------------------------------------------
[ERROR] BUILD FAILURE
[INFO] ------------------------------------------------------------------------
[INFO] Compilation failure
error: error reading /home/jenkins/jenkins-slave/workspace/Tuscany-2x/.repository/org/apache/ws/security/wss4j/1.5.10/wss4j-1.5.10.jar;
error in opening zip file

[INFO] ------------------------------------------------------------------------
[INFO] For more information, run Maven with the -e switch
[INFO] ------------------------------------------------------------------------
[INFO] Total time: 46 minutes 36 seconds
[INFO] Finished at: Sat Aug 10 19:53:29 UTC 2013
[INFO] Final Memory: 993M/1792M
[INFO] ------------------------------------------------------------------------
Maven failed with error.

Mime
View raw message