tuscany-notification mailing list archives

Site index · List index
Message view « Date » · « Thread »
Top « Date » · « Thread »
From Apache Jenkins Server <jenk...@builds.apache.org>
Subject Build failed in Jenkins: Tuscany-2x #1101
Date Fri, 02 Aug 2013 21:24:58 GMT
See <https://builds.apache.org/job/Tuscany-2x/1101/>

------------------------------------------
[...truncated 94652 lines...]
	... 29 more
Test BWS_2016 completed successfully
Aug 2, 2013 9:24:42 PM org.apache.tuscany.sca.node.impl.NodeImpl stop
INFO: Stopping node: http://tuscany.apache.org/sca/1.1/nodes/default0
Aug 2, 2013 9:24:42 PM org.apache.tuscany.sca.node.impl.NodeImpl stop
INFO: Stopping node: http://tuscany.apache.org/sca/1.1/nodes/default0
Tests run: 1, Failures: 0, Errors: 0, Skipped: 0, Time elapsed: 0.551 sec
Running client_bws.BWS_5001_TestCase
Implementation language set to: _Java
Aug 2, 2013 9:24:42 PM org.apache.tuscany.sca.node.impl.NodeImpl start
INFO: Starting node: http://tuscany.apache.org/sca/1.1/nodes/default0 domain: default
Aug 2, 2013 9:24:42 PM org.apache.tuscany.sca.node.impl.NodeFactoryImpl loadContributions
INFO: Loading contribution: <https://builds.apache.org/job/Tuscany-2x/ws/sca-2x/testing/compliance-tests/binding-ws/target/oasis-contributions/BWS_General/target/BWS_General.zip>
Aug 2, 2013 9:24:42 PM org.apache.tuscany.sca.node.impl.NodeFactoryImpl loadContributions
INFO: Loading contribution: <https://builds.apache.org/job/Tuscany-2x/ws/sca-2x/testing/compliance-tests/binding-ws/target/oasis-contributions/BWS_General_Java/target/BWS_General_Java.zip>
Aug 2, 2013 9:24:42 PM org.apache.tuscany.sca.core.assembly.impl.DomainRegistryImpl addEndpoint
INFO: Add endpoint - binding.sca - TestClient/TestClient_0002TestClient/TestInvocation
Aug 2, 2013 9:24:42 PM org.apache.tuscany.sca.http.jetty.JettyLogger info
INFO: jetty-6.1.19
Aug 2, 2013 9:24:42 PM org.apache.tuscany.sca.http.jetty.JettyLogger info
INFO: Started SelectChannelConnector@0.0.0.0:8080
Aug 2, 2013 9:24:42 PM org.apache.tuscany.sca.http.jetty.JettyServer addServletMapping
INFO: Added Servlet mapping: http://67.195.138.58:8080/TestClient/TestInvocation
Aug 2, 2013 9:24:42 PM org.apache.tuscany.sca.core.assembly.impl.DomainRegistryImpl addEndpoint
INFO: Add endpoint - binding.ws - http://67.195.138.58:8080/TestClient/TestInvocation
Aug 2, 2013 9:24:42 PM org.apache.tuscany.sca.core.assembly.impl.DomainRegistryImpl addEndpoint
INFO: Add endpoint - binding.sca - TEST_BWS_5001Component1/TestComposite54TestComponent1/Service1
Aug 2, 2013 9:24:42 PM org.apache.tuscany.sca.core.assembly.impl.DomainRegistryImpl addEndpoint
INFO: Add endpoint - binding.sca - TEST_BWS_5001Component1/TestComposite54TestComponent1/reference1
Aug 2, 2013 9:24:42 PM org.apache.tuscany.sca.core.assembly.impl.DomainRegistryImpl addEndpoint
INFO: Add endpoint - binding.sca - TEST_BWS_5001Component1/Service1
Aug 2, 2013 9:24:42 PM org.apache.tuscany.sca.http.jetty.JettyServer addServletMapping
INFO: Added Servlet mapping: http://67.195.138.58:8080/TEST_BWS_5001Component1/Reference1
Aug 2, 2013 9:24:42 PM org.apache.tuscany.sca.core.assembly.impl.DomainRegistryImpl addEndpoint
INFO: Add endpoint - binding.ws - http://67.195.138.58:8080/TEST_BWS_5001Component1/Reference1
>>> Starting external JAXWS service at: http://localhost:9081/JAXWS/Service1
wsa:Action value found: http://test.sca.oasisopen.org/TEST_BWS_5001Component1/Reference1/Service5/operation1Request
Address found: http://67.195.138.58:8080/TEST_BWS_5001Component1/Reference1
Service5Impl - callback address is: http://67.195.138.58:8080/TEST_BWS_5001Component1/Reference1
Test BWS_5001 completed successfully
Aug 2, 2013 9:24:42 PM org.apache.tuscany.sca.node.impl.NodeImpl stop
INFO: Stopping node: http://tuscany.apache.org/sca/1.1/nodes/default0
Aug 2, 2013 9:24:42 PM org.apache.tuscany.sca.core.assembly.impl.DomainRegistryImpl removeEndpoint
INFO: Remove endpoint - binding.ws - http://67.195.138.58:8080/TestClient/TestInvocation
Aug 2, 2013 9:24:42 PM org.apache.tuscany.sca.http.jetty.JettyServer removeServletMapping
INFO: Removed Servlet mapping: /TestClient/TestInvocation
Aug 2, 2013 9:24:42 PM org.apache.tuscany.sca.core.assembly.impl.DomainRegistryImpl removeEndpoint
INFO: Remove endpoint - binding.sca - TestClient/TestClient_0002TestClient/TestInvocation
Aug 2, 2013 9:24:42 PM org.apache.tuscany.sca.core.assembly.impl.DomainRegistryImpl removeEndpoint
INFO: Remove endpoint - binding.sca - TEST_BWS_5001Component1/Service1
Aug 2, 2013 9:24:42 PM org.apache.tuscany.sca.core.assembly.impl.DomainRegistryImpl removeEndpoint
INFO: Remove endpoint - binding.ws - http://67.195.138.58:8080/TEST_BWS_5001Component1/Reference1
Aug 2, 2013 9:24:42 PM org.apache.tuscany.sca.http.jetty.JettyServer removeServletMapping
INFO: Removed Servlet mapping: /TEST_BWS_5001Component1/Reference1
Aug 2, 2013 9:24:42 PM org.apache.tuscany.sca.core.assembly.impl.DomainRegistryImpl removeEndpoint
INFO: Remove endpoint - binding.sca - TEST_BWS_5001Component1/TestComposite54TestComponent1/Service1
Aug 2, 2013 9:24:42 PM org.apache.tuscany.sca.core.assembly.impl.DomainRegistryImpl removeEndpoint
INFO: Remove endpoint - binding.sca - TEST_BWS_5001Component1/TestComposite54TestComponent1/reference1
Tests run: 1, Failures: 0, Errors: 0, Skipped: 0, Time elapsed: 0.333 sec
Running client_bws.BWS_4001_TestCase
Implementation language set to: _Java
Aug 2, 2013 9:24:42 PM org.apache.tuscany.sca.node.impl.NodeImpl start
INFO: Starting node: http://tuscany.apache.org/sca/1.1/nodes/default0 domain: default
Aug 2, 2013 9:24:42 PM org.apache.tuscany.sca.node.impl.NodeFactoryImpl loadContributions
INFO: Loading contribution: <https://builds.apache.org/job/Tuscany-2x/ws/sca-2x/testing/compliance-tests/binding-ws/target/oasis-contributions/BWS_General/target/BWS_General.zip>
Aug 2, 2013 9:24:42 PM org.apache.tuscany.sca.node.impl.NodeFactoryImpl loadContributions
INFO: Loading contribution: <https://builds.apache.org/job/Tuscany-2x/ws/sca-2x/testing/compliance-tests/binding-ws/target/oasis-contributions/BWS_General_Java/target/BWS_General_Java.zip>
Aug 2, 2013 9:24:43 PM org.apache.tuscany.sca.core.assembly.impl.DomainRegistryImpl addEndpoint
INFO: Add endpoint - binding.sca - TestClient/TestClient_0002TestClient/TestInvocation
Aug 2, 2013 9:24:43 PM org.apache.tuscany.sca.http.jetty.JettyLogger info
INFO: jetty-6.1.19
Aug 2, 2013 9:24:43 PM org.apache.tuscany.sca.http.jetty.JettyLogger info
INFO: Started SelectChannelConnector@0.0.0.0:8080
Aug 2, 2013 9:24:43 PM org.apache.tuscany.sca.http.jetty.JettyServer addServletMapping
INFO: Added Servlet mapping: http://67.195.138.58:8080/TestClient/TestInvocation
Aug 2, 2013 9:24:43 PM org.apache.tuscany.sca.core.assembly.impl.DomainRegistryImpl addEndpoint
INFO: Add endpoint - binding.ws - http://67.195.138.58:8080/TestClient/TestInvocation
Aug 2, 2013 9:24:43 PM org.apache.tuscany.sca.core.assembly.impl.DomainRegistryImpl addEndpoint
INFO: Add endpoint - binding.sca - TEST_BWS_4001Component1/TestComposite1Component1/Service1
Aug 2, 2013 9:24:43 PM org.apache.tuscany.sca.core.assembly.impl.DomainRegistryImpl addEndpoint
INFO: Add endpoint - binding.sca - TEST_BWS_4001Component1/Service1
Test BWS_4001 completed successfully
Aug 2, 2013 9:24:43 PM org.apache.tuscany.sca.node.impl.NodeImpl stop
INFO: Stopping node: http://tuscany.apache.org/sca/1.1/nodes/default0
Aug 2, 2013 9:24:43 PM org.apache.tuscany.sca.core.assembly.impl.DomainRegistryImpl removeEndpoint
INFO: Remove endpoint - binding.ws - http://67.195.138.58:8080/TestClient/TestInvocation
Aug 2, 2013 9:24:43 PM org.apache.tuscany.sca.http.jetty.JettyServer removeServletMapping
INFO: Removed Servlet mapping: /TestClient/TestInvocation
Aug 2, 2013 9:24:43 PM org.apache.tuscany.sca.core.assembly.impl.DomainRegistryImpl removeEndpoint
INFO: Remove endpoint - binding.sca - TestClient/TestClient_0002TestClient/TestInvocation
Aug 2, 2013 9:24:43 PM org.apache.tuscany.sca.core.assembly.impl.DomainRegistryImpl removeEndpoint
INFO: Remove endpoint - binding.sca - TEST_BWS_4001Component1/Service1
Aug 2, 2013 9:24:43 PM org.apache.tuscany.sca.core.assembly.impl.DomainRegistryImpl removeEndpoint
INFO: Remove endpoint - binding.sca - TEST_BWS_4001Component1/TestComposite1Component1/Service1
Tests run: 1, Failures: 0, Errors: 0, Skipped: 0, Time elapsed: 0.262 sec
Running client_bws.BWS_5006_TestCase
Implementation language set to: _Java
Aug 2, 2013 9:24:43 PM org.apache.tuscany.sca.node.impl.NodeImpl start
INFO: Starting node: http://tuscany.apache.org/sca/1.1/nodes/default0 domain: default
Aug 2, 2013 9:24:43 PM org.apache.tuscany.sca.node.impl.NodeFactoryImpl loadContributions
INFO: Loading contribution: <https://builds.apache.org/job/Tuscany-2x/ws/sca-2x/testing/compliance-tests/binding-ws/target/oasis-contributions/BWS_General/target/BWS_General.zip>
Aug 2, 2013 9:24:43 PM org.apache.tuscany.sca.node.impl.NodeFactoryImpl loadContributions
INFO: Loading contribution: <https://builds.apache.org/job/Tuscany-2x/ws/sca-2x/testing/compliance-tests/binding-ws/target/oasis-contributions/BWS_General_Java/target/BWS_General_Java.zip>
Aug 2, 2013 9:24:43 PM org.apache.tuscany.sca.core.assembly.impl.DomainRegistryImpl addEndpoint
INFO: Add endpoint - binding.sca - TEST_BWS_5006Component1/TestComposite55TestComponent1/Service5
Aug 2, 2013 9:24:43 PM org.apache.tuscany.sca.http.jetty.JettyLogger info
INFO: jetty-6.1.19
Aug 2, 2013 9:24:43 PM org.apache.tuscany.sca.http.jetty.JettyLogger info
INFO: Started SelectChannelConnector@0.0.0.0:8080
Aug 2, 2013 9:24:43 PM org.apache.tuscany.sca.http.jetty.JettyServer addServletMapping
INFO: Added Servlet mapping: http://67.195.138.58:8080/TEST_BWS_5006Component1/Service1
Aug 2, 2013 9:24:43 PM org.apache.tuscany.sca.core.assembly.impl.DomainRegistryImpl addEndpoint
INFO: Add endpoint - binding.ws - http://67.195.138.58:8080/TEST_BWS_5006Component1/Service1
>>> Starting external JAXWS service at: http://localhost:9081/JAXWS/Service5Callback
Service5 client - call address is: http://localhost:8080/TEST_BWS_5006Component1/Service1
wsa:To address found: http://localhost:9081/JAXWS/Service5Callback
wsa:Action value found: http://test.sca.oasisopen.org/TEST_BWS_5006Component1/Service1/Service5Callback/callback1Request
test:SCAProps value found: 47275585-9e14-46ec-9b31-d75b19c3f7ee
Test BWS_5006 completed successfully
Aug 2, 2013 9:24:43 PM org.apache.tuscany.sca.node.impl.NodeImpl stop
INFO: Stopping node: http://tuscany.apache.org/sca/1.1/nodes/default0
Aug 2, 2013 9:24:43 PM org.apache.tuscany.sca.core.assembly.impl.DomainRegistryImpl removeEndpoint
INFO: Remove endpoint - binding.ws - http://67.195.138.58:8080/TEST_BWS_5006Component1/Service1
Aug 2, 2013 9:24:43 PM org.apache.tuscany.sca.http.jetty.JettyServer removeServletMapping
INFO: Removed Servlet mapping: /TEST_BWS_5006Component1/Service1
Aug 2, 2013 9:24:43 PM org.apache.tuscany.sca.core.assembly.impl.DomainRegistryImpl removeEndpoint
INFO: Remove endpoint - binding.sca - TEST_BWS_5006Component1/TestComposite55TestComponent1/Service5
Tests run: 1, Failures: 0, Errors: 0, Skipped: 0, Time elapsed: 0.327 sec
Running client_bws.BWS_4005_TestCase
Implementation language set to: _Java
Aug 2, 2013 9:24:43 PM org.apache.tuscany.sca.node.impl.NodeImpl start
INFO: Starting node: http://tuscany.apache.org/sca/1.1/nodes/default0 domain: default
Aug 2, 2013 9:24:43 PM org.apache.tuscany.sca.node.impl.NodeFactoryImpl loadContributions
INFO: Loading contribution: <https://builds.apache.org/job/Tuscany-2x/ws/sca-2x/testing/compliance-tests/binding-ws/target/oasis-contributions/BWS_General/target/BWS_General.zip>
Aug 2, 2013 9:24:43 PM org.apache.tuscany.sca.node.impl.NodeFactoryImpl loadContributions
INFO: Loading contribution: <https://builds.apache.org/job/Tuscany-2x/ws/sca-2x/testing/compliance-tests/binding-ws/target/oasis-contributions/BWS_General_Java/target/BWS_General_Java.zip>
Aug 2, 2013 9:24:43 PM org.apache.tuscany.sca.core.assembly.impl.DomainRegistryImpl addEndpoint
INFO: Add endpoint - binding.sca - TestClient/TestClient_0002TestClient/TestInvocation
Aug 2, 2013 9:24:43 PM org.apache.tuscany.sca.http.jetty.JettyLogger info
INFO: jetty-6.1.19
Aug 2, 2013 9:24:43 PM org.apache.tuscany.sca.http.jetty.JettyLogger info
INFO: Started SelectChannelConnector@0.0.0.0:8080
Aug 2, 2013 9:24:43 PM org.apache.tuscany.sca.http.jetty.JettyServer addServletMapping
INFO: Added Servlet mapping: http://67.195.138.58:8080/TestClient/TestInvocation
Aug 2, 2013 9:24:43 PM org.apache.tuscany.sca.core.assembly.impl.DomainRegistryImpl addEndpoint
INFO: Add endpoint - binding.ws - http://67.195.138.58:8080/TestClient/TestInvocation
Aug 2, 2013 9:24:43 PM org.apache.tuscany.sca.core.assembly.impl.DomainRegistryImpl addEndpoint
INFO: Add endpoint - binding.sca - TEST_BWS_4005Component1/Composite4Component1/Service1
Aug 2, 2013 9:24:43 PM org.apache.tuscany.sca.core.assembly.impl.DomainRegistryImpl addEndpoint
INFO: Add endpoint - binding.sca - TEST_BWS_4005Component1/Service1
>>> Starting external JAXWS service at: http://localhost:9081/JAXWS/Service1
Test BWS_4005 completed successfully
Aug 2, 2013 9:24:43 PM org.apache.tuscany.sca.node.impl.NodeImpl stop
INFO: Stopping node: http://tuscany.apache.org/sca/1.1/nodes/default0
Aug 2, 2013 9:24:43 PM org.apache.tuscany.sca.core.assembly.impl.DomainRegistryImpl removeEndpoint
INFO: Remove endpoint - binding.ws - http://67.195.138.58:8080/TestClient/TestInvocation
Aug 2, 2013 9:24:43 PM org.apache.tuscany.sca.http.jetty.JettyServer removeServletMapping
INFO: Removed Servlet mapping: /TestClient/TestInvocation
Aug 2, 2013 9:24:43 PM org.apache.tuscany.sca.core.assembly.impl.DomainRegistryImpl removeEndpoint
INFO: Remove endpoint - binding.sca - TestClient/TestClient_0002TestClient/TestInvocation
Aug 2, 2013 9:24:43 PM org.apache.tuscany.sca.core.assembly.impl.DomainRegistryImpl removeEndpoint
INFO: Remove endpoint - binding.sca - TEST_BWS_4005Component1/Service1
Aug 2, 2013 9:24:43 PM org.apache.tuscany.sca.core.assembly.impl.DomainRegistryImpl removeEndpoint
INFO: Remove endpoint - binding.sca - TEST_BWS_4005Component1/Composite4Component1/Service1
Tests run: 1, Failures: 0, Errors: 0, Skipped: 0, Time elapsed: 0.283 sec

Results :

Tests run: 37, Failures: 0, Errors: 0, Skipped: 0

[JENKINS] Recording test results
[INFO] [jar:jar {execution: default-jar}]
[INFO] Building jar: <https://builds.apache.org/job/Tuscany-2x/ws/sca-2x/testing/compliance-tests/binding-ws/target/tuscany-compliance-test-binding-ws.jar>
[INFO] [install:install {execution: default-install}]
[INFO] Installing <https://builds.apache.org/job/Tuscany-2x/ws/sca-2x/testing/compliance-tests/binding-ws/target/tuscany-compliance-test-binding-ws.jar>
to <https://builds.apache.org/job/Tuscany-2x/ws/.repository/org/apache/tuscany/sca/tuscany-compliance-test-binding-ws/2.5-SNAPSHOT/tuscany-compliance-test-binding-ws-2.5-SNAPSHOT.jar>
[JENKINS] Archiving disabled
[INFO] ------------------------------------------------------------------------
[INFO] Building Apache Tuscany SCA Specification Compliance Tests Binding JMS
[INFO]    task-segment: [clean, install]
[INFO] ------------------------------------------------------------------------
[INFO] [clean:clean {execution: default-clean}]
[INFO] snapshot org.apache.tuscany.sca:tuscany-otests-sca-jms-tests:2.0-SNAPSHOT: checking
for updates from oasis.contributions
[INFO] snapshot org.apache.tuscany.sca:tuscany-otests-sca-jms-tests:2.0-SNAPSHOT: checking
for updates from apache.snapshots
[INFO] snapshot org.apache.tuscany.sca:tuscany-otests-sca-jms-tests:2.0-SNAPSHOT: checking
for updates from apache.nexus
Downloading: http://svn.apache.org/repos/asf/tuscany/maven/org/apache/tuscany/sca/tuscany-otests-sca-jms-tests/2.0-SNAPSHOT/tuscany-otests-sca-jms-tests-2.0-SNAPSHOT.pom
[INFO] snapshot org.apache.tuscany.sca:tuscany-base-runtime:2.0-SNAPSHOT: checking for updates
from oasis.contributions
[INFO] snapshot org.apache.tuscany.sca:tuscany-base-runtime:2.0-SNAPSHOT: checking for updates
from apache.snapshots
[INFO] snapshot org.apache.tuscany.sca:tuscany-base-runtime:2.0-SNAPSHOT: checking for updates
from apache.nexus
[INFO] snapshot org.apache.tuscany.sca:tuscany-binding-jms-runtime:2.0-SNAPSHOT: checking
for updates from oasis.contributions
[INFO] snapshot org.apache.tuscany.sca:tuscany-binding-jms-runtime:2.0-SNAPSHOT: checking
for updates from apache.snapshots
[INFO] snapshot org.apache.tuscany.sca:tuscany-binding-jms-runtime:2.0-SNAPSHOT: checking
for updates from apache.nexus
Downloading: http://svn.apache.org/repos/asf/tuscany/maven/org/apache/tuscany/sca/tuscany-otests-sca-jms-tests/2.0-SNAPSHOT/tuscany-otests-sca-jms-tests-2.0-SNAPSHOT.jar
[INFO] [enforcer:enforce {execution: enforce-plugin-versions}]
[INFO] [remote-resources:process {execution: default}]
[WARNING] Invalid project model for artifact [wss4j:org.apache.ws.security:1.5.10]. It will
be ignored by the remote resources Mojo.
[INFO] [resources:resources {execution: default-resources}]
[INFO] Using 'UTF-8' encoding to copy filtered resources.
[INFO] skip non existing resourceDirectory <https://builds.apache.org/job/Tuscany-2x/ws/sca-2x/testing/compliance-tests/binding-jms/src/main/resources>
[INFO] Copying 0 resource
[INFO] Copying 3 resources
[INFO] [compiler:compile {execution: default-compile}]
[INFO] No sources to compile
[INFO] [dependency:unpack {execution: unpack}]
[INFO] Configured Artifact: org.apache.tuscany.sca:oasis-jms-contributions:2.0-SNAPSHOT:zip
[INFO] snapshot org.apache.tuscany.sca:oasis-jms-contributions:2.0-SNAPSHOT: checking for
updates from oasis.contributions
[INFO] snapshot org.apache.tuscany.sca:oasis-jms-contributions:2.0-SNAPSHOT: checking for
updates from apache.snapshots
[INFO] snapshot org.apache.tuscany.sca:oasis-jms-contributions:2.0-SNAPSHOT: checking for
updates from apache.nexus
Downloading: http://svn.apache.org/repos/asf/tuscany/maven/org/apache/tuscany/sca/oasis-jms-contributions/2.0-SNAPSHOT/oasis-jms-contributions-2.0-SNAPSHOT.zip
[INFO] Configured Artifact: org.apache.tuscany.sca:tuscany-otests-sca-jms-tests:2.0-SNAPSHOT:jar
Downloading: http://svn.apache.org/repos/asf/tuscany/maven/org/apache/tuscany/sca/tuscany-otests-sca-jms-tests/2.0-SNAPSHOT/tuscany-otests-sca-jms-tests-2.0-SNAPSHOT.jar
[INFO] Unpacking <https://builds.apache.org/job/Tuscany-2x/ws/.repository/org/apache/tuscany/sca/oasis-jms-contributions/2.0-SNAPSHOT/oasis-jms-contributions-2.0-SNAPSHOT.zip>
to
  <https://builds.apache.org/job/Tuscany-2x/ws/sca-2x/testing/compliance-tests/binding-jms/target/oasis-contributions>
   with includes null and excludes:null
[INFO] Unpacking <https://builds.apache.org/job/Tuscany-2x/ws/.repository/org/apache/tuscany/sca/tuscany-otests-sca-jms-tests/2.0-SNAPSHOT/tuscany-otests-sca-jms-tests-2.0-SNAPSHOT.jar>
to
  <https://builds.apache.org/job/Tuscany-2x/ws/sca-2x/testing/compliance-tests/binding-jms/target/test-classes>
   with includes null and excludes:commons-logging.properties,oasis-sca-tests.properties,tuscany-oasis-sca-tests-errors.properties
[INFO] [resources:testResources {execution: default-testResources}]
[INFO] Using 'UTF-8' encoding to copy filtered resources.
[INFO] Copying 3 resources
[INFO] Copying 3 resources
[INFO] [compiler:testCompile {execution: default-testCompile}]
[INFO] Compiling 1 source file to <https://builds.apache.org/job/Tuscany-2x/ws/sca-2x/testing/compliance-tests/binding-jms/target/test-classes>
[INFO] -------------------------------------------------------------
[ERROR] COMPILATION ERROR : 
[INFO] -------------------------------------------------------------
[ERROR] error: error reading <https://builds.apache.org/job/Tuscany-2x/ws/.repository/org/apache/ws/security/wss4j/1.5.10/wss4j-1.5.10.jar;>
error in opening zip file
[INFO] 1error
[INFO] -------------------------------------------------------------
[JENKINS] Archiving disabled
[INFO] ------------------------------------------------------------------------
[ERROR] BUILD FAILURE
[INFO] ------------------------------------------------------------------------
[INFO] Compilation failure
error: error reading <https://builds.apache.org/job/Tuscany-2x/ws/.repository/org/apache/ws/security/wss4j/1.5.10/wss4j-1.5.10.jar;>
error in opening zip file

[INFO] ------------------------------------------------------------------------
[INFO] For more information, run Maven with the -e switch
[INFO] ------------------------------------------------------------------------
[INFO] Total time: 44 minutes 14 seconds
[INFO] Finished at: Fri Aug 02 21:24:51 UTC 2013
[INFO] Final Memory: 998M/1916M
[INFO] ------------------------------------------------------------------------
Maven failed with error.
Sending e-mails to: notification@tuscany.apache.org
Sending e-mails to: notification@tuscany.apache.org
Sending e-mails to: notification@tuscany.apache.org
channel stopped
2013-08-02 21:24:55.310:INFO::Shutdown hook executing
2013-08-02 21:24:55.310:INFO::Shutdown hook complete

Mime
View raw message