tuscany-notification mailing list archives

Site index · List index
Message view « Date » · « Thread »
Top « Date » · « Thread »
From Apache Jenkins Server <jenk...@builds.apache.org>
Subject Build failed in Jenkins: Tuscany-2x » Apache Tuscany SCA Specification Compliance Tests Binding JMS #1106
Date Wed, 07 Aug 2013 20:47:42 GMT
See <https://builds.apache.org/job/Tuscany-2x/org.apache.tuscany.sca$tuscany-compliance-test-binding-jms/1106/>

------------------------------------------
[INFO] ------------------------------------------------------------------------
[INFO] Building Apache Tuscany SCA Specification Compliance Tests Binding JMS
[INFO]    task-segment: [clean, install]
[INFO] ------------------------------------------------------------------------
[INFO] [clean:clean {execution: default-clean}]
[INFO] snapshot org.apache.tuscany.sca:tuscany-otests-sca-jms-tests:2.0-SNAPSHOT: checking
for updates from oasis.contributions
[INFO] snapshot org.apache.tuscany.sca:tuscany-otests-sca-jms-tests:2.0-SNAPSHOT: checking
for updates from apache.snapshots
[INFO] snapshot org.apache.tuscany.sca:tuscany-otests-sca-jms-tests:2.0-SNAPSHOT: checking
for updates from apache.nexus
Downloading: http://svn.apache.org/repos/asf/tuscany/maven/org/apache/tuscany/sca/tuscany-otests-sca-jms-tests/2.0-SNAPSHOT/tuscany-otests-sca-jms-tests-2.0-SNAPSHOT.pom
1K downloaded  (tuscany-otests-sca-jms-tests-2.0-SNAPSHOT.pom)
[WARNING] *** CHECKSUM FAILED - Error retrieving checksum file for org/apache/tuscany/sca/tuscany-otests-sca-jms-tests/2.0-SNAPSHOT/tuscany-otests-sca-jms-tests-2.0-SNAPSHOT.pom
- IGNORING
[INFO] snapshot org.apache.tuscany.sca:tuscany-base-runtime:2.0-SNAPSHOT: checking for updates
from oasis.contributions
[INFO] snapshot org.apache.tuscany.sca:tuscany-base-runtime:2.0-SNAPSHOT: checking for updates
from apache.snapshots
[INFO] snapshot org.apache.tuscany.sca:tuscany-base-runtime:2.0-SNAPSHOT: checking for updates
from apache.nexus
Downloading: https://repository.apache.org/content/groups/public//org/apache/tuscany/sca/tuscany-base-runtime/2.0-SNAPSHOT/tuscany-base-runtime-2.0-20120722.002354-261.pom

[INFO] snapshot org.apache.tuscany.sca:tuscany-binding-jms-runtime:2.0-SNAPSHOT: checking
for updates from oasis.contributions
[INFO] snapshot org.apache.tuscany.sca:tuscany-binding-jms-runtime:2.0-SNAPSHOT: checking
for updates from apache.snapshots
[INFO] snapshot org.apache.tuscany.sca:tuscany-binding-jms-runtime:2.0-SNAPSHOT: checking
for updates from apache.nexus
Downloading: https://repository.apache.org/content/groups/public//org/apache/tuscany/sca/tuscany-binding-jms-runtime/2.0-SNAPSHOT/tuscany-binding-jms-runtime-2.0-20120722.002602-258.pom

Downloading: http://svn.apache.org/repos/asf/tuscany/maven/org/apache/activemq/activemq-all/5.2.0/activemq-all-5.2.0.pom
[INFO] Unable to find resource 'org.apache.activemq:activemq-all:pom:5.2.0' in repository
oasis.contributions (http://svn.apache.org/repos/asf/tuscany/maven)
Downloading: http://repository.apache.org/snapshots/org/apache/activemq/activemq-all/5.2.0/activemq-all-5.2.0.pom
[INFO] Unable to find resource 'org.apache.activemq:activemq-all:pom:5.2.0' in repository
apache.snapshots (http://repository.apache.org/snapshots)
Downloading: http://svn.apache.org/repos/asf/tuscany/maven/org/apache/activemq/activemq-all/5.2.0/activemq-all-5.2.0.pom
[INFO] Unable to find resource 'org.apache.activemq:activemq-all:pom:5.2.0' in repository
tuscany.repo (http://svn.apache.org/repos/asf/tuscany/maven)
Downloading: https://repository.apache.org/content/groups/public//org/apache/activemq/activemq-all/5.2.0/activemq-all-5.2.0.pom

Downloading: http://svn.apache.org/repos/asf/tuscany/maven/org/apache/activemq/activemq-all/5.2.0/activemq-all-5.2.0.jar
Downloading: http://svn.apache.org/repos/asf/tuscany/maven/org/apache/ws/security/wss4j/1.5.10/wss4j-1.5.10.jar
Downloading: http://svn.apache.org/repos/asf/tuscany/maven/org/apache/tuscany/sca/tuscany-otests-sca-jms-tests/2.0-SNAPSHOT/tuscany-otests-sca-jms-tests-2.0-SNAPSHOT.jar
[INFO] Unable to find resource 'org.apache.activemq:activemq-all:jar:5.2.0' in repository
oasis.contributions (http://svn.apache.org/repos/asf/tuscany/maven)
Downloading: http://repository.apache.org/snapshots/org/apache/activemq/activemq-all/5.2.0/activemq-all-5.2.0.jar
[INFO] Unable to find resource 'org.apache.ws.security:wss4j:jar:1.5.10' in repository oasis.contributions
(http://svn.apache.org/repos/asf/tuscany/maven)
Downloading: http://repository.apache.org/snapshots/org/apache/ws/security/wss4j/1.5.10/wss4j-1.5.10.jar
[INFO] Unable to find resource 'org.apache.activemq:activemq-all:jar:5.2.0' in repository
apache.snapshots (http://repository.apache.org/snapshots)
Downloading: http://svn.apache.org/repos/asf/tuscany/maven/org/apache/activemq/activemq-all/5.2.0/activemq-all-5.2.0.jar
[INFO] Unable to find resource 'org.apache.ws.security:wss4j:jar:1.5.10' in repository apache.snapshots
(http://repository.apache.org/snapshots)
Downloading: http://svn.apache.org/repos/asf/tuscany/maven/org/apache/ws/security/wss4j/1.5.10/wss4j-1.5.10.jar
[INFO] Unable to find resource 'org.apache.activemq:activemq-all:jar:5.2.0' in repository
tuscany.repo (http://svn.apache.org/repos/asf/tuscany/maven)
Downloading: https://repository.apache.org/content/groups/public//org/apache/activemq/activemq-all/5.2.0/activemq-all-5.2.0.jar
[INFO] Unable to find resource 'org.apache.ws.security:wss4j:jar:1.5.10' in repository tuscany.repo
(http://svn.apache.org/repos/asf/tuscany/maven)
Downloading: https://repository.apache.org/content/groups/public//org/apache/ws/security/wss4j/1.5.10/wss4j-1.5.10.jar

[INFO] Unable to find resource 'org.apache.ws.security:wss4j:jar:1.5.10' in repository apache.nexus
(https://repository.apache.org/content/groups/public/)
Downloading: http://shibboleth.internet2.edu/downloads/maven2//org/apache/ws/security/wss4j/1.5.10/wss4j-1.5.10.jar
[WARNING] *** CHECKSUM FAILED - Error retrieving checksum file for org/apache/tuscany/sca/tuscany-otests-sca-jms-tests/2.0-SNAPSHOT/tuscany-otests-sca-jms-tests-2.0-SNAPSHOT.jar
- IGNORING
Downloading: https://repository.apache.org/content/groups/public//org/apache/tuscany/sca/tuscany-base-runtime/2.0-SNAPSHOT/tuscany-base-runtime-2.0-20120722.002354-261.jar

[WARNING] *** CHECKSUM FAILED - Checksum failed on download: local = '420712511a1e1b9978e59a2cbbff75a911180f95';
remote = '<!DOCTYPE' - RETRYING
Downloading: http://shibboleth.internet2.edu/downloads/maven2//org/apache/ws/security/wss4j/1.5.10/wss4j-1.5.10.jar

[WARNING] *** CHECKSUM FAILED - Checksum failed on download: local = '420712511a1e1b9978e59a2cbbff75a911180f95';
remote = '<!DOCTYPE' - IGNORING
2485K downloaded  (tuscany-base-runtime-2.0-20120722.002354-261.jar)
Downloading: https://repository.apache.org/content/groups/public//org/apache/tuscany/sca/tuscany-binding-ws-runtime-axis2/2.0-SNAPSHOT/tuscany-binding-ws-runtime-axis2-2.0-20120722.002715-258.jar
2569K downloaded  (activemq-all-5.2.0.jar)
108K downloaded  (tuscany-binding-ws-runtime-axis2-2.0-20120722.002715-258.jar)
Downloading: https://repository.apache.org/content/groups/public//org/apache/tuscany/sca/tuscany-policy-wspolicy/2.0-SNAPSHOT/tuscany-policy-wspolicy-2.0-20120722.002657-258.jar
21K downloaded  (tuscany-policy-wspolicy-2.0-20120722.002657-258.jar)
Downloading: https://repository.apache.org/content/groups/public//org/apache/tuscany/sca/tuscany-databinding-axiom/2.0-SNAPSHOT/tuscany-databinding-axiom-2.0-20120722.002703-258.jar
35K downloaded  (tuscany-databinding-axiom-2.0-20120722.002703-258.jar)
Downloading: https://repository.apache.org/content/groups/public//org/apache/tuscany/sca/tuscany-databinding-jaxb-axiom/2.0-SNAPSHOT/tuscany-databinding-jaxb-axiom-2.0-20120722.002708-258.jar
38K downloaded  (tuscany-databinding-jaxb-axiom-2.0-20120722.002708-258.jar)
[INFO] [enforcer:enforce {execution: enforce-plugin-versions}]
[INFO] [remote-resources:process {execution: default}]
[WARNING] Invalid project model for artifact [wss4j:org.apache.ws.security:1.5.10]. It will
be ignored by the remote resources Mojo.
[INFO] [resources:resources {execution: default-resources}]
[INFO] Using 'UTF-8' encoding to copy filtered resources.
[INFO] skip non existing resourceDirectory <https://builds.apache.org/job/Tuscany-2x/org.apache.tuscany.sca$tuscany-compliance-test-binding-jms/ws/src/main/resources>
[INFO] Copying 0 resource
[INFO] Copying 3 resources
[INFO] [compiler:compile {execution: default-compile}]
[INFO] No sources to compile
[INFO] [dependency:unpack {execution: unpack}]
[INFO] Configured Artifact: org.apache.tuscany.sca:oasis-jms-contributions:2.0-SNAPSHOT:zip
[INFO] snapshot org.apache.tuscany.sca:oasis-jms-contributions:2.0-SNAPSHOT: checking for
updates from oasis.contributions
[INFO] snapshot org.apache.tuscany.sca:oasis-jms-contributions:2.0-SNAPSHOT: checking for
updates from apache.snapshots
[INFO] snapshot org.apache.tuscany.sca:oasis-jms-contributions:2.0-SNAPSHOT: checking for
updates from apache.nexus
Downloading: http://svn.apache.org/repos/asf/tuscany/maven/org/apache/tuscany/sca/oasis-jms-contributions/2.0-SNAPSHOT/oasis-jms-contributions-2.0-SNAPSHOT.zip

[WARNING] *** CHECKSUM FAILED - Error retrieving checksum file for org/apache/tuscany/sca/oasis-jms-contributions/2.0-SNAPSHOT/oasis-jms-contributions-2.0-SNAPSHOT.zip
- IGNORING
[INFO] Configured Artifact: org.apache.tuscany.sca:tuscany-otests-sca-jms-tests:2.0-SNAPSHOT:jar
Downloading: http://svn.apache.org/repos/asf/tuscany/maven/org/apache/tuscany/sca/tuscany-otests-sca-jms-tests/2.0-SNAPSHOT/tuscany-otests-sca-jms-tests-2.0-SNAPSHOT.jar
[INFO] Unpacking /home/jenkins/jenkins-slave/workspace/Tuscany-2x/.repository/org/apache/tuscany/sca/oasis-jms-contributions/2.0-SNAPSHOT/oasis-jms-contributions-2.0-SNAPSHOT.zip
to
  <https://builds.apache.org/job/Tuscany-2x/org.apache.tuscany.sca$tuscany-compliance-test-binding-jms/ws/target/oasis-contributions>
   with includes null and excludes:null
[INFO] Unpacking /home/jenkins/jenkins-slave/workspace/Tuscany-2x/.repository/org/apache/tuscany/sca/tuscany-otests-sca-jms-tests/2.0-SNAPSHOT/tuscany-otests-sca-jms-tests-2.0-SNAPSHOT.jar
to
  <https://builds.apache.org/job/Tuscany-2x/org.apache.tuscany.sca$tuscany-compliance-test-binding-jms/ws/target/test-classes>
   with includes null and excludes:commons-logging.properties,oasis-sca-tests.properties,tuscany-oasis-sca-tests-errors.properties
[INFO] [resources:testResources {execution: default-testResources}]
[INFO] Using 'UTF-8' encoding to copy filtered resources.
[INFO] Copying 3 resources
[INFO] Copying 3 resources
[INFO] [compiler:testCompile {execution: default-testCompile}]
[INFO] Compiling 1 source file to <https://builds.apache.org/job/Tuscany-2x/org.apache.tuscany.sca$tuscany-compliance-test-binding-jms/ws/target/test-classes>
[INFO] -------------------------------------------------------------
[ERROR] COMPILATION ERROR : 
[INFO] -------------------------------------------------------------
[ERROR] error: error reading /home/jenkins/jenkins-slave/workspace/Tuscany-2x/.repository/org/apache/ws/security/wss4j/1.5.10/wss4j-1.5.10.jar;
error in opening zip file
[INFO] 1error
[INFO] -------------------------------------------------------------
[JENKINS] Archiving disabled
[INFO] ------------------------------------------------------------------------
[ERROR] BUILD FAILURE
[INFO] ------------------------------------------------------------------------
[INFO] Compilation failure
error: error reading /home/jenkins/jenkins-slave/workspace/Tuscany-2x/.repository/org/apache/ws/security/wss4j/1.5.10/wss4j-1.5.10.jar;
error in opening zip file

[INFO] ------------------------------------------------------------------------
[INFO] For more information, run Maven with the -e switch
[INFO] ------------------------------------------------------------------------
[INFO] Total time: 62 minutes 46 seconds
[INFO] Finished at: Wed Aug 07 20:47:39 UTC 2013
[INFO] Final Memory: 1019M/1916M
[INFO] ------------------------------------------------------------------------
Maven failed with error.

Mime
View raw message