tuscany-notification mailing list archives

Site index · List index
Message view « Date » · « Thread »
Top « Date » · « Thread »
From Apache Jenkins Server <jenk...@builds.apache.org>
Subject Build failed in Jenkins: Tuscany-2x #1786
Date Mon, 10 Aug 2015 18:56:58 GMT
See <https://builds.apache.org/job/Tuscany-2x/1786/>

------------------------------------------
[...truncated 16541 lines...]
)
Aug 10, 2015 6:56:00 PM org.apache.tuscany.sca.contribution.namespace.impl.NamespaceImportProcessor
[] (AttributeNameSpaceMissing)
SEVERE: Attribute ''namespace'' is missing
Tests run: 2, Failures: 0, Errors: 0, Skipped: 0, Time elapsed: 0.023 sec

Results :

Tests run: 26, Failures: 0, Errors: 0, Skipped: 0

[JENKINS] Recording test results
[INFO] [jar:jar {execution: default-jar}]
[INFO] Building jar: <https://builds.apache.org/job/Tuscany-2x/ws/sca-2x/modules/contribution/target/tuscany-contribution-2.5-SNAPSHOT.jar>
[INFO] [source:jar-no-fork {execution: attach-sources}]
[INFO] Building jar: <https://builds.apache.org/job/Tuscany-2x/ws/sca-2x/modules/contribution/target/tuscany-contribution-2.5-SNAPSHOT-sources.jar>
[INFO] [install:install {execution: default-install}]
[INFO] Installing <https://builds.apache.org/job/Tuscany-2x/ws/sca-2x/modules/contribution/target/tuscany-contribution-2.5-SNAPSHOT.jar>
to <https://builds.apache.org/job/Tuscany-2x/ws/.repository/org/apache/tuscany/sca/tuscany-contribution/2.5-SNAPSHOT/tuscany-contribution-2.5-SNAPSHOT.jar>
[INFO] Installing <https://builds.apache.org/job/Tuscany-2x/ws/sca-2x/modules/contribution/target/tuscany-contribution-2.5-SNAPSHOT-sources.jar>
to <https://builds.apache.org/job/Tuscany-2x/ws/.repository/org/apache/tuscany/sca/tuscany-contribution/2.5-SNAPSHOT/tuscany-contribution-2.5-SNAPSHOT-sources.jar>
[JENKINS] Archiving disabled
[INFO] ------------------------------------------------------------------------
[INFO] Building Apache Tuscany SCA Node API
[INFO]    task-segment: [clean, install]
[INFO] ------------------------------------------------------------------------
[INFO] [clean:clean {execution: default-clean}]
[INFO] [enforcer:enforce {execution: enforce-plugin-versions}]
[INFO] [remote-resources:process {execution: default}]
[INFO] [resources:resources {execution: default-resources}]
[INFO] Using 'UTF-8' encoding to copy filtered resources.
[INFO] skip non existing resourceDirectory <https://builds.apache.org/job/Tuscany-2x/ws/sca-2x/modules/node-api/src/main/resources>
[INFO] Copying 3 resources
[INFO] Copying 3 resources
[INFO] [compiler:compile {execution: default-compile}]
[INFO] Compiling 19 source files to <https://builds.apache.org/job/Tuscany-2x/ws/sca-2x/modules/node-api/target/classes>
[INFO] [resources:testResources {execution: default-testResources}]
[INFO] Using 'UTF-8' encoding to copy filtered resources.
[INFO] skip non existing resourceDirectory <https://builds.apache.org/job/Tuscany-2x/ws/sca-2x/modules/node-api/src/test/resources>
[INFO] Copying 3 resources
[INFO] [compiler:testCompile {execution: default-testCompile}]
[INFO] No sources to compile
[INFO] [surefire:test {execution: default-test}]
[INFO] Surefire report directory: <https://builds.apache.org/job/Tuscany-2x/ws/sca-2x/modules/node-api/target/surefire-reports>

-------------------------------------------------------
 T E S T S
-------------------------------------------------------
There are no tests to run.

Results :

Tests run: 0, Failures: 0, Errors: 0, Skipped: 0

[JENKINS] Recording test results
[INFO] [jar:jar {execution: default-jar}]
[INFO] Building jar: <https://builds.apache.org/job/Tuscany-2x/ws/sca-2x/modules/node-api/target/tuscany-node-api-2.5-SNAPSHOT.jar>
[INFO] [source:jar-no-fork {execution: attach-sources}]
[INFO] Building jar: <https://builds.apache.org/job/Tuscany-2x/ws/sca-2x/modules/node-api/target/tuscany-node-api-2.5-SNAPSHOT-sources.jar>
[INFO] [install:install {execution: default-install}]
[INFO] Installing <https://builds.apache.org/job/Tuscany-2x/ws/sca-2x/modules/node-api/target/tuscany-node-api-2.5-SNAPSHOT.jar>
to <https://builds.apache.org/job/Tuscany-2x/ws/.repository/org/apache/tuscany/sca/tuscany-node-api/2.5-SNAPSHOT/tuscany-node-api-2.5-SNAPSHOT.jar>
[INFO] Installing <https://builds.apache.org/job/Tuscany-2x/ws/sca-2x/modules/node-api/target/tuscany-node-api-2.5-SNAPSHOT-sources.jar>
to <https://builds.apache.org/job/Tuscany-2x/ws/.repository/org/apache/tuscany/sca/tuscany-node-api/2.5-SNAPSHOT/tuscany-node-api-2.5-SNAPSHOT-sources.jar>
[JENKINS] Archiving disabled
[INFO] ------------------------------------------------------------------------
[INFO] Building Apache Tuscany SCA Core SPI
[INFO]    task-segment: [clean, install]
[INFO] ------------------------------------------------------------------------
Downloading: http://repo1.maven.org/maven2/org/codehaus/mojo/buildnumber-maven-plugin/1.0-beta-4/buildnumber-maven-plugin-1.0-beta-4.pom
9K downloaded  (buildnumber-maven-plugin-1.0-beta-4.pom)
Downloading: http://repo1.maven.org/maven2/org/codehaus/mojo/mojo-parent/22/mojo-parent-22.pom
18K downloaded  (mojo-parent-22.pom)
Downloading: http://repo1.maven.org/maven2/org/codehaus/mojo/buildnumber-maven-plugin/1.0-beta-4/buildnumber-maven-plugin-1.0-beta-4.jar
21K downloaded  (buildnumber-maven-plugin-1.0-beta-4.jar)
Downloading: http://repo1.maven.org/maven2/org/apache/maven/plugins/maven-antrun-plugin/1.7/maven-antrun-plugin-1.7.pom
4K downloaded  (maven-antrun-plugin-1.7.pom)
Downloading: http://repo1.maven.org/maven2/org/apache/maven/plugins/maven-plugins/22/maven-plugins-22.pom
12K downloaded  (maven-plugins-22.pom)
Downloading: http://repo1.maven.org/maven2/org/apache/maven/plugins/maven-antrun-plugin/1.7/maven-antrun-plugin-1.7.jar
30K downloaded  (maven-antrun-plugin-1.7.jar)
[INFO] [clean:clean {execution: default-clean}]
[INFO] [enforcer:enforce {execution: enforce-plugin-versions}]
Downloading: http://repo1.maven.org/maven2/org/apache/maven/scm/maven-scm-api/1.2/maven-scm-api-1.2.pom
1K downloaded  (maven-scm-api-1.2.pom)
Downloading: http://repo1.maven.org/maven2/org/apache/maven/scm/maven-scm/1.2/maven-scm-1.2.pom
11K downloaded  (maven-scm-1.2.pom)
Downloading: http://repo1.maven.org/maven2/org/apache/maven/scm/maven-scm-manager-plexus/1.2/maven-scm-manager-plexus-1.2.pom
2K downloaded  (maven-scm-manager-plexus-1.2.pom)
Downloading: http://repo1.maven.org/maven2/org/apache/maven/scm/maven-scm-managers/1.2/maven-scm-managers-1.2.pom
1K downloaded  (maven-scm-managers-1.2.pom)
Downloading: http://repo1.maven.org/maven2/org/apache/maven/scm/maven-scm-provider-svnexe/1.2/maven-scm-provider-svnexe-1.2.pom
2K downloaded  (maven-scm-provider-svnexe-1.2.pom)
Downloading: http://repo1.maven.org/maven2/org/apache/maven/scm/maven-scm-providers-svn/1.2/maven-scm-providers-svn-1.2.pom
1K downloaded  (maven-scm-providers-svn-1.2.pom)
Downloading: http://repo1.maven.org/maven2/org/apache/maven/scm/maven-scm-providers/1.2/maven-scm-providers-1.2.pom
3K downloaded  (maven-scm-providers-1.2.pom)
Downloading: http://svn.apache.org/repos/asf/tuscany/maven/org/apache/maven/scm/maven-scm-provider-svn-commons/1.2/maven-scm-provider-svn-commons-1.2.pom
[INFO] Unable to find resource 'org.apache.maven.scm:maven-scm-provider-svn-commons:pom:1.2'
in repository tuscany.repo (http://svn.apache.org/repos/asf/tuscany/maven)
Downloading: https://repository.apache.org/content/groups/public//org/apache/maven/scm/maven-scm-provider-svn-commons/1.2/maven-scm-provider-svn-commons-1.2.pom
[WARNING] Unable to get resource 'org.apache.maven.scm:maven-scm-provider-svn-commons:pom:1.2'
from repository apache.nexus (https://repository.apache.org/content/groups/public/): Error
transferring file: java.lang.RuntimeException: Could not generate DH keypair
Downloading: http://repo1.maven.org/maven2/org/apache/maven/scm/maven-scm-provider-svn-commons/1.2/maven-scm-provider-svn-commons-1.2.pom
1K downloaded  (maven-scm-provider-svn-commons-1.2.pom)
Downloading: http://svn.apache.org/repos/asf/tuscany/maven/regexp/regexp/1.3/regexp-1.3.pom
[INFO] Unable to find resource 'regexp:regexp:pom:1.3' in repository tuscany.repo (http://svn.apache.org/repos/asf/tuscany/maven)
Downloading: https://repository.apache.org/content/groups/public//regexp/regexp/1.3/regexp-1.3.pom
[WARNING] Unable to get resource 'regexp:regexp:pom:1.3' from repository apache.nexus (https://repository.apache.org/content/groups/public/):
Error transferring file: java.lang.RuntimeException: Could not generate DH keypair
Downloading: http://repo1.maven.org/maven2/regexp/regexp/1.3/regexp-1.3.pom
145b downloaded  (regexp-1.3.pom)
Downloading: http://repo1.maven.org/maven2/org/apache/maven/scm/maven-scm-provider-cvsexe/1.2/maven-scm-provider-cvsexe-1.2.pom
2K downloaded  (maven-scm-provider-cvsexe-1.2.pom)
Downloading: http://repo1.maven.org/maven2/org/apache/maven/scm/maven-scm-providers-cvs/1.2/maven-scm-providers-cvs-1.2.pom
1K downloaded  (maven-scm-providers-cvs-1.2.pom)
Downloading: http://svn.apache.org/repos/asf/tuscany/maven/org/apache/maven/scm/maven-scm-provider-cvs-commons/1.2/maven-scm-provider-cvs-commons-1.2.pom
[INFO] Unable to find resource 'org.apache.maven.scm:maven-scm-provider-cvs-commons:pom:1.2'
in repository tuscany.repo (http://svn.apache.org/repos/asf/tuscany/maven)
Downloading: https://repository.apache.org/content/groups/public//org/apache/maven/scm/maven-scm-provider-cvs-commons/1.2/maven-scm-provider-cvs-commons-1.2.pom
[WARNING] Unable to get resource 'org.apache.maven.scm:maven-scm-provider-cvs-commons:pom:1.2'
from repository apache.nexus (https://repository.apache.org/content/groups/public/): Error
transferring file: java.lang.RuntimeException: Could not generate DH keypair
Downloading: http://repo1.maven.org/maven2/org/apache/maven/scm/maven-scm-provider-cvs-commons/1.2/maven-scm-provider-cvs-commons-1.2.pom
2K downloaded  (maven-scm-provider-cvs-commons-1.2.pom)
Downloading: http://repo1.maven.org/maven2/org/apache/maven/scm/maven-scm-provider-starteam/1.2/maven-scm-provider-starteam-1.2.pom
2K downloaded  (maven-scm-provider-starteam-1.2.pom)
Downloading: http://repo1.maven.org/maven2/org/apache/maven/scm/maven-scm-provider-clearcase/1.2/maven-scm-provider-clearcase-1.2.pom
2K downloaded  (maven-scm-provider-clearcase-1.2.pom)
Downloading: http://repo1.maven.org/maven2/org/apache/maven/scm/maven-scm-provider-perforce/1.2/maven-scm-provider-perforce-1.2.pom
2K downloaded  (maven-scm-provider-perforce-1.2.pom)
Downloading: http://repo1.maven.org/maven2/org/apache/maven/scm/maven-scm-provider-hg/1.2/maven-scm-provider-hg-1.2.pom
2K downloaded  (maven-scm-provider-hg-1.2.pom)
Downloading: http://repo1.maven.org/maven2/com/google/code/maven-scm-provider-svnjava/maven-scm-provider-svnjava/1.8/maven-scm-provider-svnjava-1.8.pom
7K downloaded  (maven-scm-provider-svnjava-1.8.pom)
Downloading: http://svn.apache.org/repos/asf/tuscany/maven/net/java/dev/jna/jna/3.2.2/jna-3.2.2.pom
[INFO] Unable to find resource 'net.java.dev.jna:jna:pom:3.2.2' in repository tuscany.repo
(http://svn.apache.org/repos/asf/tuscany/maven)
Downloading: https://repository.apache.org/content/groups/public//net/java/dev/jna/jna/3.2.2/jna-3.2.2.pom
[WARNING] Unable to get resource 'net.java.dev.jna:jna:pom:3.2.2' from repository apache.nexus
(https://repository.apache.org/content/groups/public/): Error transferring file: java.lang.RuntimeException:
Could not generate DH keypair
Downloading: http://repo1.maven.org/maven2/net/java/dev/jna/jna/3.2.2/jna-3.2.2.pom
1K downloaded  (jna-3.2.2.pom)
Downloading: http://repo1.maven.org/maven2/org/tmatesoft/svnkit/svnkit/1.3.1-1/svnkit-1.3.1-1.pom
1K downloaded  (svnkit-1.3.1-1.pom)
Downloading: http://svn.apache.org/repos/asf/tuscany/maven/com/trilead/trilead-ssh2/build213-svnkit-1.3-patch/trilead-ssh2-build213-svnkit-1.3-patch.pom
[INFO] Unable to find resource 'com.trilead:trilead-ssh2:pom:build213-svnkit-1.3-patch' in
repository tuscany.repo (http://svn.apache.org/repos/asf/tuscany/maven)
Downloading: https://repository.apache.org/content/groups/public//com/trilead/trilead-ssh2/build213-svnkit-1.3-patch/trilead-ssh2-build213-svnkit-1.3-patch.pom
[WARNING] Unable to get resource 'com.trilead:trilead-ssh2:pom:build213-svnkit-1.3-patch'
from repository apache.nexus (https://repository.apache.org/content/groups/public/): Error
transferring file: java.lang.RuntimeException: Could not generate DH keypair
Downloading: http://repo1.maven.org/maven2/com/trilead/trilead-ssh2/build213-svnkit-1.3-patch/trilead-ssh2-build213-svnkit-1.3-patch.pom
716b downloaded  (trilead-ssh2-build213-svnkit-1.3-patch.pom)
Downloading: http://svn.apache.org/repos/asf/tuscany/maven/org/tmatesoft/sqljet/sqljet/1.0.0-1/sqljet-1.0.0-1.pom
[INFO] Unable to find resource 'org.tmatesoft.sqljet:sqljet:pom:1.0.0-1' in repository tuscany.repo
(http://svn.apache.org/repos/asf/tuscany/maven)
Downloading: https://repository.apache.org/content/groups/public//org/tmatesoft/sqljet/sqljet/1.0.0-1/sqljet-1.0.0-1.pom
[WARNING] Unable to get resource 'org.tmatesoft.sqljet:sqljet:pom:1.0.0-1' from repository
apache.nexus (https://repository.apache.org/content/groups/public/): Error transferring file:
java.lang.RuntimeException: Could not generate DH keypair
Downloading: http://repo1.maven.org/maven2/org/tmatesoft/sqljet/sqljet/1.0.0-1/sqljet-1.0.0-1.pom
774b downloaded  (sqljet-1.0.0-1.pom)
Downloading: http://svn.apache.org/repos/asf/tuscany/maven/org/antlr/antlr-runtime/3.1.3/antlr-runtime-3.1.3.pom
[INFO] Unable to find resource 'org.antlr:antlr-runtime:pom:3.1.3' in repository tuscany.repo
(http://svn.apache.org/repos/asf/tuscany/maven)
Downloading: https://repository.apache.org/content/groups/public//org/antlr/antlr-runtime/3.1.3/antlr-runtime-3.1.3.pom
[WARNING] Unable to get resource 'org.antlr:antlr-runtime:pom:3.1.3' from repository apache.nexus
(https://repository.apache.org/content/groups/public/): Error transferring file: java.lang.RuntimeException:
Could not generate DH keypair
Downloading: http://repo1.maven.org/maven2/org/antlr/antlr-runtime/3.1.3/antlr-runtime-3.1.3.pom
3K downloaded  (antlr-runtime-3.1.3.pom)
Downloading: http://svn.apache.org/repos/asf/tuscany/maven/org/antlr/antlr-master/3.1.3/antlr-master-3.1.3.pom
[INFO] Unable to find resource 'org.antlr:antlr-master:pom:3.1.3' in repository tuscany.repo
(http://svn.apache.org/repos/asf/tuscany/maven)
Downloading: https://repository.apache.org/content/groups/public//org/antlr/antlr-master/3.1.3/antlr-master-3.1.3.pom
[WARNING] Unable to get resource 'org.antlr:antlr-master:pom:3.1.3' from repository apache.nexus
(https://repository.apache.org/content/groups/public/): Error transferring file: java.lang.RuntimeException:
Could not generate DH keypair
Downloading: http://repo1.maven.org/maven2/org/antlr/antlr-master/3.1.3/antlr-master-3.1.3.pom
8K downloaded  (antlr-master-3.1.3.pom)
Downloading: http://svn.apache.org/repos/asf/tuscany/maven/org/antlr/stringtemplate/3.2/stringtemplate-3.2.pom
[INFO] Unable to find resource 'org.antlr:stringtemplate:pom:3.2' in repository tuscany.repo
(http://svn.apache.org/repos/asf/tuscany/maven)
Downloading: https://repository.apache.org/content/groups/public//org/antlr/stringtemplate/3.2/stringtemplate-3.2.pom
[WARNING] Unable to get resource 'org.antlr:stringtemplate:pom:3.2' from repository apache.nexus
(https://repository.apache.org/content/groups/public/): Error transferring file: java.lang.RuntimeException:
Could not generate DH keypair
Downloading: http://antlr.org/antlr-snapshot/org/antlr/stringtemplate/3.2/stringtemplate-3.2.pom
[INFO] Unable to find resource 'org.antlr:stringtemplate:pom:3.2' in repository antlr-snapshot
(http://antlr.org/antlr-snapshot)
Downloading: http://repo1.maven.org/maven2/org/antlr/stringtemplate/3.2/stringtemplate-3.2.pom
1K downloaded  (stringtemplate-3.2.pom)
Downloading: http://repo1.maven.org/maven2/org/tmatesoft/svnkit/svnkit/1.3.1-1/svnkit-1.3.1-1.jar
Downloading: http://repo1.maven.org/maven2/org/apache/maven/scm/maven-scm-api/1.2/maven-scm-api-1.2.jar
Downloading: http://svn.apache.org/repos/asf/tuscany/maven/org/tmatesoft/sqljet/sqljet/1.0.0-1/sqljet-1.0.0-1.jar
Downloading: http://svn.apache.org/repos/asf/tuscany/maven/org/antlr/antlr-runtime/3.1.3/antlr-runtime-3.1.3.jar
Downloading: http://repo1.maven.org/maven2/net/java/dev/jna/jna/3.2.2/jna-3.2.2.jar
82K downloaded  (maven-scm-api-1.2.jar)
Downloading: http://svn.apache.org/repos/asf/tuscany/maven/com/trilead/trilead-ssh2/build213-svnkit-1.3-patch/trilead-ssh2-build213-svnkit-1.3-patch.jar
1882K downloaded  (svnkit-1.3.1-1.jar)
Downloading: http://repo1.maven.org/maven2/com/google/code/maven-scm-provider-svnjava/maven-scm-provider-svnjava/1.8/maven-scm-provider-svnjava-1.8.jar
43K downloaded  (maven-scm-provider-svnjava-1.8.jar)
Downloading: http://svn.apache.org/repos/asf/tuscany/maven/regexp/regexp/1.3/regexp-1.3.jar
838K downloaded  (jna-3.2.2.jar)
Downloading: http://repo1.maven.org/maven2/org/apache/maven/scm/maven-scm-manager-plexus/1.2/maven-scm-manager-plexus-1.2.jar
10K downloaded  (maven-scm-manager-plexus-1.2.jar)
[INFO] Unable to find resource 'org.antlr:antlr-runtime:jar:3.1.3' in repository tuscany.repo
(http://svn.apache.org/repos/asf/tuscany/maven)
[INFO] Unable to find resource 'org.tmatesoft.sqljet:sqljet:jar:1.0.0-1' in repository tuscany.repo
(http://svn.apache.org/repos/asf/tuscany/maven)
Downloading: https://repository.apache.org/content/groups/public//org/antlr/antlr-runtime/3.1.3/antlr-runtime-3.1.3.jar
Downloading: http://repo1.maven.org/maven2/org/apache/maven/scm/maven-scm-provider-svnexe/1.2/maven-scm-provider-svnexe-1.2.jar
Downloading: https://repository.apache.org/content/groups/public//org/tmatesoft/sqljet/sqljet/1.0.0-1/sqljet-1.0.0-1.jar
58K downloaded  (maven-scm-provider-svnexe-1.2.jar)
Downloading: http://repo1.maven.org/maven2/org/apache/maven/scm/maven-scm-provider-svn-commons/1.2/maven-scm-provider-svn-commons-1.2.jar
36K downloaded  (maven-scm-provider-svn-commons-1.2.jar)
[INFO] Unable to find resource 'com.trilead:trilead-ssh2:jar:build213-svnkit-1.3-patch' in
repository tuscany.repo (http://svn.apache.org/repos/asf/tuscany/maven)
Downloading: https://repository.apache.org/content/groups/public//com/trilead/trilead-ssh2/build213-svnkit-1.3-patch/trilead-ssh2-build213-svnkit-1.3-patch.jar
Downloading: http://repo1.maven.org/maven2/org/apache/maven/scm/maven-scm-provider-cvsexe/1.2/maven-scm-provider-cvsexe-1.2.jar
26K downloaded  (maven-scm-provider-cvsexe-1.2.jar)
Downloading: http://svn.apache.org/repos/asf/tuscany/maven/org/apache/maven/scm/maven-scm-provider-cvs-commons/1.2/maven-scm-provider-cvs-commons-1.2.jar
[INFO] Unable to find resource 'regexp:regexp:jar:1.3' in repository tuscany.repo (http://svn.apache.org/repos/asf/tuscany/maven)
Downloading: https://repository.apache.org/content/groups/public//regexp/regexp/1.3/regexp-1.3.jar
[INFO] Unable to find resource 'org.apache.maven.scm:maven-scm-provider-cvs-commons:jar:1.2'
in repository tuscany.repo (http://svn.apache.org/repos/asf/tuscany/maven)
Downloading: https://repository.apache.org/content/groups/public//org/apache/maven/scm/maven-scm-provider-cvs-commons/1.2/maven-scm-provider-cvs-commons-1.2.jar
[WARNING] Unable to get resource 'org.antlr:antlr-runtime:jar:3.1.3' from repository apache.nexus
(https://repository.apache.org/content/groups/public/): Error transferring file: java.lang.RuntimeException:
Could not generate DH keypair
[WARNING] Unable to get resource 'org.tmatesoft.sqljet:sqljet:jar:1.0.0-1' from repository
apache.nexus (https://repository.apache.org/content/groups/public/): Error transferring file:
java.lang.RuntimeException: Could not generate DH keypair
Downloading: http://repo1.maven.org/maven2/org/antlr/antlr-runtime/3.1.3/antlr-runtime-3.1.3.jar
Downloading: http://repo1.maven.org/maven2/org/tmatesoft/sqljet/sqljet/1.0.0-1/sqljet-1.0.0-1.jar
147K downloaded  (antlr-runtime-3.1.3.jar)
656K downloaded  (sqljet-1.0.0-1.jar)
Downloading: http://svn.apache.org/repos/asf/tuscany/maven/org/antlr/stringtemplate/3.2/stringtemplate-3.2.jar
[WARNING] Unable to get resource 'com.trilead:trilead-ssh2:jar:build213-svnkit-1.3-patch'
from repository apache.nexus (https://repository.apache.org/content/groups/public/): Error
transferring file: java.lang.RuntimeException: Could not generate DH keypair
Downloading: http://repo1.maven.org/maven2/com/trilead/trilead-ssh2/build213-svnkit-1.3-patch/trilead-ssh2-build213-svnkit-1.3-patch.jar
245K downloaded  (trilead-ssh2-build213-svnkit-1.3-patch.jar)
[WARNING] Unable to get resource 'regexp:regexp:jar:1.3' from repository apache.nexus (https://repository.apache.org/content/groups/public/):
Error transferring file: java.lang.RuntimeException: Could not generate DH keypair
Downloading: http://repo1.maven.org/maven2/regexp/regexp/1.3/regexp-1.3.jar
24K downloaded  (regexp-1.3.jar)
[INFO] Unable to find resource 'org.antlr:stringtemplate:jar:3.2' in repository tuscany.repo
(http://svn.apache.org/repos/asf/tuscany/maven)
Downloading: https://repository.apache.org/content/groups/public//org/antlr/stringtemplate/3.2/stringtemplate-3.2.jar
[WARNING] Unable to get resource 'org.apache.maven.scm:maven-scm-provider-cvs-commons:jar:1.2'
from repository apache.nexus (https://repository.apache.org/content/groups/public/): Error
transferring file: java.lang.RuntimeException: Could not generate DH keypair
Downloading: http://repo1.maven.org/maven2/org/apache/maven/scm/maven-scm-provider-cvs-commons/1.2/maven-scm-provider-cvs-commons-1.2.jar
69K downloaded  (maven-scm-provider-cvs-commons-1.2.jar)
Downloading: http://repo1.maven.org/maven2/org/apache/maven/scm/maven-scm-provider-starteam/1.2/maven-scm-provider-starteam-1.2.jar
69K downloaded  (maven-scm-provider-starteam-1.2.jar)
Downloading: http://repo1.maven.org/maven2/org/apache/maven/scm/maven-scm-provider-clearcase/1.2/maven-scm-provider-clearcase-1.2.jar
62K downloaded  (maven-scm-provider-clearcase-1.2.jar)
Downloading: http://repo1.maven.org/maven2/org/apache/maven/scm/maven-scm-provider-perforce/1.2/maven-scm-provider-perforce-1.2.jar
66K downloaded  (maven-scm-provider-perforce-1.2.jar)
Downloading: http://repo1.maven.org/maven2/org/apache/maven/scm/maven-scm-provider-hg/1.2/maven-scm-provider-hg-1.2.jar
51K downloaded  (maven-scm-provider-hg-1.2.jar)
[WARNING] Unable to get resource 'org.antlr:stringtemplate:jar:3.2' from repository apache.nexus
(https://repository.apache.org/content/groups/public/): Error transferring file: java.lang.RuntimeException:
Could not generate DH keypair
Downloading: http://antlr.org/antlr-snapshot/org/antlr/stringtemplate/3.2/stringtemplate-3.2.jar
[INFO] Unable to find resource 'org.antlr:stringtemplate:jar:3.2' in repository antlr-snapshot
(http://antlr.org/antlr-snapshot)
Downloading: http://repo1.maven.org/maven2/org/antlr/stringtemplate/3.2/stringtemplate-3.2.jar
167K downloaded  (stringtemplate-3.2.jar)
[INFO] [buildnumber:create {execution: default}]
[INFO] Checking for local modifications: skipped.
[INFO] Executing: /bin/sh -c cd <https://builds.apache.org/job/Tuscany-2x/ws/sca-2x/modules/core-spi>
&& svn --non-interactive update <https://builds.apache.org/job/Tuscany-2x/ws/sca-2x/modules/core-spi>
[INFO] Working directory: <https://builds.apache.org/job/Tuscany-2x/ws/sca-2x/modules/core-spi>
Provider message:
The svn command failed.
Command output:
svn: SSL is not supported

[JENKINS] Archiving disabled
[INFO] ------------------------------------------------------------------------
[ERROR] BUILD ERROR
[INFO] ------------------------------------------------------------------------
[INFO] Couldn't update project.

Embedded error: Error!
[INFO] ------------------------------------------------------------------------
[INFO] For more information, run Maven with the -e switch
[INFO] ------------------------------------------------------------------------
[INFO] Total time: 2 minutes 57 seconds
[INFO] Finished at: Mon Aug 10 18:56:13 UTC 2015
[INFO] Final Memory: 97M/901M
[INFO] ------------------------------------------------------------------------
channel stopped

Mime
View raw message