uima-dev mailing list archives

Site index · List index
Message view « Date » · « Thread »
Top « Date » · « Thread »
From "Tommaso Teofili (JIRA)" <...@uima.apache.org>
Subject [jira] Commented: (UIMA-2003) WhitespaceTokenizerPerfTest failure in sandbox Last Changed Rev: 1056535
Date Sun, 06 Mar 2011 08:13:45 GMT

    [ https://issues.apache.org/jira/browse/UIMA-2003?page=com.atlassian.jira.plugin.system.issuetabpanels:comment-tabpanel&focusedCommentId=13003116#comment-13003116
] 

Tommaso Teofili commented on UIMA-2003:
---------------------------------------

I've gone through these tests on different platforms and can't seem to be able to reproduce
the error, Florent could you please post information as requested by Marshall ? Thanks :)

> WhitespaceTokenizerPerfTest failure in sandbox Last Changed Rev: 1056535
> ------------------------------------------------------------------------
>
>                 Key: UIMA-2003
>                 URL: https://issues.apache.org/jira/browse/UIMA-2003
>             Project: UIMA
>          Issue Type: Bug
>          Components: Sandbox
>            Reporter: Florent ANDRE
>
> === error
> -------------------------------------------------------
>  T E S T S
> -------------------------------------------------------
> Running org.apache.uima.annotator.WhitespaceTokenizerPerfTest
> Tests run: 1, Failures: 1, Errors: 0, Skipped: 0, Time elapsed: 0.046 sec <<<
FAILURE!
> Running org.apache.uima.annotator.WhitespaceTokTest
> Tests run: 3, Failures: 0, Errors: 3, Skipped: 0, Time elapsed: 0.181 sec <<<
FAILURE!
> Results :
> Failed tests: 
>   testEnglishProcessingTest(org.apache.uima.annotator.WhitespaceTokenizerPerfTest)
> Tests in error: 
>   testAnnotatorSpecial(org.apache.uima.annotator.WhitespaceTokTest)
>   testAnnotatorEnglish(org.apache.uima.annotator.WhitespaceTokTest)
>   testAnnotatorTabs(org.apache.uima.annotator.WhitespaceTokTest)
> Tests run: 4, Failures: 1, Errors: 3, Skipped: 0
> [INFO] ------------------------------------------------------------------------
> [ERROR] BUILD FAILURE
> [INFO] ------------------------------------------------------------------------
> [INFO] There are test failures.
> == command : 
> - cd sandbox/aggregate-addons
> - mvn install
> == svn info : 
> URL: http://svn.apache.org/repos/asf/uima/sandbox/trunk
> Repository Root: http://svn.apache.org/repos/asf
> Repository UUID: 13f79535-47bb-0310-9956-ffa450edef68
> Revision: 1058796
> Node Kind: directory
> Schedule: normal
> Last Changed Author: tommaso
> Last Changed Rev: 1056535
> Last Changed Date: 2011-01-07 23:15:36 +0100 (Fri, 07 Jan 2011)

-- 
This message is automatically generated by JIRA.
-
For more information on JIRA, see: http://www.atlassian.com/software/jira

        

Mime
View raw message