uima-dev mailing list archives

Site index · List index
Message view « Date » · « Thread »
Top « Date » · « Thread »
From Apache Hudson Server <hud...@hudson.apache.org>
Subject Build failed in Jenkins: UIMA-SDK #20
Date Tue, 29 Mar 2011 11:30:21 GMT
See <https://hudson.apache.org/hudson/job/UIMA-SDK/20/changes>

Changes:

[joern] UIMA-2100 Added eclipse launcher plugin

------------------------------------------
[...truncated 3106 lines...]

Results :

Tests run: 0, Failures: 0, Errors: 0, Skipped: 0

[JENKINS] Recording test results
[INFO] 
[INFO] --- maven-jar-plugin:2.3.1:jar (default-jar) @ uimaj-ep-jcasgen ---
[INFO] Building jar: <https://hudson.apache.org/hudson/job/UIMA-SDK/ws/trunk/uimaj-ep-jcasgen/target/org.apache.uima.jcas.jcasgenp_2.3.2.SNAPSHOT.jar>
[INFO] 
[INFO] --- maven-install-plugin:2.3:install (default-install) @ uimaj-ep-jcasgen ---
[INFO] Installing <https://hudson.apache.org/hudson/job/UIMA-SDK/ws/trunk/uimaj-ep-jcasgen/target/org.apache.uima.jcas.jcasgenp_2.3.2.SNAPSHOT.jar>
to /export/home/hudson/.m2/repository/org/apache/uima/uimaj-ep-jcasgen/2.3.2-SNAPSHOT/uimaj-ep-jcasgen-2.3.2-SNAPSHOT.jar
[INFO] Installing <https://hudson.apache.org/hudson/job/UIMA-SDK/ws/trunk/uimaj-ep-jcasgen/pom.xml>
to /export/home/hudson/.m2/repository/org/apache/uima/uimaj-ep-jcasgen/2.3.2-SNAPSHOT/uimaj-ep-jcasgen-2.3.2-SNAPSHOT.pom
projectSucceeded org.apache.uima:uimaj-ep-jcasgen:2.3.2-SNAPSHOT
[JENKINS] Archiving <https://hudson.apache.org/hudson/job/UIMA-SDK/ws/trunk/uimaj-ep-jcasgen/pom.xml>
to /home/hudson/hudson/jobs/UIMA-SDK/modules/org.apache.uima$uimaj-ep-jcasgen/builds/2011-03-29_11-24-16/archive/org.apache.uima/uimaj-ep-jcasgen/2.3.2-SNAPSHOT/pom.xml
[JENKINS] Archiving <https://hudson.apache.org/hudson/job/UIMA-SDK/ws/trunk/uimaj-ep-jcasgen/target/org.apache.uima.jcas.jcasgenp_2.3.2.SNAPSHOT.jar>
to /home/hudson/hudson/jobs/UIMA-SDK/modules/org.apache.uima$uimaj-ep-jcasgen/builds/2011-03-29_11-24-16/archive/org.apache.uima/uimaj-ep-jcasgen/2.3.2-SNAPSHOT/org.apache.uima.jcas.jcasgenp_2.3.2.SNAPSHOT.jar
[INFO]                                                                         
[INFO] ------------------------------------------------------------------------
[INFO] Building UIMA Eclipse: uimaj-ep-configurator: Descriptor Editor 2.3.2-SNAPSHOT
[INFO] ------------------------------------------------------------------------
[INFO] [INFO] Deleting file set: <https://hudson.apache.org/hudson/job/UIMA-SDK/ws/trunk/uimaj-ep-configurator/target>
(included: [**], excluded: [])

[INFO] --- maven-clean-plugin:2.3:clean (default-clean) @ uimaj-ep-configurator ---
[INFO] 
[INFO] --- build-helper-maven-plugin:1.5:parse-version (parse-project-version) @ uimaj-ep-configurator
---
[INFO] 
[INFO] --- uima-build-helper-maven-plugin:2:parse-date-time (set buildYear and buildMonth)
@ uimaj-ep-configurator ---
[INFO] 
[INFO] --- maven-remote-resources-plugin:1.1:process (default) @ uimaj-ep-configurator ---
[INFO] [INFO] Using 'UTF-8' encoding to copy filtered resources.

[INFO] --- maven-resources-plugin:2.4.3:resources (default-resources) @ uimaj-ep-configurator
---
[INFO] Copying 16 resources
[INFO] Copying 1 resource
[INFO] Copying 3 resources
[INFO] 
[INFO] --- maven-compiler-plugin:2.3.1:compile (default-compile) @ uimaj-ep-configurator ---
[INFO] Compiling 120 source files to <https://hudson.apache.org/hudson/job/UIMA-SDK/ws/trunk/uimaj-ep-configurator/target/classes>
[INFO] 
[INFO] --- maven-bundle-plugin:2.1.0:manifest (uima-bundle) @ uimaj-ep-configurator ---
[INFO] [INFO] Using 'UTF-8' encoding to copy filtered resources.
[INFO] skip non existing resourceDirectory <https://hudson.apache.org/hudson/job/UIMA-SDK/ws/trunk/uimaj-ep-configurator/src/test/resources>

[INFO] --- maven-resources-plugin:2.4.3:testResources (default-testResources) @ uimaj-ep-configurator
---[INFO] Copying 3 resources

[INFO] 
[INFO] --- maven-compiler-plugin:2.3.1:testCompile (default-testCompile) @ uimaj-ep-configurator
---
[INFO] No sources to compile
[INFO] 
[INFO] --- maven-surefire-plugin:2.4.3:test (default-test) @ uimaj-ep-configurator ---
[INFO] Surefire report directory: <https://hudson.apache.org/hudson/job/UIMA-SDK/ws/trunk/uimaj-ep-configurator/target/surefire-reports>

-------------------------------------------------------
 T E S T S
-------------------------------------------------------
There are no tests to run.

Results :

Tests run: 0, Failures: 0, Errors: 0, Skipped: 0

[JENKINS] Recording test results
[INFO] 
[INFO] --- maven-jar-plugin:2.3.1:jar (default-jar) @ uimaj-ep-configurator ---
[INFO] Building jar: <https://hudson.apache.org/hudson/job/UIMA-SDK/ws/trunk/uimaj-ep-configurator/target/org.apache.uima.desceditor_2.3.2.SNAPSHOT.jar>
[INFO] 
[INFO] --- maven-install-plugin:2.3:install (default-install) @ uimaj-ep-configurator ---
[INFO] Installing <https://hudson.apache.org/hudson/job/UIMA-SDK/ws/trunk/uimaj-ep-configurator/target/org.apache.uima.desceditor_2.3.2.SNAPSHOT.jar>
to /export/home/hudson/.m2/repository/org/apache/uima/uimaj-ep-configurator/2.3.2-SNAPSHOT/uimaj-ep-configurator-2.3.2-SNAPSHOT.jar
[INFO] Installing <https://hudson.apache.org/hudson/job/UIMA-SDK/ws/trunk/uimaj-ep-configurator/pom.xml>
to /export/home/hudson/.m2/repository/org/apache/uima/uimaj-ep-configurator/2.3.2-SNAPSHOT/uimaj-ep-configurator-2.3.2-SNAPSHOT.pom
projectSucceeded org.apache.uima:uimaj-ep-configurator:2.3.2-SNAPSHOT
[JENKINS] Archiving <https://hudson.apache.org/hudson/job/UIMA-SDK/ws/trunk/uimaj-ep-configurator/pom.xml>
to /home/hudson/hudson/jobs/UIMA-SDK/modules/org.apache.uima$uimaj-ep-configurator/builds/2011-03-29_11-24-16/archive/org.apache.uima/uimaj-ep-configurator/2.3.2-SNAPSHOT/pom.xml
[JENKINS] Archiving <https://hudson.apache.org/hudson/job/UIMA-SDK/ws/trunk/uimaj-ep-configurator/target/org.apache.uima.desceditor_2.3.2.SNAPSHOT.jar>
to /home/hudson/hudson/jobs/UIMA-SDK/modules/org.apache.uima$uimaj-ep-configurator/builds/2011-03-29_11-24-16/archive/org.apache.uima/uimaj-ep-configurator/2.3.2-SNAPSHOT/org.apache.uima.desceditor_2.3.2.SNAPSHOT.jar
[INFO]                                                                         
[INFO] ------------------------------------------------------------------------
[INFO] Building UIMA Eclipse: uimaj-ep-pear-packager 2.3.2-SNAPSHOT
[INFO] ------------------------------------------------------------------------
[INFO] 
[INFO] --- maven-clean-plugin:2.3:clean (default-clean) @ uimaj-ep-pear-packager ---
[INFO] Deleting file set: <https://hudson.apache.org/hudson/job/UIMA-SDK/ws/trunk/uimaj-ep-pear-packager/target>
(included: [**], excluded: [])
[INFO] 
[INFO] --- build-helper-maven-plugin:1.5:parse-version (parse-project-version) @ uimaj-ep-pear-packager
---
[INFO] 
[INFO] --- uima-build-helper-maven-plugin:2:parse-date-time (set buildYear and buildMonth)
@ uimaj-ep-pear-packager ---
[INFO] 
[INFO] --- maven-remote-resources-plugin:1.1:process (default) @ uimaj-ep-pear-packager ---
[INFO] [INFO] Using 'UTF-8' encoding to copy filtered resources.

[INFO] --- maven-resources-plugin:2.4.3:resources (default-resources) @ uimaj-ep-pear-packager
---
[INFO] Copying 9 resources
[INFO] Copying 1 resource
[INFO] Copying 3 resources
[INFO] 
[INFO] --- maven-compiler-plugin:2.3.1:compile (default-compile) @ uimaj-ep-pear-packager
---
[INFO] Compiling 26 source files to <https://hudson.apache.org/hudson/job/UIMA-SDK/ws/trunk/uimaj-ep-pear-packager/target/classes>
[INFO] 
[INFO] --- maven-bundle-plugin:2.1.0:manifest (uima-bundle) @ uimaj-ep-pear-packager ---
[INFO] [INFO] Using 'UTF-8' encoding to copy filtered resources.
[INFO] skip non existing resourceDirectory <https://hudson.apache.org/hudson/job/UIMA-SDK/ws/trunk/uimaj-ep-pear-packager/src/test/resources>
[INFO] Copying 3 resources

[INFO] --- maven-resources-plugin:2.4.3:testResources (default-testResources) @ uimaj-ep-pear-packager
---
[INFO] [INFO] No sources to compile

[INFO] --- maven-compiler-plugin:2.3.1:testCompile (default-testCompile) @ uimaj-ep-pear-packager
---
[INFO] 
[INFO] --- maven-surefire-plugin:2.4.3:test (default-test) @ uimaj-ep-pear-packager ---
[INFO] Surefire report directory: <https://hudson.apache.org/hudson/job/UIMA-SDK/ws/trunk/uimaj-ep-pear-packager/target/surefire-reports>

-------------------------------------------------------
 T E S T S
-------------------------------------------------------
There are no tests to run.

Results :

Tests run: 0, Failures: 0, Errors: 0, Skipped: 0

[JENKINS] Recording test results
[INFO] 
[INFO] --- maven-jar-plugin:2.3.1:jar (default-jar) @ uimaj-ep-pear-packager ---
[INFO] Building jar: <https://hudson.apache.org/hudson/job/UIMA-SDK/ws/trunk/uimaj-ep-pear-packager/target/org.apache.uima.pear_2.3.2.SNAPSHOT.jar>
[INFO] 
[INFO] [INFO] Installing <https://hudson.apache.org/hudson/job/UIMA-SDK/ws/trunk/uimaj-ep-pear-packager/target/org.apache.uima.pear_2.3.2.SNAPSHOT.jar>
to /export/home/hudson/.m2/repository/org/apache/uima/uimaj-ep-pear-packager/2.3.2-SNAPSHOT/uimaj-ep-pear-packager-2.3.2-SNAPSHOT.jar
--- maven-install-plugin:2.3:install (default-install) @ uimaj-ep-pear-packager ---
[INFO] Installing <https://hudson.apache.org/hudson/job/UIMA-SDK/ws/trunk/uimaj-ep-pear-packager/pom.xml>
to /export/home/hudson/.m2/repository/org/apache/uima/uimaj-ep-pear-packager/2.3.2-SNAPSHOT/uimaj-ep-pear-packager-2.3.2-SNAPSHOT.pom
projectSucceeded org.apache.uima:uimaj-ep-pear-packager:2.3.2-SNAPSHOT
[JENKINS] Archiving <https://hudson.apache.org/hudson/job/UIMA-SDK/ws/trunk/uimaj-ep-pear-packager/pom.xml>
to /home/hudson/hudson/jobs/UIMA-SDK/modules/org.apache.uima$uimaj-ep-pear-packager/builds/2011-03-29_11-24-16/archive/org.apache.uima/uimaj-ep-pear-packager/2.3.2-SNAPSHOT/pom.xml
[JENKINS] Archiving <https://hudson.apache.org/hudson/job/UIMA-SDK/ws/trunk/uimaj-ep-pear-packager/target/org.apache.uima.pear_2.3.2.SNAPSHOT.jar>
to /home/hudson/hudson/jobs/UIMA-SDK/modules/org.apache.uima$uimaj-ep-pear-packager/builds/2011-03-29_11-24-16/archive/org.apache.uima/uimaj-ep-pear-packager/2.3.2-SNAPSHOT/org.apache.uima.pear_2.3.2.SNAPSHOT.jar
[INFO]                                                                         
[INFO] ------------------------------------------------------------------------
[INFO] Building UIMA Eclipse: uimaj-ep-launcher 2.3.2-SNAPSHOT
[INFO] ------------------------------------------------------------------------
[INFO] 
[INFO] --- maven-clean-plugin:2.3:clean (default-clean) @ uimaj-ep-launcher ---
[INFO] 
[INFO] --- build-helper-maven-plugin:1.5:parse-version (parse-project-version) @ uimaj-ep-launcher
---
[INFO] 
[INFO] --- uima-build-helper-maven-plugin:2:parse-date-time (set buildYear and buildMonth)
@ uimaj-ep-launcher ---
[INFO] 
[INFO] --- maven-remote-resources-plugin:1.1:process (default) @ uimaj-ep-launcher ---
[INFO] [INFO] Using 'UTF-8' encoding to copy filtered resources.

[INFO] --- maven-resources-plugin:2.4.3:resources (default-resources) @ uimaj-ep-launcher
---[INFO] Copying 1 resource

[INFO] skip non existing resourceDirectory <https://hudson.apache.org/hudson/job/UIMA-SDK/ws/trunk/uimaj-ep-launcher/src/main/resources>
[INFO] Copying 3 resources
[INFO] 
[INFO] --- maven-compiler-plugin:2.3.1:compile (default-compile) @ uimaj-ep-launcher ---
[INFO] Compiling 6 source files to <https://hudson.apache.org/hudson/job/UIMA-SDK/ws/trunk/uimaj-ep-launcher/target/classes>
[INFO] -------------------------------------------------------------
[ERROR] COMPILATION ERROR : 
[INFO] -------------------------------------------------------------
[ERROR] <https://hudson.apache.org/hudson/job/UIMA-SDK/ws/trunk/uimaj-ep-launcher/src/main/java/org/apache/uima/ep_launcher/RemoteLauncher.java>:[157,16]
cannot find symbol
symbol  : constructor IOException(org.xml.sax.SAXException)
location: class java.io.IOException

[ERROR] <https://hudson.apache.org/hudson/job/UIMA-SDK/ws/trunk/uimaj-ep-launcher/src/main/java/org/apache/uima/ep_launcher/RemoteLauncher.java>:[167,16]
cannot find symbol
symbol  : constructor IOException(org.xml.sax.SAXException)
location: class java.io.IOException

[ERROR] <https://hudson.apache.org/hudson/job/UIMA-SDK/ws/trunk/uimaj-ep-launcher/src/main/java/org/apache/uima/ep_launcher/RemoteLauncher.java>:[216,16]
cannot find symbol
symbol  : constructor IOException(org.xml.sax.SAXException)
location: class java.io.IOException

[INFO] 3 errors 
[INFO] -------------------------------------------------------------
mojoFailed org.apache.maven.plugins:maven-compiler-plugin:2.3.1(default-compile)
projectFailed org.apache.uima:uimaj-ep-launcher:2.3.2-SNAPSHOT
[JENKINS] Archiving <https://hudson.apache.org/hudson/job/UIMA-SDK/ws/trunk/uimaj-ep-launcher/pom.xml>
to /home/hudson/hudson/jobs/UIMA-SDK/modules/org.apache.uima$uimaj-ep-launcher/builds/2011-03-29_11-24-16/archive/org.apache.uima/uimaj-ep-launcher/2.3.2-SNAPSHOT/pom.xml
sessionEnded
[INFO] ------------------------------------------------------------------------
[INFO] Reactor Summary:
[INFO] 
[INFO] UIMA Java SDK: uimaj-parent ....................... SUCCESS [8.238s]
[INFO] UIMA Base: uimaj-test-util: JUnit utilities ....... SUCCESS [5.248s]
[INFO] UIMA Base: uimaj-core ............................. SUCCESS [2:12.680s]
[INFO] UIMA Base: jVinci: Vinci Transport Library ........ SUCCESS [10.353s]
[INFO] UIMA Base: uimaj-adapter-vinci: Vinci Adapter ..... SUCCESS [11.426s]
[INFO] UIMA Base: uimaj-cpe: Collection Processing Engine  SUCCESS [1:00.722s]
[INFO] UIMA Base: uimaj-document-annotation .............. SUCCESS [6.171s]
[INFO] UIMA Base: uimaj-tools: Tools ..................... SUCCESS [21.535s]
[INFO] UIMA Base: uimaj-examples: SDK Examples ........... SUCCESS [10.658s]
[INFO] UIMA Base: uimaj-adapter-soap: SOAP Adapter ....... SUCCESS [9.117s]
[INFO] UIMA Base: uimaj-component-test-util: for JUnit ... SUCCESS [3.892s]
[INFO] UIMA Eclipse: uimaj-ep-debug ...................... SUCCESS [25.203s]
[INFO] UIMA Eclipse: uimaj-ep-jcasgen .................... SUCCESS [6.601s]
[INFO] UIMA Eclipse: uimaj-ep-configurator: Descriptor Editor  SUCCESS [15.071s]
[INFO] UIMA Eclipse: uimaj-ep-pear-packager .............. SUCCESS [7.663s]
[INFO] UIMA Eclipse: uimaj-ep-launcher ................... FAILURE [4.000s]
[INFO] UIMA Eclipse: uimaj-ep-cas-editor ................. SKIPPED
[INFO] UIMA Eclipse: uimaj-ep-runtime .................... SKIPPED
[INFO] UIMA Eclipse: uimaj-eclipse-feature-tools ......... SKIPPED
[INFO] UIMA Eclipse: uimaj-eclipse-feature-runtime ....... SKIPPED
[INFO] UIMA Aggregate: aggregate-uimaj-eclipse-plugins ... SKIPPED
[INFO] Apache UIMA SDK Documentation - overview and setup  SKIPPED
[INFO] Apache UIMA SDK Documentation - references ........ SKIPPED
[INFO] Apache UIMA SDK Documentation - tools ............. SKIPPED
[INFO] Apache UIMA SDK Documentation - tutorials and user's guides  SKIPPED
[INFO] UIMA Aggregate POM aggregate-uimaj-docbooks: UIMA Base  SKIPPED
[INFO] UIMA Maven Plugin PearPackagingMavenPlugin ........ SKIPPED
[INFO] UIMA Base: uimaj-bootstrap: Bootstrap launcher .... SKIPPED
[INFO] UIMA Aggregate: aggregate-uimaj: UIMA Base ........ SKIPPED
[INFO] UIMA Base: uimaj-distr ............................ SKIPPED
[INFO] UIMA Java SDK: uimaj .............................. SKIPPED
[INFO] ------------------------------------------------------------------------
[INFO] BUILD FAILURE
[INFO] ------------------------------------------------------------------------
[INFO] Total time: 5:59.072s
[INFO] Finished at: Tue Mar 29 07:30:20 EDT 2011
[INFO] Final Memory: 36M/183M
[INFO] ------------------------------------------------------------------------
mavenExecutionResult exceptions not empty
org.apache.maven.lifecycle.LifecycleExecutionException: Failed to execute goal org.apache.maven.plugins:maven-compiler-plugin:2.3.1:compile
(default-compile) on project uimaj-ep-launcher: Compilation failure
	at org.apache.maven.lifecycle.internal.MojoExecutor.execute(MojoExecutor.java:213)
	at org.apache.maven.lifecycle.internal.MojoExecutor.execute(MojoExecutor.java:153)
	at org.apache.maven.lifecycle.internal.MojoExecutor.execute(MojoExecutor.java:145)
	at org.apache.maven.lifecycle.internal.LifecycleModuleBuilder.buildProject(LifecycleModuleBuilder.java:84)
	at org.apache.maven.lifecycle.internal.LifecycleModuleBuilder.buildProject(LifecycleModuleBuilder.java:59)
	at org.apache.maven.lifecycle.internal.LifecycleStarter.singleThreadedBuild(LifecycleStarter.java:183)
	at org.apache.maven.lifecycle.internal.LifecycleStarter.execute(LifecycleStarter.java:161)
	at org.apache.maven.DefaultMaven.doExecute(DefaultMaven.java:319)
	at org.apache.maven.DefaultMaven.execute(DefaultMaven.java:156)
	at org.jvnet.hudson.maven3.launcher.Maven3Launcher.main(Maven3Launcher.java:79)
	at sun.reflect.NativeMethodAccessorImpl.invoke0(Native Method)
	at sun.reflect.NativeMethodAccessorImpl.invoke(NativeMethodAccessorImpl.java:39)
	at sun.reflect.DelegatingMethodAccessorImpl.invoke(DelegatingMethodAccessorImpl.java:25)
	at java.lang.reflect.Method.invoke(Method.java:592)
	at org.codehaus.plexus.classworlds.launcher.Launcher.launchStandard(Launcher.java:329)
	at org.codehaus.plexus.classworlds.launcher.Launcher.launch(Launcher.java:239)
	at org.jvnet.hudson.maven3.agent.Maven3Main.launch(Maven3Main.java:146)
	at hudson.maven.Maven3Builder.call(Maven3Builder.java:124)
	at hudson.maven.Maven3Builder.call(Maven3Builder.java:71)
	at hudson.remoting.UserRequest.perform(UserRequest.java:114)
	at hudson.remoting.UserRequest.perform(UserRequest.java:48)
	at hudson.remoting.Request$2.run(Request.java:270)
	at java.util.concurrent.Executors$RunnableAdapter.call(Executors.java:417)
	at java.util.concurrent.FutureTask$Sync.innerRun(FutureTask.java:269)
	at java.util.concurrent.FutureTask.run(FutureTask.java:123)
	at java.util.concurrent.ThreadPoolExecutor$Worker.runTask(ThreadPoolExecutor.java:651)
	at java.util.concurrent.ThreadPoolExecutor$Worker.run(ThreadPoolExecutor.java:676)
	at java.lang.Thread.run(Thread.java:595)
Caused by: org.apache.maven.plugin.CompilationFailureException: Compilation failure
	at org.apache.maven.plugin.AbstractCompilerMojo.execute(AbstractCompilerMojo.java:656)
	at org.apache.maven.plugin.CompilerMojo.execute(CompilerMojo.java:128)
	at org.apache.maven.plugin.DefaultBuildPluginManager.executeMojo(DefaultBuildPluginManager.java:107)
	at org.apache.maven.lifecycle.internal.MojoExecutor.execute(MojoExecutor.java:209)
	... 27 more
Sending e-mails to: dev@uima.apache.org
channel stopped


Mime
View raw message