uima-dev mailing list archives

Site index · List index
Message view « Date » · « Thread »
Top « Date » · « Thread »
From "Marshall Schor (JIRA)" <...@uima.apache.org>
Subject [jira] Commented: (UIMA-2003) WhitespaceTokenizerPerfTest failure in sandbox Last Changed Rev: 1056535
Date Mon, 07 Mar 2011 19:35:59 GMT

    [ https://issues.apache.org/jira/browse/UIMA-2003?page=com.atlassian.jira.plugin.system.issuetabpanels:comment-tabpanel&focusedCommentId=13003529#comment-13003529
] 

Marshall Schor commented on UIMA-2003:
--------------------------------------

I'm guessing that this is a maven version issue.

We have a stanza in our maven which says:
  <prerequisites>
    <!-- 2.2.0 is broken when deploying - checksums invalid -->
    <!-- 2.2.1 doesn't work -->
    <maven>3.0</maven>
  </prerequisites>

I thought maven would complain if you used an earlier version, but I guess it doesn't.

I see from the above that you are using 2.2.1.

Can you try maven 3.0 or later and see if this problem goes away?


 

> WhitespaceTokenizerPerfTest failure in sandbox Last Changed Rev: 1056535
> ------------------------------------------------------------------------
>
>                 Key: UIMA-2003
>                 URL: https://issues.apache.org/jira/browse/UIMA-2003
>             Project: UIMA
>          Issue Type: Bug
>          Components: Sandbox
>            Reporter: Florent ANDRE
>
> === error
> -------------------------------------------------------
>  T E S T S
> -------------------------------------------------------
> Running org.apache.uima.annotator.WhitespaceTokenizerPerfTest
> Tests run: 1, Failures: 1, Errors: 0, Skipped: 0, Time elapsed: 0.046 sec <<<
FAILURE!
> Running org.apache.uima.annotator.WhitespaceTokTest
> Tests run: 3, Failures: 0, Errors: 3, Skipped: 0, Time elapsed: 0.181 sec <<<
FAILURE!
> Results :
> Failed tests: 
>   testEnglishProcessingTest(org.apache.uima.annotator.WhitespaceTokenizerPerfTest)
> Tests in error: 
>   testAnnotatorSpecial(org.apache.uima.annotator.WhitespaceTokTest)
>   testAnnotatorEnglish(org.apache.uima.annotator.WhitespaceTokTest)
>   testAnnotatorTabs(org.apache.uima.annotator.WhitespaceTokTest)
> Tests run: 4, Failures: 1, Errors: 3, Skipped: 0
> [INFO] ------------------------------------------------------------------------
> [ERROR] BUILD FAILURE
> [INFO] ------------------------------------------------------------------------
> [INFO] There are test failures.
> == command : 
> - cd sandbox/aggregate-addons
> - mvn install
> == svn info : 
> URL: http://svn.apache.org/repos/asf/uima/sandbox/trunk
> Repository Root: http://svn.apache.org/repos/asf
> Repository UUID: 13f79535-47bb-0310-9956-ffa450edef68
> Revision: 1058796
> Node Kind: directory
> Schedule: normal
> Last Changed Author: tommaso
> Last Changed Rev: 1056535
> Last Changed Date: 2011-01-07 23:15:36 +0100 (Fri, 07 Jan 2011)

--
This message is automatically generated by JIRA.
For more information on JIRA, see: http://www.atlassian.com/software/jira

Mime
View raw message