uima-dev mailing list archives

Site index · List index
Message view « Date » · « Thread »
Top « Date » · « Thread »
From Marshall Schor <...@schor.com>
Subject Re: Build failed in Jenkins: UIMA-AS #39
Date Fri, 04 Mar 2011 17:05:23 GMT
hmmm,

This failure is being caused by that new Hudson plugin that was installed to
promote only successful Snapshot builds to the snapshot repo:
https://issues.apache.org/jira/browse/INFRA-3484

I had checked the box to use this, in our UIMA-AS "job". 

I went, just now to uncheck that box in the UIMA-AS job configuration, and to my
surprise, the configure screen GUI won't show the lower sections (including this
check-box).

Investigating ...

-Marshall



On 3/4/2011 11:18 AM, Apache Hudson Server wrote:
> See <https://hudson.apache.org/hudson/job/UIMA-AS/39/changes>
>
> Changes:
>
> [cwiklik] UIMA-2072 Added new message to identify client as a target of a failed msg
>
> [cwiklik] UIMA-2072 fixed log message on send failure to indicate the target of the message:
either delegate or client
>
> [cwiklik] UIMA-2081 Added delay before sending getMeta request to remote service to enable
broker to 'finalize' creation of a temp reply queue.
>
> [cwiklik] UIMA-2081 Added delay before sending getMeta request to remote delegates to
enable broker to 'finalize' creation of a temp reply queues.
>
> [cwiklik] UIMA-2083 Modified to use type of serialization defined for each delegate in
a deployment descriptor.
>
> ------------------------------------------
> Started by an SCM change
> Started by an SCM change
> Building remotely on ubuntu2
> Updating https://svn.apache.org/repos/asf/uima/uima-as/trunk
> U         uimaj-as-core/src/main/java/org/apache/uima/aae/controller/AggregateAnalysisEngineController_impl.java
> U         uimaj-as-core/src/main/resources/uimaee_messages.properties
> U         uimaj-as-activemq/src/main/java/org/apache/uima/adapter/jms/activemq/JmsOutputChannel.java
> U         uimaj-as-activemq/src/main/java/org/apache/uima/adapter/jms/activemq/JmsEndpointConnection_impl.java
> U         uimaj-as-activemq/src/main/java/org/apache/uima/adapter/jms/client/BaseUIMAAsynchronousEngine_impl.java
> At revision 1078036
> Found mavenVersion 3.0.2 from file jar:file:/home/hudson/tools/maven/apache-maven-3.0.2/lib/maven-core-3.0.2.jar!/META-INF/maven/org.apache.maven/maven-core/pom.properties
> Parsing POMs
> [uima-as] $ /home/hudson/tools/java/latest1.5/bin/java -cp /home/hudson/hudson-slave/maven3-agent.jar:/home/hudson/tools/maven/apache-maven-3.0.2/boot/plexus-classworlds-2.4.jar
org.jvnet.hudson.maven3.agent.Maven3Main /home/hudson/tools/maven/apache-maven-3.0.2 /home/hudson/hudson-slave/slave.jar
/home/hudson/hudson-slave/maven3-interceptor.jar 42238
> <===[HUDSON REMOTING CAPACITY]===>channel started
>    Executing Maven:  -B -f <https://hudson.apache.org/hudson/job/UIMA-AS/ws/trunk/uima-as/pom.xml>
clean install -Pextended-test
> [INFO] Scanning for projects...
> [INFO] ------------------------------------------------------------------------
> [INFO] Reactor Build Order:
> [INFO] 
> [INFO] UIMA-AS: uima-as-parent
> [INFO] UIMA-AS: uimaj-as-core
> [INFO] UIMA-AS: uimaj-as-jms
> [INFO] UIMA-AS: uimaj-as-activemq
> [INFO] UIMA-AS Eclipse Plugin: uimaj-ep-runtime-deployeditor
> [INFO] UIMA-AS Eclipse Plugin: uimaj-ep-deployeditor
> [INFO] UIMA AS: uimaj-as-osgi-runtime
> [INFO] UIMA-AS: uimaj-as-camel
> [INFO] UIMA Eclipse: uimaj-eclipse-feature-deployeditor
> [INFO] UIMA-AS Aggregate: aggregate-uima-as-eclipse-plugins
> [INFO] UIMA-AS: uima-as-docbooks
> [INFO] UIMA-AS Aggregate: aggregate-uima-as
> [INFO] UIMA-AS: uima-as
> [INFO]                                                                         
> [INFO] ------------------------------------------------------------------------
> [INFO] Building UIMA-AS: uima-as-parent 2.3.2-SNAPSHOT
> [INFO] ------------------------------------------------------------------------
> [INFO] 
> [INFO] --- maven-clean-plugin:2.3:clean (default-clean) @ uima-as-parent ---
> [INFO] Deleting file set: <https://hudson.apache.org/hudson/job/UIMA-AS/ws/trunk/uima-as-parent/target>
(included: [**], excluded: [])
> [INFO] 
> [INFO] --- build-helper-maven-plugin:1.5:parse-version (parse-project-version) @ uima-as-parent
---
> [INFO] 
> [INFO] --- uima-build-helper-maven-plugin:2:parse-date-time (set buildYear and buildMonth)
@ uima-as-parent ---
> [INFO] 
> [INFO] --- maven-remote-resources-plugin:1.1:process (default) @ uima-as-parent ---
> [INFO] Setting property: classpath.resource.loader.class => 'org.codehaus.plexus.velocity.ContextClassLoaderResourceLoader'.
> [INFO] Setting property: velocimacro.messages.on => 'false'.
> [INFO] Setting property: resource.loader => 'classpath'.
> [INFO] Setting property: resource.manager.logwhenfound => 'false'.
> [INFO] 
> [INFO] --- maven-install-plugin:2.3:install (default-install) @ uima-as-parent ---
> [INFO] Installing <https://hudson.apache.org/hudson/job/UIMA-AS/ws/trunk/uima-as-parent/pom.xml>
to /home/hudson/.m2/repository/org/apache/uima/uima-as-parent/2.3.2-SNAPSHOT/uima-as-parent-2.3.2-SNAPSHOT.pom
> projectSucceeded org.apache.uima:uima-as-parent:2.3.2-SNAPSHOT
>
> -------------------------------------------------------
> MAVEN SNAPSHOT ARTIFACT DEPLOYMENT
> -------------------------------------------------------
> Build result is: SUCCESS
> Looking for snapshot artifacts to deploy...
>
> Found artifact 'UIMA-AS: uima-as-parent' with version '2.3.2-SNAPSHOT'
> Distribution repository 'apache.snapshots.https' with URL https://repository.apache.org/content/repositories/snapshots
> java.lang.NoSuchMethodError: hudson.maven.reporters.MavenArtifact.<init>(Ljava/lang/String;Ljava/lang/String;Ljava/lang/String;Ljava/lang/String;Ljava/lang/String;Ljava/lang/String;)V
> 	at fr.idm.hudson.plugins.MavenSnapshotArtifactDeployer.deploySnapshots(MavenSnapshotArtifactDeployer.java:113)
> 	at fr.idm.hudson.plugins.MavenSnapshotArtifactDeployer.postBuild(MavenSnapshotArtifactDeployer.java:61)
> 	at hudson.maven.Maven3Builder$MavenExecutionListener.reccordProjectSucceeded(Maven3Builder.java:417)
> 	at hudson.maven.Maven3Builder$MavenExecutionListener.projectSucceeded(Maven3Builder.java:390)
> 	at org.apache.maven.lifecycle.internal.DefaultExecutionEventCatapult.fire(DefaultExecutionEventCatapult.java:74)
> 	at org.apache.maven.lifecycle.internal.DefaultExecutionEventCatapult.fire(DefaultExecutionEventCatapult.java:42)
> 	at org.apache.maven.lifecycle.internal.LifecycleModuleBuilder.buildProject(LifecycleModuleBuilder.java:91)
> 	at org.apache.maven.lifecycle.internal.LifecycleModuleBuilder.buildProject(LifecycleModuleBuilder.java:59)
> 	at org.apache.maven.lifecycle.internal.LifecycleStarter.singleThreadedBuild(LifecycleStarter.java:183)
> 	at org.apache.maven.lifecycle.internal.LifecycleStarter.execute(LifecycleStarter.java:161)
> 	at org.apache.maven.DefaultMaven.doExecute(DefaultMaven.java:319)
> 	at org.apache.maven.DefaultMaven.execute(DefaultMaven.java:156)
> 	at org.jvnet.hudson.maven3.launcher.Maven3Launcher.main(Maven3Launcher.java:79)
> 	at sun.reflect.NativeMethodAccessorImpl.invoke0(Native Method)
> 	at sun.reflect.NativeMethodAccessorImpl.invoke(NativeMethodAccessorImpl.java:39)
> 	at sun.reflect.DelegatingMethodAccessorImpl.invoke(DelegatingMethodAccessorImpl.java:25)
> 	at java.lang.reflect.Method.invoke(Method.java:592)
> 	at org.codehaus.plexus.classworlds.launcher.Launcher.launchStandard(Launcher.java:329)
> 	at org.codehaus.plexus.classworlds.launcher.Launcher.launch(Launcher.java:239)
> 	at org.jvnet.hudson.maven3.agent.Maven3Main.launch(Maven3Main.java:145)
> 	at hudson.maven.Maven3Builder.call(Maven3Builder.java:124)
> 	at hudson.maven.Maven3Builder.call(Maven3Builder.java:71)
> 	at hudson.remoting.UserRequest.perform(UserRequest.java:114)
> 	at hudson.remoting.UserRequest.perform(UserRequest.java:48)
> 	at hudson.remoting.Request$2.run(Request.java:270)
> 	at java.util.concurrent.Executors$RunnableAdapter.call(Executors.java:417)
> 	at java.util.concurrent.FutureTask$Sync.innerRun(FutureTask.java:269)
> 	at java.util.concurrent.FutureTask.run(FutureTask.java:123)
> 	at java.util.concurrent.ThreadPoolExecutor$Worker.runTask(ThreadPoolExecutor.java:651)
> 	at java.util.concurrent.ThreadPoolExecutor$Worker.run(ThreadPoolExecutor.java:676)
> 	at java.lang.Thread.run(Thread.java:595)
> -------------------------------------------------------
>
> projectFailed org.apache.uima:uima-as-parent:2.3.2-SNAPSHOT
>
> -------------------------------------------------------
> MAVEN SNAPSHOT ARTIFACT DEPLOYMENT
> -------------------------------------------------------
> Build result is: FAILURE
>    ... SKIPPING (build not successful)
> -------------------------------------------------------
>
> [JENKINS] Archiving <https://hudson.apache.org/hudson/job/UIMA-AS/ws/trunk/uima-as-parent/pom.xml>
to /home/hudson/hudson/jobs/UIMA-AS/modules/org.apache.uima$uima-as-parent/builds/2011-03-04_16-17-33/archive/org.apache.uima/uima-as-parent/2.3.2-SNAPSHOT/pom.xml
> sessionEnded
> [INFO] ------------------------------------------------------------------------
> [INFO] Reactor Summary:
> [INFO] 
> [INFO] UIMA-AS: uima-as-parent ........................... FAILURE [11.148s]
> [INFO] UIMA-AS: uimaj-as-core ............................ SKIPPED
> [INFO] UIMA-AS: uimaj-as-jms ............................. SKIPPED
> [INFO] UIMA-AS: uimaj-as-activemq ........................ SKIPPED
> [INFO] UIMA-AS Eclipse Plugin: uimaj-ep-runtime-deployeditor  SKIPPED
> [INFO] UIMA-AS Eclipse Plugin: uimaj-ep-deployeditor ..... SKIPPED
> [INFO] UIMA AS: uimaj-as-osgi-runtime .................... SKIPPED
> [INFO] UIMA-AS: uimaj-as-camel ........................... SKIPPED
> [INFO] UIMA Eclipse: uimaj-eclipse-feature-deployeditor .. SKIPPED
> [INFO] UIMA-AS Aggregate: aggregate-uima-as-eclipse-plugins  SKIPPED
> [INFO] UIMA-AS: uima-as-docbooks ......................... SKIPPED
> [INFO] UIMA-AS Aggregate: aggregate-uima-as .............. SKIPPED
> [INFO] UIMA-AS: uima-as .................................. SKIPPED
> [INFO] ------------------------------------------------------------------------
> [INFO] BUILD FAILURE
> [INFO] ------------------------------------------------------------------------
> [INFO] Total time: 14.308s
> [INFO] Finished at: Fri Mar 04 16:18:00 UTC 2011
> [INFO] Final Memory: 11M/179M
> [INFO] ------------------------------------------------------------------------
> maven builder waiting
> mavenExecutionResult exceptions not empty
> org.apache.maven.InternalErrorException: Internal error: java.lang.RuntimeException:
java.lang.NoSuchMethodError: hudson.maven.reporters.MavenArtifact.<init>(Ljava/lang/String;Ljava/lang/String;Ljava/lang/String;Ljava/lang/String;Ljava/lang/String;Ljava/lang/String;)V
> 	at org.apache.maven.lifecycle.internal.BuilderCommon.handleBuildError(BuilderCommon.java:128)
> 	at org.apache.maven.lifecycle.internal.LifecycleModuleBuilder.buildProject(LifecycleModuleBuilder.java:95)
> 	at org.apache.maven.lifecycle.internal.LifecycleModuleBuilder.buildProject(LifecycleModuleBuilder.java:59)
> 	at org.apache.maven.lifecycle.internal.LifecycleStarter.singleThreadedBuild(LifecycleStarter.java:183)
> 	at org.apache.maven.lifecycle.internal.LifecycleStarter.execute(LifecycleStarter.java:161)
> 	at org.apache.maven.DefaultMaven.doExecute(DefaultMaven.java:319)
> 	at org.apache.maven.DefaultMaven.execute(DefaultMaven.java:156)
> 	at org.jvnet.hudson.maven3.launcher.Maven3Launcher.main(Maven3Launcher.java:79)
> 	at sun.reflect.NativeMethodAccessorImpl.invoke0(Native Method)
> 	at sun.reflect.NativeMethodAccessorImpl.invoke(NativeMethodAccessorImpl.java:39)
> 	at sun.reflect.DelegatingMethodAccessorImpl.invoke(DelegatingMethodAccessorImpl.java:25)
> 	at java.lang.reflect.Method.invoke(Method.java:592)
> 	at org.codehaus.plexus.classworlds.launcher.Launcher.launchStandard(Launcher.java:329)
> 	at org.codehaus.plexus.classworlds.launcher.Launcher.launch(Launcher.java:239)
> 	at org.jvnet.hudson.maven3.agent.Maven3Main.launch(Maven3Main.java:145)
> 	at hudson.maven.Maven3Builder.call(Maven3Builder.java:124)
> 	at hudson.maven.Maven3Builder.call(Maven3Builder.java:71)
> 	at hudson.remoting.UserRequest.perform(UserRequest.java:114)
> 	at hudson.remoting.UserRequest.perform(UserRequest.java:48)
> 	at hudson.remoting.Request$2.run(Request.java:270)
> 	at java.util.concurrent.Executors$RunnableAdapter.call(Executors.java:417)
> 	at java.util.concurrent.FutureTask$Sync.innerRun(FutureTask.java:269)
> 	at java.util.concurrent.FutureTask.run(FutureTask.java:123)
> 	at java.util.concurrent.ThreadPoolExecutor$Worker.runTask(ThreadPoolExecutor.java:651)
> 	at java.util.concurrent.ThreadPoolExecutor$Worker.run(ThreadPoolExecutor.java:676)
> 	at java.lang.Thread.run(Thread.java:595)
> Caused by: java.lang.RuntimeException: java.lang.NoSuchMethodError: hudson.maven.reporters.MavenArtifact.<init>(Ljava/lang/String;Ljava/lang/String;Ljava/lang/String;Ljava/lang/String;Ljava/lang/String;Ljava/lang/String;)V
> 	at fr.idm.hudson.plugins.MavenSnapshotArtifactDeployer.postBuild(MavenSnapshotArtifactDeployer.java:67)
> 	at hudson.maven.Maven3Builder$MavenExecutionListener.reccordProjectSucceeded(Maven3Builder.java:417)
> 	at hudson.maven.Maven3Builder$MavenExecutionListener.projectSucceeded(Maven3Builder.java:390)
> 	at org.apache.maven.lifecycle.internal.DefaultExecutionEventCatapult.fire(DefaultExecutionEventCatapult.java:74)
> 	at org.apache.maven.lifecycle.internal.DefaultExecutionEventCatapult.fire(DefaultExecutionEventCatapult.java:42)
> 	at org.apache.maven.lifecycle.internal.LifecycleModuleBuilder.buildProject(LifecycleModuleBuilder.java:91)
> 	... 24 more
> Caused by: java.lang.NoSuchMethodError: hudson.maven.reporters.MavenArtifact.<init>(Ljava/lang/String;Ljava/lang/String;Ljava/lang/String;Ljava/lang/String;Ljava/lang/String;Ljava/lang/String;)V
> 	at fr.idm.hudson.plugins.MavenSnapshotArtifactDeployer.deploySnapshots(MavenSnapshotArtifactDeployer.java:113)
> 	at fr.idm.hudson.plugins.MavenSnapshotArtifactDeployer.postBuild(MavenSnapshotArtifactDeployer.java:61)
> 	... 29 more
> Sending e-mails to: dev@uima.apache.org
> channel stopped
>
>
>

Mime
View raw message