uima-dev mailing list archives

Site index · List index
Message view « Date » · « Thread »
Top « Date » · « Thread »
From Apache Jenkins Server <jenk...@builds.apache.org>
Subject Build failed in Jenkins: UIMA Addons #80
Date Wed, 17 Aug 2011 21:06:32 GMT
See <https://builds.apache.org/job/UIMA%20Addons/80/changes>

Changes:

[joern] UIMA-2215 The create flag for the IndexWriter is now configurable via the properties
file.

------------------------------------------
[...truncated 1971 lines...]
	at org.apache.maven.surefire.suite.AbstractDirectoryTestSuite.execute(AbstractDirectoryTestSuite.java:127)
	at org.apache.maven.surefire.Surefire.run(Surefire.java:177)
	at sun.reflect.NativeMethodAccessorImpl.invoke0(Native Method)
	at sun.reflect.NativeMethodAccessorImpl.invoke(NativeMethodAccessorImpl.java:39)
	at sun.reflect.DelegatingMethodAccessorImpl.invoke(DelegatingMethodAccessorImpl.java:25)
	at java.lang.reflect.Method.invoke(Method.java:597)
	at org.apache.maven.surefire.booter.SurefireBooter.runSuitesInProcess(SurefireBooter.java:345)
	at org.apache.maven.surefire.booter.SurefireBooter.main(SurefireBooter.java:1009)
Caused by: org.apache.uima.annotator.regex.impl.RegexAnnotatorConfigException: "Error while
validating feature path "testFeature/invalid/path". This path can never be valid for type
org.apache.uima.TestAnnot."
	at org.apache.uima.annotator.regex.impl.FeaturePath_impl.initialize(FeaturePath_impl.java:93)
	at org.apache.uima.annotator.regex.impl.Rule_impl.typeInit(Rule_impl.java:273)
	at org.apache.uima.annotator.regex.impl.Concept_impl.typeInit(Concept_impl.java:132)
	at org.apache.uima.annotator.regex.impl.RegExAnnotator.typeSystemInit(RegExAnnotator.java:310)
	... 33 more
Aug 17, 2011 9:05:53 PM org.apache.uima.analysis_engine.impl.PrimitiveAnalysisEngine_impl
callAnalysisComponentProcess(405)
SEVERE: Exception occurred
org.apache.uima.annotator.regex.impl.RegexAnnotatorProcessException: "The feature path element
type uima.tcas.DocumentAnnotation of the feature name arrayFeature in the featurePath arrayFeature
is currently not supported."
	at org.apache.uima.annotator.regex.impl.FeaturePath_impl.getValue(FeaturePath_impl.java:228)
	at org.apache.uima.annotator.regex.impl.RegExAnnotator.process(RegExAnnotator.java:396)
	at org.apache.uima.analysis_component.CasAnnotator_ImplBase.process(CasAnnotator_ImplBase.java:56)
	at org.apache.uima.analysis_engine.impl.PrimitiveAnalysisEngine_impl.callAnalysisComponentProcess(PrimitiveAnalysisEngine_impl.java:377)
	at org.apache.uima.analysis_engine.impl.PrimitiveAnalysisEngine_impl.processAndOutputNewCASes(PrimitiveAnalysisEngine_impl.java:295)
	at org.apache.uima.analysis_engine.impl.AnalysisEngineImplBase.process(AnalysisEngineImplBase.java:267)
	at org.apache.uima.test.junit_extension.AnnotatorTester.performTest(AnnotatorTester.java:259)
	at org.apache.uima.annotator.regex.TestFeaturePathMatching.testInvalidFeaturePath2(TestFeaturePathMatching.java:129)
	at sun.reflect.NativeMethodAccessorImpl.invoke0(Native Method)
	at sun.reflect.NativeMethodAccessorImpl.invoke(NativeMethodAccessorImpl.java:39)
	at sun.reflect.DelegatingMethodAccessorImpl.invoke(DelegatingMethodAccessorImpl.java:25)
	at java.lang.reflect.Method.invoke(Method.java:597)
	at junit.framework.TestCase.runTest(TestCase.java:154)
	at junit.framework.TestCase.runBare(TestCase.java:127)
	at junit.framework.TestResult$1.protect(TestResult.java:106)
	at junit.framework.TestResult.runProtected(TestResult.java:124)
	at junit.framework.TestResult.run(TestResult.java:109)
	at junit.framework.TestCase.run(TestCase.java:118)
	at junit.framework.TestSuite.runTest(TestSuite.java:208)
	at junit.framework.TestSuite.run(TestSuite.java:203)
	at sun.reflect.NativeMethodAccessorImpl.invoke0(Native Method)
	at sun.reflect.NativeMethodAccessorImpl.invoke(NativeMethodAccessorImpl.java:39)
	at sun.reflect.DelegatingMethodAccessorImpl.invoke(DelegatingMethodAccessorImpl.java:25)
	at java.lang.reflect.Method.invoke(Method.java:597)
	at org.apache.maven.surefire.junit.JUnitTestSet.execute(JUnitTestSet.java:213)
	at org.apache.maven.surefire.suite.AbstractDirectoryTestSuite.executeTestSet(AbstractDirectoryTestSuite.java:140)
	at org.apache.maven.surefire.suite.AbstractDirectoryTestSuite.execute(AbstractDirectoryTestSuite.java:127)
	at org.apache.maven.surefire.Surefire.run(Surefire.java:177)
	at sun.reflect.NativeMethodAccessorImpl.invoke0(Native Method)
	at sun.reflect.NativeMethodAccessorImpl.invoke(NativeMethodAccessorImpl.java:39)
	at sun.reflect.DelegatingMethodAccessorImpl.invoke(DelegatingMethodAccessorImpl.java:25)
	at java.lang.reflect.Method.invoke(Method.java:597)
	at org.apache.maven.surefire.booter.SurefireBooter.runSuitesInProcess(SurefireBooter.java:345)
	at org.apache.maven.surefire.booter.SurefireBooter.main(SurefireBooter.java:1009)
Tests run: 4, Failures: 0, Errors: 0, Skipped: 0, Time elapsed: 0.057 sec
Running org.apache.uima.annotator.regex.TestConceptFileParser
Tests run: 2, Failures: 0, Errors: 0, Skipped: 0, Time elapsed: 0.008 sec
Running org.apache.uima.annotator.regex.TestConceptFileSyntax
Aug 17, 2011 9:05:53 PM RegExAnnotator initialize
WARNING: "Duplicate concept name "simpleName" found."
Aug 17, 2011 9:05:53 PM RegExAnnotator initialize
WARNING: "Duplicate rule id "ID1" found for concept "simpleName"."
Tests run: 10, Failures: 0, Errors: 0, Skipped: 0, Time elapsed: 0.05 sec
Running org.apache.uima.annotator.regex.TestVariables
Tests run: 4, Failures: 0, Errors: 0, Skipped: 0, Time elapsed: 0.048 sec

Results :

Tests run: 42, Failures: 0, Errors: 0, Skipped: 0

[JENKINS] Recording test results
[INFO] [INFO] Configured Artifact: org.apache.uima:uima-build-resources:1:jar

[INFO] Unpacking /home/jenkins/.m2/repository/org/apache/uima/uima-build-resources/1/uima-build-resources-1.jar
to
  <https://builds.apache.org/job/UIMA%20Addons/ws/RegularExpressionAnnotator/target>
   with includes docbook-shared/** and excludes:null
[INFO] --- maven-dependency-plugin:2.1:unpack (copyDocbookInfo) @ RegularExpressionAnnotator
---
[INFO] [INFO] Configured Artifact: org.apache.uima:uima-build-resources:1:jar
[INFO] uima-build-resources-1.jar already unpacked.

[INFO] --- maven-dependency-plugin:2.1:unpack (copyDocbookInfoNextToOlink) @ RegularExpressionAnnotator
---
[INFO] [INFO] Configured Artifact: org.apache.uima:uima-docbook-olink:olink:1-SNAPSHOT:zip
[INFO] uima-docbook-olink-1-SNAPSHOT-olink.zip already unpacked.

[INFO] --- maven-dependency-plugin:2.1:unpack (getOlink) @ RegularExpressionAnnotator ---
[INFO] 
[INFO] --- maven-jar-plugin:2.3.1:jar (default-jar) @ RegularExpressionAnnotator ---
[INFO] Building jar: <https://builds.apache.org/job/UIMA%20Addons/ws/RegularExpressionAnnotator/target/uima-an-regex.jar>
[INFO] [INFO] Processing input file: RegexAnnotatorUserGuide.xml

[INFO] --- docbkx-maven-plugin:2.0.11:generate-html (html) @ RegularExpressionAnnotator ---
[INFO] <https://builds.apache.org/job/UIMA%20Addons/ws/RegularExpressionAnnotator/target/site/d/RegexAnnotatorUserGuide.html>
has been generated.
[INFO] 
[INFO] --- docbkx-maven-plugin:2.0.11:generate-pdf (pdf) @ RegularExpressionAnnotator ---
[INFO] Processing input file: RegexAnnotatorUserGuide.xml
Aug 17, 2011 9:05:58 PM org.apache.fop.fonts.FontInfo notifyFontReplacement
WARNING: Font 'Symbol,normal,700' not found. Substituting with 'Symbol,normal,400'.
Aug 17, 2011 9:05:58 PM org.apache.fop.fonts.FontInfo notifyFontReplacement
WARNING: Font 'ZapfDingbats,normal,700' not found. Substituting with 'ZapfDingbats,normal,400'.
Aug 17, 2011 9:05:58 PM org.apache.fop.layoutmgr.inline.LineLayoutManager$LineBreakingAlgorithm
updateData2
WARNING: Line 1 of a paragraph overflows the available area by 14000mpt. (fo:block, location:
153/599)
Aug 17, 2011 9:05:58 PM org.apache.fop.layoutmgr.inline.LineLayoutManager$LineBreakingAlgorithm
updateData2
WARNING: Line 1 of a paragraph overflows the available area by 3200mpt. (fo:block, location:
308/601)
Aug 17, 2011 9:05:58 PM org.apache.fop.layoutmgr.inline.LineLayoutManager$LineBreakingAlgorithm
updateData2
WARNING: Line 1 of a paragraph overflows the available area by 3200mpt. (fo:block, location:
383/596)
Aug 17, 2011 9:05:58 PM org.apache.fop.fonts.FontInfo notifyFontReplacement
WARNING: Font 'ZapfDingbats,italic,400' not found. Substituting with 'ZapfDingbats,normal,400'.
Aug 17, 2011 9:05:58 PM org.apache.fop.layoutmgr.inline.LineLayoutManager$LineBreakingAlgorithm
updateData2
WARNING: Line 1 of a paragraph overflows the available area by 3200mpt. (fo:block, location:
1168/600)
[INFO] <https://builds.apache.org/job/UIMA%20Addons/ws/RegularExpressionAnnotator/target/docbkx/pdf/RegexAnnotatorUserGuide.fo>
has been generated.
[INFO] [INFO] Using 'UTF-8' encoding to copy filtered resources.
[INFO] Copying 0 resource

[INFO] --- maven-resources-plugin:2.4.3:copy-resources (docbook-copy-images) @ RegularExpressionAnnotator
---
[INFO] [INFO] Using 'UTF-8' encoding to copy filtered resources.
[INFO] Copying 1 resource

[INFO] --- maven-resources-plugin:2.4.3:copy-resources (docbook-copy-css) @ RegularExpressionAnnotator
---
[INFO] [INFO] Using 'UTF-8' encoding to copy filtered resources.
[INFO] Copying 1 resource

[INFO] --- maven-resources-plugin:2.4.3:copy-resources (docbook-move-pdf) @ RegularExpressionAnnotator
---
[INFO] 
[INFO] --- maven-javadoc-plugin:2.7:jar (attach-javadocs) @ RegularExpressionAnnotator ---
[INFO] Building jar: <https://builds.apache.org/job/UIMA%20Addons/ws/RegularExpressionAnnotator/target/uima-an-regex-javadoc.jar>
[INFO] [INFO] Using 'UTF-8' encoding to copy filtered resources.
[INFO] Copying 2 resources

[INFO] --- maven-resources-plugin:2.4.3:copy-resources (copy standard target jar to base-bin/lib)
@ RegularExpressionAnnotator ---
[INFO] Using 'UTF-8' encoding to copy filtered resources.
[INFO] [INFO] Copying 3 resources

[INFO] --- maven-resources-plugin:2.4.3:copy-resources (copy generated docbook artifacts to
base-bin/doc folder) @ RegularExpressionAnnotator ---
[INFO] [INFO] Skipping the assembly in this project because it's not the Execution Root

[INFO] --- maven-assembly-plugin:2.2:single (binary-release) @ RegularExpressionAnnotator
---
[INFO] [INFO] Using 'UTF-8' encoding to copy filtered resources.
[INFO] Copying 8 resources

[INFO] --- maven-resources-plugin:2.4.3:copy-resources (Copy base-bin to osgi) @ RegularExpressionAnnotator
---
[INFO] 
[INFO] Using 'UTF-8' encoding to copy filtered resources.
[INFO] --- maven-resources-plugin:2.4.3:copy-resources (Copy base-bin to pearPackaging) @
RegularExpressionAnnotator ---
[INFO] Copying 11 resources
[INFO] 
[INFO] --- maven-bundle-plugin:2.1.0:manifest (uima-bundle) @ RegularExpressionAnnotator ---
[WARNING] Warning in manifest for org.apache.uima:RegularExpressionAnnotator:jar:2.3.1-SNAPSHOT
: No sub JAR or directory lib/uima-an-regex.jar
[WARNING] Warning in manifest for org.apache.uima:RegularExpressionAnnotator:jar:2.3.1-SNAPSHOT
: No sub JAR or directory lib/geronimo-stax-api_1.0_spec-1.0.1.jar
[WARNING] Warning in manifest for org.apache.uima:RegularExpressionAnnotator:jar:2.3.1-SNAPSHOT
: No sub JAR or directory lib/xmlbeans-2.4.0.jar
[WARNING] Warning in manifest for org.apache.uima:RegularExpressionAnnotator:jar:2.3.1-SNAPSHOT
: No sub JAR or directory lib/uimaj-core-2.3.1.jar
[WARNING] Warning in manifest for org.apache.uima:RegularExpressionAnnotator:jar:2.3.1-SNAPSHOT
: Superfluous export-package instructions: [schemaorg_apache_xmlbeans.javaname.org.apache,
org, schemaorg_apache_xmlbeans, org.apache.uima, schemaorg_apache_xmlbeans.javaname, org.apache,
org.apache.incubator, schemaorg_apache_xmlbeans.javaname.org, schemaorg_apache_xmlbeans.javaname.org.apache.incubator,
schemaorg_apache_xmlbeans.javaname.org.apache.incubator.uima, schemaorg_apache_xmlbeans.namespace,
org.apache.incubator.uima, org.apache.uima.annotator, schemaorg_apache_xmlbeans.element, schemaorg_apache_xmlbeans.system]
[WARNING] Warning in manifest for org.apache.uima:RegularExpressionAnnotator:jar:2.3.1-SNAPSHOT
: Did not find matching referal for org.apache.log.*
[INFO] 
[INFO] --- maven-jar-plugin:2.3.1:jar (Create OSGi Jar) @ RegularExpressionAnnotator ---
[INFO] Building jar: <https://builds.apache.org/job/UIMA%20Addons/ws/RegularExpressionAnnotator/target/org.apache.uima.RegularExpressionAnnotator_2.3.1.SNAPSHOT-osgi.jar>
[INFO] [INFO] Start building PEAR package for component RegularExpressionAnnotator

[INFO] --- PearPackagingMavenPlugin:2.3.1:package (build uima annnotator Pear) @ RegularExpressionAnnotator
---
[INFO] PEAR package for component RegularExpressionAnnotator successfully created at: <https://builds.apache.org/job/UIMA%20Addons/ws/RegularExpressionAnnotator/target/RegularExpressionAnnotator.pear>
[INFO] 
[INFO] --- build-helper-maven-plugin:1.5:attach-artifact (attach-pear-artifact) @ RegularExpressionAnnotator
---
[INFO] [INFO] Installing <https://builds.apache.org/job/UIMA%20Addons/ws/RegularExpressionAnnotator/target/uima-an-regex.jar>
to /home/jenkins/.m2/repository/org/apache/uima/RegularExpressionAnnotator/2.3.1-SNAPSHOT/RegularExpressionAnnotator-2.3.1-SNAPSHOT.jar

[INFO] --- maven-install-plugin:2.3:install (default-install) @ RegularExpressionAnnotator
---
[INFO] Installing <https://builds.apache.org/job/UIMA%20Addons/ws/RegularExpressionAnnotator/pom.xml>
to /home/jenkins/.m2/repository/org/apache/uima/RegularExpressionAnnotator/2.3.1-SNAPSHOT/RegularExpressionAnnotator-2.3.1-SNAPSHOT.pom
[INFO] Installing <https://builds.apache.org/job/UIMA%20Addons/ws/RegularExpressionAnnotator/target/uima-an-regex-javadoc.jar>
to /home/jenkins/.m2/repository/org/apache/uima/RegularExpressionAnnotator/2.3.1-SNAPSHOT/RegularExpressionAnnotator-2.3.1-SNAPSHOT-javadoc.jar
[INFO] Installing <https://builds.apache.org/job/UIMA%20Addons/ws/RegularExpressionAnnotator/target/org.apache.uima.RegularExpressionAnnotator_2.3.1.SNAPSHOT-osgi.jar>
to /home/jenkins/.m2/repository/org/apache/uima/RegularExpressionAnnotator/2.3.1-SNAPSHOT/RegularExpressionAnnotator-2.3.1-SNAPSHOT-osgi.jar
[INFO] Installing <https://builds.apache.org/job/UIMA%20Addons/ws/RegularExpressionAnnotator/target/RegularExpressionAnnotator.pear>
to /home/jenkins/.m2/repository/org/apache/uima/RegularExpressionAnnotator/2.3.1-SNAPSHOT/RegularExpressionAnnotator-2.3.1-SNAPSHOT.pear
projectSucceeded org.apache.uima:RegularExpressionAnnotator:2.3.1-SNAPSHOT
[JENKINS] Archiving <https://builds.apache.org/job/UIMA%20Addons/ws/RegularExpressionAnnotator/pom.xml>
to /home/hudson/hudson/jobs/UIMA Addons/modules/org.apache.uima$RegularExpressionAnnotator/builds/2011-08-17_21-02-07/archive/org.apache.uima/RegularExpressionAnnotator/2.3.1-SNAPSHOT/RegularExpressionAnnotator-2.3.1-SNAPSHOT.pom
[JENKINS] Archiving <https://builds.apache.org/job/UIMA%20Addons/ws/RegularExpressionAnnotator/target/uima-an-regex.jar>
to /home/hudson/hudson/jobs/UIMA Addons/modules/org.apache.uima$RegularExpressionAnnotator/builds/2011-08-17_21-02-07/archive/org.apache.uima/RegularExpressionAnnotator/2.3.1-SNAPSHOT/RegularExpressionAnnotator-2.3.1-SNAPSHOT.jar
[JENKINS] Archiving <https://builds.apache.org/job/UIMA%20Addons/ws/RegularExpressionAnnotator/target/uima-an-regex-javadoc.jar>
to /home/hudson/hudson/jobs/UIMA Addons/modules/org.apache.uima$RegularExpressionAnnotator/builds/2011-08-17_21-02-07/archive/org.apache.uima/RegularExpressionAnnotator/2.3.1-SNAPSHOT/RegularExpressionAnnotator-2.3.1-SNAPSHOT-javadoc.jar
[JENKINS] Archiving <https://builds.apache.org/job/UIMA%20Addons/ws/RegularExpressionAnnotator/target/org.apache.uima.RegularExpressionAnnotator_2.3.1.SNAPSHOT-osgi.jar>
to /home/hudson/hudson/jobs/UIMA Addons/modules/org.apache.uima$RegularExpressionAnnotator/builds/2011-08-17_21-02-07/archive/org.apache.uima/RegularExpressionAnnotator/2.3.1-SNAPSHOT/RegularExpressionAnnotator-2.3.1-SNAPSHOT-osgi.jar
[JENKINS] Archiving <https://builds.apache.org/job/UIMA%20Addons/ws/RegularExpressionAnnotator/target/RegularExpressionAnnotator.pear>
to /home/hudson/hudson/jobs/UIMA Addons/modules/org.apache.uima$RegularExpressionAnnotator/builds/2011-08-17_21-02-07/archive/org.apache.uima/RegularExpressionAnnotator/2.3.1-SNAPSHOT/RegularExpressionAnnotator-2.3.1-SNAPSHOT.pear
[INFO]                                                                         
[INFO] ------------------------------------------------------------------------
[INFO] Building UIMA Addon: SimpleServer 2.3.1-SNAPSHOT
[INFO] ------------------------------------------------------------------------
[INFO] [INFO] Deleting file set: <https://builds.apache.org/job/UIMA%20Addons/ws/SimpleServer/target>
(included: [**], excluded: [])

[INFO] --- maven-clean-plugin:2.3:clean (default-clean) @ SimpleServer ---
[INFO] 
[INFO] --- build-helper-maven-plugin:1.5:parse-version (parse-project-version) @ SimpleServer
---
[INFO] 
[INFO] --- uima-build-helper-maven-plugin:2:parse-date-time (set buildYear and buildMonth)
@ SimpleServer ---
[INFO] 
[INFO] --- xmlbeans-maven-plugin:2.3.3:xmlbeans (default) @ SimpleServer ---
[INFO] 
[INFO] --- maven-remote-resources-plugin:1.1:process (default) @ SimpleServer ---
[INFO] [INFO] Using 'UTF-8' encoding to copy filtered resources.

[INFO] --- maven-resources-plugin:2.4.3:resources (default-resources) @ SimpleServer ---
[INFO] Copying 4 resources
[INFO] Copying 77 resources
[INFO] Copying 3 resources
[INFO] [INFO] Copying geronimo-stax-api_1.0_spec-1.0.1.jar to <https://builds.apache.org/job/UIMA%20Addons/ws/SimpleServer/target/base-bin/lib/geronimo-stax-api_1.0_spec-1.0.1.jar>

[INFO] --- maven-dependency-plugin:2.1:copy-dependencies (copy dependencies to base-bin/lib)
@ SimpleServer ---
[INFO] Copying uimaj-core-2.3.1.jar to <https://builds.apache.org/job/UIMA%20Addons/ws/SimpleServer/target/base-bin/lib/uimaj-core-2.3.1.jar>
[INFO] Copying xmlbeans-2.4.0.jar to <https://builds.apache.org/job/UIMA%20Addons/ws/SimpleServer/target/base-bin/lib/xmlbeans-2.4.0.jar>
[INFO] 
[INFO] --- maven-resources-plugin:2.4.3:copy-resources (copy standard dirs and files to base-bin)
@ SimpleServer ---
[INFO] Using 'UTF-8' encoding to copy filtered resources.
[INFO] Copying 2 resources
[INFO] skip non existing resourceDirectory <https://builds.apache.org/job/UIMA%20Addons/ws/SimpleServer/src/main/readme>
[INFO] 
[INFO] --- maven-compiler-plugin:2.3.1:compile (default-compile) @ SimpleServer ---
[INFO] Compiling 33 source files to <https://builds.apache.org/job/UIMA%20Addons/ws/SimpleServer/target/classes>
channel stopped
ERROR: Failed to parse POMs
java.io.IOException: Remote call on Channel to Maven [/home/hudson/tools/java/latest1.6/bin/java,
-cp, /home/jenkins/jenkins-slave/maven3-agent.jar:/home/hudson/tools/maven/latest3/boot/plexus-classworlds-2.4.jar,
org.jvnet.hudson.maven3.agent.Maven3Main, /home/hudson/tools/maven/latest3, /x1/jenkins/jenkins-slave/slave.jar,
/home/jenkins/jenkins-slave/maven3-interceptor.jar, 49661] failed
	at hudson.remoting.Channel.call(Channel.java:677)
	at hudson.maven.ProcessCache$MavenProcess.call(ProcessCache.java:156)
	at hudson.maven.MavenModuleSetBuild$RunnerImpl.doRun(MavenModuleSetBuild.java:759)
	at hudson.model.AbstractBuild$AbstractRunner.run(AbstractBuild.java:448)
	at hudson.model.Run.run(Run.java:1376)
	at hudson.maven.MavenModuleSetBuild.run(MavenModuleSetBuild.java:479)
	at hudson.model.ResourceController.execute(ResourceController.java:88)
	at hudson.model.Executor.run(Executor.java:230)
Caused by: java.lang.OutOfMemoryError: PermGen space
	at sun.misc.Unsafe.defineClass(Native Method)
	at sun.reflect.ClassDefiner.defineClass(ClassDefiner.java:45)
	at sun.reflect.MethodAccessorGenerator$1.run(MethodAccessorGenerator.java:381)
	at java.security.AccessController.doPrivileged(Native Method)
	at sun.reflect.MethodAccessorGenerator.generate(MethodAccessorGenerator.java:377)
	at sun.reflect.MethodAccessorGenerator.generateSerializationConstructor(MethodAccessorGenerator.java:95)
	at sun.reflect.ReflectionFactory.newConstructorForSerialization(ReflectionFactory.java:313)
	at java.io.ObjectStreamClass.getSerializableConstructor(ObjectStreamClass.java:1327)
	at java.io.ObjectStreamClass.access$1500(ObjectStreamClass.java:52)
	at java.io.ObjectStreamClass$2.run(ObjectStreamClass.java:437)
	at java.security.AccessController.doPrivileged(Native Method)
	at java.io.ObjectStreamClass.<init>(ObjectStreamClass.java:413)
	at java.io.ObjectStreamClass.lookup(ObjectStreamClass.java:310)
	at java.io.ObjectOutputStream.writeObject0(ObjectOutputStream.java:1106)
	at java.io.ObjectOutputStream.writeObject(ObjectOutputStream.java:326)
	at hudson.remoting.Channel.send(Channel.java:491)
	at hudson.remoting.ProxyOutputStream._write(ProxyOutputStream.java:123)
	at hudson.remoting.ProxyOutputStream.write(ProxyOutputStream.java:103)
	at hudson.remoting.RemoteOutputStream.write(RemoteOutputStream.java:110)
	at java.io.PrintStream.write(PrintStream.java:430)
	at sun.nio.cs.StreamEncoder.writeBytes(StreamEncoder.java:202)
	at sun.nio.cs.StreamEncoder.implFlushBuffer(StreamEncoder.java:272)
	at sun.nio.cs.StreamEncoder.flushBuffer(StreamEncoder.java:85)
	at java.io.OutputStreamWriter.flushBuffer(OutputStreamWriter.java:168)
	at java.io.PrintStream.write(PrintStream.java:477)
	at java.io.PrintStream.print(PrintStream.java:619)
	at java.io.PrintStream.println(PrintStream.java:756)
	at hudson.maven.Maven3Builder$MavenExecutionListener.mojoFailed(Maven3Builder.java:605)
	at org.apache.maven.lifecycle.internal.DefaultExecutionEventCatapult.fire(DefaultExecutionEventCatapult.java:90)
	at org.apache.maven.lifecycle.internal.MojoExecutor.execute(MojoExecutor.java:232)
	at org.apache.maven.lifecycle.internal.MojoExecutor.execute(MojoExecutor.java:153)
	at org.apache.maven.lifecycle.internal.MojoExecutor.execute(MojoExecutor.java:145)


Mime
View raw message