uima-dev mailing list archives

Site index · List index
Message view « Date » · « Thread »
Top « Date » · « Thread »
From Apache Jenkins Server <jenk...@builds.apache.org>
Subject Build failed in Jenkins: UIMA Addons #64
Date Mon, 01 Aug 2011 19:01:27 GMT
See <https://builds.apache.org/job/UIMA%20Addons/64/changes>

Changes:

[schor] [UIMA-2185] fix to use standard source-release assembly process

[schor] [UIMA-2185] fix to use standard uimaBuildResourcesVersion

------------------------------------------
[...truncated 316 lines...]
[INFO] <https://builds.apache.org/job/UIMA%20Addons/ws/AlchemyAPIAnnotator/target/site/d/AlchemyAPIAnnotatorUserGuide.html>
has been generated.
[INFO] 
[INFO] --- docbkx-maven-plugin:2.0.11:generate-pdf (pdf) @ AlchemyAPIAnnotator ---
[INFO] Processing input file: AlchemyAPIAnnotatorUserGuide.xml
Aug 1, 2011 6:51:15 PM org.apache.fop.fonts.FontInfo notifyFontReplacement
WARNING: Font 'Symbol,normal,700' not found. Substituting with 'Symbol,normal,400'.
Aug 1, 2011 6:51:15 PM org.apache.fop.fonts.FontInfo notifyFontReplacement
WARNING: Font 'ZapfDingbats,normal,700' not found. Substituting with 'ZapfDingbats,normal,400'.
Aug 1, 2011 6:51:16 PM org.apache.fop.fo.FONode attributeWarning
WARNING: Warning(95/1015): fo:table, table-layout="auto" is currently not supported by FOP
Aug 1, 2011 6:51:16 PM org.apache.fop.fonts.FontInfo notifyFontReplacement
WARNING: Font 'ZapfDingbats,italic,400' not found. Substituting with 'ZapfDingbats,normal,400'.
[INFO] <https://builds.apache.org/job/UIMA%20Addons/ws/AlchemyAPIAnnotator/target/docbkx/pdf/AlchemyAPIAnnotatorUserGuide.fo>
has been generated.
[INFO] [INFO] Using 'UTF-8' encoding to copy filtered resources.

[INFO] --- maven-resources-plugin:2.4.3:copy-resources (docbook-copy-images) @ AlchemyAPIAnnotator
---
[INFO] Copying 0 resource
[INFO] [INFO] Using 'UTF-8' encoding to copy filtered resources.
[INFO] Copying 1 resource

[INFO] --- maven-resources-plugin:2.4.3:copy-resources (docbook-copy-css) @ AlchemyAPIAnnotator
---
[INFO] [INFO] Using 'UTF-8' encoding to copy filtered resources.
[INFO] Copying 1 resource

[INFO] --- maven-resources-plugin:2.4.3:copy-resources (docbook-move-pdf) @ AlchemyAPIAnnotator
---
[INFO] 
[INFO] --- maven-javadoc-plugin:2.7:jar (attach-javadocs) @ AlchemyAPIAnnotator ---
[INFO] Building jar: <https://builds.apache.org/job/UIMA%20Addons/ws/AlchemyAPIAnnotator/target/uima-an-alchemy-javadoc.jar>
[INFO] [INFO] Using 'UTF-8' encoding to copy filtered resources.
[INFO] Copying 2 resources

[INFO] --- maven-resources-plugin:2.4.3:copy-resources (copy standard target jar to base-bin/lib)
@ AlchemyAPIAnnotator ---
[INFO] 
[INFO] --- maven-assembly-plugin:2.2:single (binary-release) @ AlchemyAPIAnnotator ---
[INFO] Skipping the assembly in this project because it's not the Execution Root
[INFO] [INFO] Using 'UTF-8' encoding to copy filtered resources.

[INFO] --- maven-resources-plugin:2.4.3:copy-resources (Copy base-bin to osgi) @ AlchemyAPIAnnotator
---[INFO] Copying 16 resources

[INFO] [INFO] Using 'UTF-8' encoding to copy filtered resources.

[INFO] --- maven-resources-plugin:2.4.3:copy-resources (Copy base-bin to pearPackaging) @
AlchemyAPIAnnotator ---
[INFO] Copying 16 resources
[INFO] 
[INFO] --- maven-bundle-plugin:2.3.5:manifest (uima-bundle) @ AlchemyAPIAnnotator ---
mojoFailed org.apache.felix:maven-bundle-plugin:2.3.5(uima-bundle)
projectFailed org.apache.uima:AlchemyAPIAnnotator:2.3.1-SNAPSHOT
[JENKINS] Archiving <https://builds.apache.org/job/UIMA%20Addons/ws/AlchemyAPIAnnotator/pom.xml>
to /home/hudson/hudson/jobs/UIMA Addons/modules/org.apache.uima$AlchemyAPIAnnotator/builds/2011-08-01_19-00-42/archive/org.apache.uima/AlchemyAPIAnnotator/2.3.1-SNAPSHOT/AlchemyAPIAnnotator-2.3.1-SNAPSHOT.pom
[JENKINS] Archiving <https://builds.apache.org/job/UIMA%20Addons/ws/AlchemyAPIAnnotator/target/uima-an-alchemy.jar>
to /home/hudson/hudson/jobs/UIMA Addons/modules/org.apache.uima$AlchemyAPIAnnotator/builds/2011-08-01_19-00-42/archive/org.apache.uima/AlchemyAPIAnnotator/2.3.1-SNAPSHOT/AlchemyAPIAnnotator-2.3.1-SNAPSHOT.jar
[JENKINS] Archiving <https://builds.apache.org/job/UIMA%20Addons/ws/AlchemyAPIAnnotator/target/uima-an-alchemy-javadoc.jar>
to /home/hudson/hudson/jobs/UIMA Addons/modules/org.apache.uima$AlchemyAPIAnnotator/builds/2011-08-01_19-00-42/archive/org.apache.uima/AlchemyAPIAnnotator/2.3.1-SNAPSHOT/AlchemyAPIAnnotator-2.3.1-SNAPSHOT-javadoc.jar
sessionEnded
[INFO] ------------------------------------------------------------------------
[INFO] Reactor Summary:
[INFO] 
[INFO] UIMA-AddOns: uima-addons-parent ................... SUCCESS [3.395s]
[INFO] UIMA Annotator: AlchemyAPIAnnotator ............... FAILURE [30.990s]
[INFO] UIMA Annotator: BSFAnnotator ...................... SKIPPED
[INFO] UIMA Annotator: ConceptMapper ..................... SKIPPED
[INFO] UIMA Annotator: ConfigurableFeatureExtractor ...... SKIPPED
[INFO] UIMA Annotator: DictionaryAnnotator ............... SKIPPED
[INFO] UIMA Addon: FsVariables ........................... SKIPPED
[INFO] UIMA Annotator: Lucas ............................. SKIPPED
[INFO] UIMA Annotator: OpenCalaisAnnotator ............... SKIPPED
[INFO] UIMA Addon: PearPackagingAntTask .................. SKIPPED
[INFO] UIMA Annotator: RegularExpressionAnnotator ........ SKIPPED
[INFO] UIMA Addon: SimpleServer .......................... SKIPPED
[INFO] UIMA Annotator: SnowballAnnotator ................. SKIPPED
[INFO] UIMA Annotator: Solrcas ........................... SKIPPED
[INFO] UIMA Annotator: WhitespaceTokenizer ............... SKIPPED
[INFO] UIMA Annotator: Tagger ............................ SKIPPED
[INFO] UIMA Annotator: TikaAnnotator ..................... SKIPPED
[INFO] UIMA Aggregate: uima-addons ....................... SKIPPED
[INFO] ------------------------------------------------------------------------
[INFO] BUILD FAILURE
[INFO] ------------------------------------------------------------------------
[INFO] Total time: 41.317s
[INFO] Finished at: Mon Aug 01 18:51:24 GMT 2011
[INFO] Final Memory: 39M/425M
[INFO] ------------------------------------------------------------------------
maven builder waiting
mavenExecutionResult exceptions not empty
message : Failed to execute goal org.apache.felix:maven-bundle-plugin:2.3.5:manifest (uima-bundle)
on project AlchemyAPIAnnotator: Execution uima-bundle of goal org.apache.felix:maven-bundle-plugin:2.3.5:manifest
failed: An API incompatibility was encountered while executing org.apache.felix:maven-bundle-plugin:2.3.5:manifest:
java.lang.NoSuchMethodError: java.lang.String.getBytes(Ljava/nio/charset/Charset;)[B
-----------------------------------------------------
realm =    plugin>org.apache.felix:maven-bundle-plugin:2.3.5
strategy = org.codehaus.plexus.classworlds.strategy.SelfFirstStrategy
urls[0] = file:/home/jenkins/.m2/repository/org/apache/felix/maven-bundle-plugin/2.3.5/maven-bundle-plugin-2.3.5.jar
urls[1] = file:/home/jenkins/.m2/repository/biz/aQute/bndlib/1.43.0/bndlib-1.43.0.jar
urls[2] = file:/home/jenkins/.m2/repository/org/apache/felix/org.apache.felix.bundlerepository/1.6.6/org.apache.felix.bundlerepository-1.6.6.jar
urls[3] = file:/home/jenkins/.m2/repository/org/osgi/org.osgi.core/4.1.0/org.osgi.core-4.1.0.jar
urls[4] = file:/home/jenkins/.m2/repository/org/easymock/easymock/2.4/easymock-2.4.jar
urls[5] = file:/home/jenkins/.m2/repository/org/apache/maven/reporting/maven-reporting-api/2.0.7/maven-reporting-api-2.0.7.jar
urls[6] = file:/home/jenkins/.m2/repository/org/apache/maven/doxia/doxia-sink-api/1.0-alpha-7/doxia-sink-api-1.0-alpha-7.jar
urls[7] = file:/home/jenkins/.m2/repository/junit/junit/3.8.1/junit-3.8.1.jar
urls[8] = file:/home/jenkins/.m2/repository/commons-cli/commons-cli/1.0/commons-cli-1.0.jar
urls[9] = file:/home/jenkins/.m2/repository/org/codehaus/plexus/plexus-interactivity-api/1.0-alpha-4/plexus-interactivity-api-1.0-alpha-4.jar
urls[10] = file:/home/jenkins/.m2/repository/org/apache/maven/maven-archiver/2.4.1/maven-archiver-2.4.1.jar
urls[11] = file:/home/jenkins/.m2/repository/org/codehaus/plexus/plexus-archiver/1.0/plexus-archiver-1.0.jar
urls[12] = file:/home/jenkins/.m2/repository/org/codehaus/plexus/plexus-io/1.0/plexus-io-1.0.jar
urls[13] = file:/home/jenkins/.m2/repository/org/codehaus/plexus/plexus-interpolation/1.13/plexus-interpolation-1.13.jar
urls[14] = file:/home/jenkins/.m2/repository/org/apache/maven/shared/maven-dependency-tree/1.2/maven-dependency-tree-1.2.jar
urls[15] = file:/home/jenkins/.m2/repository/org/codehaus/plexus/plexus-utils/2.1/plexus-utils-2.1.jar
Number of foreign imports: 1
import: Entry[import  from realm ClassRealm[project>org.apache.uima:AlchemyAPIAnnotator:2.3.1-SNAPSHOT,
parent: ClassRealm[maven.api, parent: null]]]

-----------------------------------------------------

cause : Execution uima-bundle of goal org.apache.felix:maven-bundle-plugin:2.3.5:manifest
failed: An API incompatibility was encountered while executing org.apache.felix:maven-bundle-plugin:2.3.5:manifest:
java.lang.NoSuchMethodError: java.lang.String.getBytes(Ljava/nio/charset/Charset;)[B
-----------------------------------------------------
realm =    plugin>org.apache.felix:maven-bundle-plugin:2.3.5
strategy = org.codehaus.plexus.classworlds.strategy.SelfFirstStrategy
urls[0] = file:/home/jenkins/.m2/repository/org/apache/felix/maven-bundle-plugin/2.3.5/maven-bundle-plugin-2.3.5.jar
urls[1] = file:/home/jenkins/.m2/repository/biz/aQute/bndlib/1.43.0/bndlib-1.43.0.jar
urls[2] = file:/home/jenkins/.m2/repository/org/apache/felix/org.apache.felix.bundlerepository/1.6.6/org.apache.felix.bundlerepository-1.6.6.jar
urls[3] = file:/home/jenkins/.m2/repository/org/osgi/org.osgi.core/4.1.0/org.osgi.core-4.1.0.jar
urls[4] = file:/home/jenkins/.m2/repository/org/easymock/easymock/2.4/easymock-2.4.jar
urls[5] = file:/home/jenkins/.m2/repository/org/apache/maven/reporting/maven-reporting-api/2.0.7/maven-reporting-api-2.0.7.jar
urls[6] = file:/home/jenkins/.m2/repository/org/apache/maven/doxia/doxia-sink-api/1.0-alpha-7/doxia-sink-api-1.0-alpha-7.jar
urls[7] = file:/home/jenkins/.m2/repository/junit/junit/3.8.1/junit-3.8.1.jar
urls[8] = file:/home/jenkins/.m2/repository/commons-cli/commons-cli/1.0/commons-cli-1.0.jar
urls[9] = file:/home/jenkins/.m2/repository/org/codehaus/plexus/plexus-interactivity-api/1.0-alpha-4/plexus-interactivity-api-1.0-alpha-4.jar
urls[10] = file:/home/jenkins/.m2/repository/org/apache/maven/maven-archiver/2.4.1/maven-archiver-2.4.1.jar
urls[11] = file:/home/jenkins/.m2/repository/org/codehaus/plexus/plexus-archiver/1.0/plexus-archiver-1.0.jar
urls[12] = file:/home/jenkins/.m2/repository/org/codehaus/plexus/plexus-io/1.0/plexus-io-1.0.jar
urls[13] = file:/home/jenkins/.m2/repository/org/codehaus/plexus/plexus-interpolation/1.13/plexus-interpolation-1.13.jar
urls[14] = file:/home/jenkins/.m2/repository/org/apache/maven/shared/maven-dependency-tree/1.2/maven-dependency-tree-1.2.jar
urls[15] = file:/home/jenkins/.m2/repository/org/codehaus/plexus/plexus-utils/2.1/plexus-utils-2.1.jar
Number of foreign imports: 1
import: Entry[import  from realm ClassRealm[project>org.apache.uima:AlchemyAPIAnnotator:2.3.1-SNAPSHOT,
parent: ClassRealm[maven.api, parent: null]]]

-----------------------------------------------------

Stack trace : 
org.apache.maven.lifecycle.LifecycleExecutionException: Failed to execute goal org.apache.felix:maven-bundle-plugin:2.3.5:manifest
(uima-bundle) on project AlchemyAPIAnnotator: Execution uima-bundle of goal org.apache.felix:maven-bundle-plugin:2.3.5:manifest
failed: An API incompatibility was encountered while executing org.apache.felix:maven-bundle-plugin:2.3.5:manifest:
java.lang.NoSuchMethodError: java.lang.String.getBytes(Ljava/nio/charset/Charset;)[B
-----------------------------------------------------
realm =    plugin>org.apache.felix:maven-bundle-plugin:2.3.5
strategy = org.codehaus.plexus.classworlds.strategy.SelfFirstStrategy
urls[0] = file:/home/jenkins/.m2/repository/org/apache/felix/maven-bundle-plugin/2.3.5/maven-bundle-plugin-2.3.5.jar
urls[1] = file:/home/jenkins/.m2/repository/biz/aQute/bndlib/1.43.0/bndlib-1.43.0.jar
urls[2] = file:/home/jenkins/.m2/repository/org/apache/felix/org.apache.felix.bundlerepository/1.6.6/org.apache.felix.bundlerepository-1.6.6.jar
urls[3] = file:/home/jenkins/.m2/repository/org/osgi/org.osgi.core/4.1.0/org.osgi.core-4.1.0.jar
urls[4] = file:/home/jenkins/.m2/repository/org/easymock/easymock/2.4/easymock-2.4.jar
urls[5] = file:/home/jenkins/.m2/repository/org/apache/maven/reporting/maven-reporting-api/2.0.7/maven-reporting-api-2.0.7.jar
urls[6] = file:/home/jenkins/.m2/repository/org/apache/maven/doxia/doxia-sink-api/1.0-alpha-7/doxia-sink-api-1.0-alpha-7.jar
urls[7] = file:/home/jenkins/.m2/repository/junit/junit/3.8.1/junit-3.8.1.jar
urls[8] = file:/home/jenkins/.m2/repository/commons-cli/commons-cli/1.0/commons-cli-1.0.jar
urls[9] = file:/home/jenkins/.m2/repository/org/codehaus/plexus/plexus-interactivity-api/1.0-alpha-4/plexus-interactivity-api-1.0-alpha-4.jar
urls[10] = file:/home/jenkins/.m2/repository/org/apache/maven/maven-archiver/2.4.1/maven-archiver-2.4.1.jar
urls[11] = file:/home/jenkins/.m2/repository/org/codehaus/plexus/plexus-archiver/1.0/plexus-archiver-1.0.jar
urls[12] = file:/home/jenkins/.m2/repository/org/codehaus/plexus/plexus-io/1.0/plexus-io-1.0.jar
urls[13] = file:/home/jenkins/.m2/repository/org/codehaus/plexus/plexus-interpolation/1.13/plexus-interpolation-1.13.jar
urls[14] = file:/home/jenkins/.m2/repository/org/apache/maven/shared/maven-dependency-tree/1.2/maven-dependency-tree-1.2.jar
urls[15] = file:/home/jenkins/.m2/repository/org/codehaus/plexus/plexus-utils/2.1/plexus-utils-2.1.jar
Number of foreign imports: 1
import: Entry[import  from realm ClassRealm[project>org.apache.uima:AlchemyAPIAnnotator:2.3.1-SNAPSHOT,
parent: ClassRealm[maven.api, parent: null]]]

-----------------------------------------------------

	at org.apache.maven.lifecycle.internal.MojoExecutor.execute(MojoExecutor.java:225)
	at org.apache.maven.lifecycle.internal.MojoExecutor.execute(MojoExecutor.java:153)
	at org.apache.maven.lifecycle.internal.MojoExecutor.execute(MojoExecutor.java:145)
	at org.apache.maven.lifecycle.internal.LifecycleModuleBuilder.buildProject(LifecycleModuleBuilder.java:84)
	at org.apache.maven.lifecycle.internal.LifecycleModuleBuilder.buildProject(LifecycleModuleBuilder.java:59)
	at org.apache.maven.lifecycle.internal.LifecycleStarter.singleThreadedBuild(LifecycleStarter.java:183)
	at org.apache.maven.lifecycle.internal.LifecycleStarter.execute(LifecycleStarter.java:161)
	at org.apache.maven.DefaultMaven.doExecute(DefaultMaven.java:319)
	at org.apache.maven.DefaultMaven.execute(DefaultMaven.java:156)
	at org.jvnet.hudson.maven3.launcher.Maven3Launcher.main(Maven3Launcher.java:79)
	at sun.reflect.NativeMethodAccessorImpl.invoke0(Native Method)
	at sun.reflect.NativeMethodAccessorImpl.invoke(NativeMethodAccessorImpl.java:39)
	at sun.reflect.DelegatingMethodAccessorImpl.invoke(DelegatingMethodAccessorImpl.java:25)
	at java.lang.reflect.Method.invoke(Method.java:592)
	at org.codehaus.plexus.classworlds.launcher.Launcher.launchStandard(Launcher.java:329)
	at org.codehaus.plexus.classworlds.launcher.Launcher.launch(Launcher.java:239)
	at org.jvnet.hudson.maven3.agent.Maven3Main.launch(Maven3Main.java:158)
	at hudson.maven.Maven3Builder.call(Maven3Builder.java:128)
	at hudson.maven.Maven3Builder.call(Maven3Builder.java:75)
	at hudson.remoting.UserRequest.perform(UserRequest.java:118)
	at hudson.remoting.UserRequest.perform(UserRequest.java:48)
	at hudson.remoting.Request$2.run(Request.java:270)
	at java.util.concurrent.Executors$RunnableAdapter.call(Executors.java:417)
	at java.util.concurrent.FutureTask$Sync.innerRun(FutureTask.java:269)
	at java.util.concurrent.FutureTask.run(FutureTask.java:123)
	at java.util.concurrent.ThreadPoolExecutor$Worker.runTask(ThreadPoolExecutor.java:651)
	at java.util.concurrent.ThreadPoolExecutor$Worker.run(ThreadPoolExecutor.java:676)
	at java.lang.Thread.run(Thread.java:595)
Caused by: org.apache.maven.plugin.PluginExecutionException: Execution uima-bundle of goal
org.apache.felix:maven-bundle-plugin:2.3.5:manifest failed: An API incompatibility was encountered
while executing org.apache.felix:maven-bundle-plugin:2.3.5:manifest: java.lang.NoSuchMethodError:
java.lang.String.getBytes(Ljava/nio/charset/Charset;)[B
-----------------------------------------------------
realm =    plugin>org.apache.felix:maven-bundle-plugin:2.3.5
strategy = org.codehaus.plexus.classworlds.strategy.SelfFirstStrategy
urls[0] = file:/home/jenkins/.m2/repository/org/apache/felix/maven-bundle-plugin/2.3.5/maven-bundle-plugin-2.3.5.jar
urls[1] = file:/home/jenkins/.m2/repository/biz/aQute/bndlib/1.43.0/bndlib-1.43.0.jar
urls[2] = file:/home/jenkins/.m2/repository/org/apache/felix/org.apache.felix.bundlerepository/1.6.6/org.apache.felix.bundlerepository-1.6.6.jar
urls[3] = file:/home/jenkins/.m2/repository/org/osgi/org.osgi.core/4.1.0/org.osgi.core-4.1.0.jar
urls[4] = file:/home/jenkins/.m2/repository/org/easymock/easymock/2.4/easymock-2.4.jar
urls[5] = file:/home/jenkins/.m2/repository/org/apache/maven/reporting/maven-reporting-api/2.0.7/maven-reporting-api-2.0.7.jar
urls[6] = file:/home/jenkins/.m2/repository/org/apache/maven/doxia/doxia-sink-api/1.0-alpha-7/doxia-sink-api-1.0-alpha-7.jar
urls[7] = file:/home/jenkins/.m2/repository/junit/junit/3.8.1/junit-3.8.1.jar
urls[8] = file:/home/jenkins/.m2/repository/commons-cli/commons-cli/1.0/commons-cli-1.0.jar
urls[9] = file:/home/jenkins/.m2/repository/org/codehaus/plexus/plexus-interactivity-api/1.0-alpha-4/plexus-interactivity-api-1.0-alpha-4.jar
urls[10] = file:/home/jenkins/.m2/repository/org/apache/maven/maven-archiver/2.4.1/maven-archiver-2.4.1.jar
urls[11] = file:/home/jenkins/.m2/repository/org/codehaus/plexus/plexus-archiver/1.0/plexus-archiver-1.0.jar
urls[12] = file:/home/jenkins/.m2/repository/org/codehaus/plexus/plexus-io/1.0/plexus-io-1.0.jar
urls[13] = file:/home/jenkins/.m2/repository/org/codehaus/plexus/plexus-interpolation/1.13/plexus-interpolation-1.13.jar
urls[14] = file:/home/jenkins/.m2/repository/org/apache/maven/shared/maven-dependency-tree/1.2/maven-dependency-tree-1.2.jar
urls[15] = file:/home/jenkins/.m2/repository/org/codehaus/plexus/plexus-utils/2.1/plexus-utils-2.1.jar
Number of foreign imports: 1
import: Entry[import  from realm ClassRealm[project>org.apache.uima:AlchemyAPIAnnotator:2.3.1-SNAPSHOT,
parent: ClassRealm[maven.api, parent: null]]]

-----------------------------------------------------

	at org.apache.maven.plugin.DefaultBuildPluginManager.executeMojo(DefaultBuildPluginManager.java:139)
	at org.apache.maven.lifecycle.internal.MojoExecutor.execute(MojoExecutor.java:209)
	... 27 more
Caused by: org.apache.maven.plugin.PluginContainerException: An API incompatibility was encountered
while executing org.apache.felix:maven-bundle-plugin:2.3.5:manifest: java.lang.NoSuchMethodError:
java.lang.String.getBytes(Ljava/nio/charset/Charset;)[B
-----------------------------------------------------
realm =    plugin>org.apache.felix:maven-bundle-plugin:2.3.5
strategy = org.codehaus.plexus.classworlds.strategy.SelfFirstStrategy
urls[0] = file:/home/jenkins/.m2/repository/org/apache/felix/maven-bundle-plugin/2.3.5/maven-bundle-plugin-2.3.5.jar
urls[1] = file:/home/jenkins/.m2/repository/biz/aQute/bndlib/1.43.0/bndlib-1.43.0.jar
urls[2] = file:/home/jenkins/.m2/repository/org/apache/felix/org.apache.felix.bundlerepository/1.6.6/org.apache.felix.bundlerepository-1.6.6.jar
urls[3] = file:/home/jenkins/.m2/repository/org/osgi/org.osgi.core/4.1.0/org.osgi.core-4.1.0.jar
urls[4] = file:/home/jenkins/.m2/repository/org/easymock/easymock/2.4/easymock-2.4.jar
urls[5] = file:/home/jenkins/.m2/repository/org/apache/maven/reporting/maven-reporting-api/2.0.7/maven-reporting-api-2.0.7.jar
urls[6] = file:/home/jenkins/.m2/repository/org/apache/maven/doxia/doxia-sink-api/1.0-alpha-7/doxia-sink-api-1.0-alpha-7.jar
urls[7] = file:/home/jenkins/.m2/repository/junit/junit/3.8.1/junit-3.8.1.jar
urls[8] = file:/home/jenkins/.m2/repository/commons-cli/commons-cli/1.0/commons-cli-1.0.jar
urls[9] = file:/home/jenkins/.m2/repository/org/codehaus/plexus/plexus-interactivity-api/1.0-alpha-4/plexus-interactivity-api-1.0-alpha-4.jar
urls[10] = file:/home/jenkins/.m2/repository/org/apache/maven/maven-archiver/2.4.1/maven-archiver-2.4.1.jar
urls[11] = file:/home/jenkins/.m2/repository/org/codehaus/plexus/plexus-archiver/1.0/plexus-archiver-1.0.jar
urls[12] = file:/home/jenkins/.m2/repository/org/codehaus/plexus/plexus-io/1.0/plexus-io-1.0.jar
urls[13] = file:/home/jenkins/.m2/repository/org/codehaus/plexus/plexus-interpolation/1.13/plexus-interpolation-1.13.jar
urls[14] = file:/home/jenkins/.m2/repository/org/apache/maven/shared/maven-dependency-tree/1.2/maven-dependency-tree-1.2.jar
urls[15] = file:/home/jenkins/.m2/repository/org/codehaus/plexus/plexus-utils/2.1/plexus-utils-2.1.jar
Number of foreign imports: 1
import: Entry[import  from realm ClassRealm[project>org.apache.uima:AlchemyAPIAnnotator:2.3.1-SNAPSHOT,
parent: ClassRealm[maven.api, parent: null]]]

-----------------------------------------------------

	at org.apache.maven.plugin.DefaultBuildPluginManager.executeMojo(DefaultBuildPluginManager.java:137)
	... 28 more
Caused by: java.lang.NoSuchMethodError: java.lang.String.getBytes(Ljava/nio/charset/Charset;)[B
	at aQute.lib.osgi.Jar.<clinit>(Jar.java:290)
	at org.apache.felix.bundleplugin.BundlePlugin.getClasspath(BundlePlugin.java:942)
	at org.apache.felix.bundleplugin.BundlePlugin.execute(BundlePlugin.java:261)
	at org.apache.felix.bundleplugin.BundlePlugin.execute(BundlePlugin.java:252)
	at org.apache.maven.plugin.DefaultBuildPluginManager.executeMojo(DefaultBuildPluginManager.java:101)
	... 28 more
Sending e-mails to: dev@uima.apache.org
channel stopped


Mime
View raw message