uima-dev mailing list archives

Site index · List index
Message view « Date » · « Thread »
Top « Date » · « Thread »
From Apache Jenkins Server <jenk...@builds.apache.org>
Subject Build failed in Jenkins: UIMA-SDK #119
Date Tue, 04 Oct 2011 18:08:00 GMT
See <https://builds.apache.org/job/UIMA-SDK/119/changes>

Changes:

[joern] UIMA-2245 Updated to store settings in a Preferenc eStore instead of the Dot Corpus
file. And added a mechanism to initialize the Preference Store from an existing Dot Corpus
file.

------------------------------------------
[...truncated 7889 lines...]

[INFO] --- maven-surefire-plugin:2.9:test (default-test) @ uimaj-bootstrap ---

Results :

Tests run: 0, Failures: 0, Errors: 0, Skipped: 0

[JENKINS] Recording test results
[INFO] 
[INFO] --- maven-jar-plugin:2.3.1:jar (default-jar) @ uimaj-bootstrap ---
[INFO] Building jar: <https://builds.apache.org/job/UIMA-SDK/ws/trunk/uimaj-bootstrap/target/uimaj-bootstrap-2.3.2-SNAPSHOT.jar>
[INFO] 
[INFO] --- maven-site-plugin:3.0:attach-descriptor (attach-descriptor) @ uimaj-bootstrap ---
[INFO] [INFO] Installing <https://builds.apache.org/job/UIMA-SDK/ws/trunk/uimaj-bootstrap/target/uimaj-bootstrap-2.3.2-SNAPSHOT.jar>
to /home/jenkins/.m2/repository/org/apache/uima/uimaj-bootstrap/2.3.2-SNAPSHOT/uimaj-bootstrap-2.3.2-SNAPSHOT.jar
[INFO] Installing <https://builds.apache.org/job/UIMA-SDK/ws/trunk/uimaj-bootstrap/pom.xml>
to /home/jenkins/.m2/repository/org/apache/uima/uimaj-bootstrap/2.3.2-SNAPSHOT/uimaj-bootstrap-2.3.2-SNAPSHOT.pom

[INFO] --- maven-install-plugin:2.3.1:install (default-install) @ uimaj-bootstrap ---
[JENKINS] Archiving <https://builds.apache.org/job/UIMA-SDK/ws/trunk/uimaj-bootstrap/pom.xml>
to /home/hudson/hudson/jobs/UIMA-SDK/modules/org.apache.uima$uimaj-bootstrap/builds/2011-10-04_18-02-54/archive/org.apache.uima/uimaj-bootstrap/2.3.2-SNAPSHOT/uimaj-bootstrap-2.3.2-SNAPSHOT.pom
[JENKINS] Archiving <https://builds.apache.org/job/UIMA-SDK/ws/trunk/uimaj-bootstrap/target/uimaj-bootstrap-2.3.2-SNAPSHOT.jar>
to /home/hudson/hudson/jobs/UIMA-SDK/modules/org.apache.uima$uimaj-bootstrap/builds/2011-10-04_18-02-54/archive/org.apache.uima/uimaj-bootstrap/2.3.2-SNAPSHOT/uimaj-bootstrap-2.3.2-SNAPSHOT.jar
[INFO]                                                                         
[INFO] ------------------------------------------------------------------------
[INFO] Building UIMA Aggregate: aggregate-uimaj: UIMA Base 2.3.2-SNAPSHOT
[INFO] ------------------------------------------------------------------------
[INFO] 
[INFO] --- maven-clean-plugin:2.4.1:clean (default-clean) @ aggregate-uimaj ---
[INFO] 
[INFO] --- build-helper-maven-plugin:1.5:parse-version (parse-project-version) @ aggregate-uimaj
---
[INFO] 
[INFO] --- uima-build-helper-maven-plugin:2:parse-date-time (set buildYear and buildMonth)
@ aggregate-uimaj ---
[INFO] 
[INFO] --- maven-remote-resources-plugin:1.2.1:process (default) @ aggregate-uimaj ---
[INFO] 
[INFO] --- maven-site-plugin:3.0:attach-descriptor (attach-descriptor) @ aggregate-uimaj ---
[INFO] [INFO] Installing <https://builds.apache.org/job/UIMA-SDK/ws/trunk/aggregate-uimaj/pom.xml>
to /home/jenkins/.m2/repository/org/apache/uima/aggregate-uimaj/2.3.2-SNAPSHOT/aggregate-uimaj-2.3.2-SNAPSHOT.pom

[INFO] --- maven-install-plugin:2.3.1:install (default-install) @ aggregate-uimaj ---
[JENKINS] Archiving <https://builds.apache.org/job/UIMA-SDK/ws/trunk/aggregate-uimaj/pom.xml>
to /home/hudson/hudson/jobs/UIMA-SDK/modules/org.apache.uima$aggregate-uimaj/builds/2011-10-04_18-02-54/archive/org.apache.uima/aggregate-uimaj/2.3.2-SNAPSHOT/aggregate-uimaj-2.3.2-SNAPSHOT.pom
[INFO]                                                                         
[INFO] ------------------------------------------------------------------------
[INFO] Building UIMA Java SDK: uimaj 2.3.2-SNAPSHOT
[INFO] ------------------------------------------------------------------------
[INFO] 
[INFO] --- maven-clean-plugin:2.4.1:clean (default-clean) @ uimaj ---
[INFO] 
[INFO] --- build-helper-maven-plugin:1.5:parse-version (parse-project-version) @ uimaj ---
[INFO] 
[INFO] --- uima-build-helper-maven-plugin:2:parse-date-time (set buildYear and buildMonth)
@ uimaj ---
[INFO] 
[INFO] --- maven-remote-resources-plugin:1.2.1:process (default) @ uimaj ---
[INFO] 
[INFO] --- build-helper-maven-plugin:1.5:parse-version (parse-project-version) @ uimaj ---
[INFO] 
[INFO] --- uima-build-helper-maven-plugin:2:parse-date-time (set buildYear and buildMonth)
@ uimaj ---
[JENKINS] Archiving <https://builds.apache.org/job/UIMA-SDK/ws/trunk/pom.xml> to /home/hudson/hudson/jobs/UIMA-SDK/modules/org.apache.uima$uimaj/builds/2011-10-04_18-02-54/archive/org.apache.uima/uimaj/2.3.2-SNAPSHOT/uimaj-2.3.2-SNAPSHOT.pom
ignoring exception during new ExecutedMojo null
[INFO] 
[INFO] --- maven-javadoc-plugin:2.8:javadoc (javadocs-distr) @ uimaj ---
[JENKINS] Archiving  javadoc
[INFO] 
[INFO] --- maven-site-plugin:3.0:attach-descriptor (attach-descriptor) @ uimaj ---
[INFO] 
[INFO] --- maven-assembly-plugin:2.2.1:single (uima-distr) @ uimaj ---
[INFO] Reading assembly descriptor: src/main/assembly/bin.xml
[INFO] apache-uima/docs/ already added, skipping
[INFO] apache-uima/docs/d already added, skipping
[INFO] apache-uima/docs/d/images already added, skipping
[INFO] apache-uima/docs/d/css already added, skipping
[INFO] apache-uima/docs/d/css/stylesheet-html.css already added, skipping
[INFO] apache-uima/docs/ already added, skipping
[INFO] apache-uima/docs/d already added, skipping
[INFO] apache-uima/docs/d/images already added, skipping
[INFO] apache-uima/docs/d/css already added, skipping
[INFO] apache-uima/docs/d/css/stylesheet-html.css already added, skipping
[INFO] apache-uima/docs/ already added, skipping
[INFO] apache-uima/docs/d already added, skipping
[INFO] apache-uima/docs/d/images already added, skipping
[INFO] apache-uima/docs/d/css already added, skipping
[INFO] apache-uima/docs/d/css/stylesheet-html.css already added, skipping
[INFO] Building tar : <https://builds.apache.org/job/UIMA-SDK/ws/trunk/target/uimaj-2.3.2-SNAPSHOT-bin.tar.gz>
[INFO] apache-uima/docs/ already added, skipping
[INFO] apache-uima/docs/d already added, skipping
[INFO] apache-uima/docs/d/images already added, skipping
[INFO] apache-uima/docs/d/css already added, skipping
[INFO] apache-uima/docs/d/css/stylesheet-html.css already added, skipping
[INFO] apache-uima/docs/ already added, skipping
[INFO] apache-uima/docs/d already added, skipping
[INFO] apache-uima/docs/d/images already added, skipping
[INFO] apache-uima/docs/d/css already added, skipping
[INFO] apache-uima/docs/d/css/stylesheet-html.css already added, skipping
[INFO] apache-uima/docs/ already added, skipping
[INFO] apache-uima/docs/d already added, skipping
[INFO] apache-uima/docs/d/images already added, skipping
[INFO] apache-uima/docs/d/css already added, skipping
[INFO] apache-uima/docs/d/css/stylesheet-html.css already added, skipping
[INFO] apache-uima/docs/ already added, skipping
[INFO] apache-uima/docs/d already added, skipping
[INFO] apache-uima/docs/d/images already added, skipping
[INFO] apache-uima/docs/d/css already added, skipping
[INFO] apache-uima/docs/d/css/stylesheet-html.css already added, skipping
[INFO] apache-uima/docs/ already added, skipping
[INFO] apache-uima/docs/d already added, skipping
[INFO] apache-uima/docs/d/images already added, skipping
[INFO] apache-uima/docs/d/css already added, skipping
[INFO] apache-uima/docs/d/css/stylesheet-html.css already added, skipping
[INFO] apache-uima/docs/ already added, skipping
[INFO] apache-uima/docs/d already added, skipping
[INFO] apache-uima/docs/d/images already added, skipping
[INFO] apache-uima/docs/d/css already added, skipping
[INFO] apache-uima/docs/d/css/stylesheet-html.css already added, skipping
[INFO] Building zip: <https://builds.apache.org/job/UIMA-SDK/ws/trunk/target/uimaj-2.3.2-SNAPSHOT-bin.zip>
[INFO] apache-uima/docs/ already added, skipping
[INFO] apache-uima/docs/d already added, skipping
[INFO] apache-uima/docs/d/images already added, skipping
[INFO] apache-uima/docs/d/css already added, skipping
[INFO] apache-uima/docs/d/css/stylesheet-html.css already added, skipping
[INFO] apache-uima/docs/ already added, skipping
[INFO] apache-uima/docs/d already added, skipping
[INFO] apache-uima/docs/d/images already added, skipping
[INFO] apache-uima/docs/d/css already added, skipping
[INFO] apache-uima/docs/d/css/stylesheet-html.css already added, skipping
[INFO] apache-uima/docs/ already added, skipping
[INFO] apache-uima/docs/d already added, skipping
[INFO] apache-uima/docs/d/images already added, skipping
[INFO] apache-uima/docs/d/css already added, skipping
[INFO] apache-uima/docs/d/css/stylesheet-html.css already added, skipping
[INFO] 
[INFO] --- maven-antrun-plugin:1.6:run (generate checksums for binary artifacts) @ uimaj ---
[INFO] Executing tasks

main:
[INFO] Executed tasks
[INFO] 
[INFO] --- apache-rat-plugin:0.7:check (default-cli) @ uimaj ---
[INFO] Exclude: release.properties
[INFO] Exclude: README*
[INFO] Exclude: RELEASE_NOTES*
[INFO] Exclude: issuesFixed/**
[INFO] Exclude: src/main/resources/docbook-shared/titlepage/*.xsl
[INFO] Exclude: marker-file-identifying-*
[INFO] Exclude: DEPENDENCIES
[INFO] Exclude: aggregate-uimaj*/**
[INFO] Exclude: jVinci/**
[INFO] Exclude: PearPackagingMavenPlugin/**
[INFO] Exclude: uima-docbook-*/**
[INFO] Exclude: uimaj-adapter-*/**
[INFO] Exclude: uimaj-component-test-util/**
[INFO] Exclude: uimaj-core/**
[INFO] Exclude: uimaj-cpe/**
[INFO] Exclude: uimaj-document-annotation/**
[INFO] Exclude: uimaj-eclipse-*/**
[INFO] Exclude: uimaj-ep-*/**
[INFO] Exclude: uimaj-examples/**
[INFO] Exclude: uimaj-test-util/**
[INFO] Exclude: uimaj-tools/**
[INFO] Exclude: uimaj-jet-expander/**
[INFO] Exclude: uimaj-bootstrap/**
[INFO] Exclude: uimaj-internal-tools/**
[INFO] [INFO] Installing <https://builds.apache.org/job/UIMA-SDK/ws/trunk/pom.xml> to
/home/jenkins/.m2/repository/org/apache/uima/uimaj/2.3.2-SNAPSHOT/uimaj-2.3.2-SNAPSHOT.pom

[INFO] --- maven-install-plugin:2.3.1:install (default-install) @ uimaj ---
[INFO] Installing <https://builds.apache.org/job/UIMA-SDK/ws/trunk/target/uimaj-2.3.2-SNAPSHOT-bin.tar.gz>
to /home/jenkins/.m2/repository/org/apache/uima/uimaj/2.3.2-SNAPSHOT/uimaj-2.3.2-SNAPSHOT-bin.tar.gz
[INFO] Installing <https://builds.apache.org/job/UIMA-SDK/ws/trunk/target/uimaj-2.3.2-SNAPSHOT-bin.zip>
to /home/jenkins/.m2/repository/org/apache/uima/uimaj/2.3.2-SNAPSHOT/uimaj-2.3.2-SNAPSHOT-bin.zip
[JENKINS] Archiving <https://builds.apache.org/job/UIMA-SDK/ws/trunk/target/uimaj-2.3.2-SNAPSHOT-bin.tar.gz>
to /home/hudson/hudson/jobs/UIMA-SDK/modules/org.apache.uima$uimaj/builds/2011-10-04_18-02-54/archive/org.apache.uima/uimaj/2.3.2-SNAPSHOT/uimaj-2.3.2-SNAPSHOT-bin.tar.gz
[JENKINS] Archiving <https://builds.apache.org/job/UIMA-SDK/ws/trunk/target/uimaj-2.3.2-SNAPSHOT-bin.zip>
to /home/hudson/hudson/jobs/UIMA-SDK/modules/org.apache.uima$uimaj/builds/2011-10-04_18-02-54/archive/org.apache.uima/uimaj/2.3.2-SNAPSHOT/uimaj-2.3.2-SNAPSHOT-bin.zip
[INFO] ------------------------------------------------------------------------
[INFO] Reactor Summary:
[INFO] 
[INFO] UIMA Java SDK: uimaj-parent ....................... SUCCESS [4.497s]
[INFO] UIMA Base: uimaj-test-util: JUnit utilities ....... SUCCESS [2.346s]
[INFO] UIMA Base: uimaj-core ............................. SUCCESS [45.734s]
[INFO] UIMA Base: jVinci: Vinci Transport Library ........ SUCCESS [1.961s]
[INFO] UIMA Base: uimaj-adapter-vinci: Vinci Adapter ..... SUCCESS [2.033s]
[INFO] UIMA Base: uimaj-cpe: Collection Processing Engine  SUCCESS [21.499s]
[INFO] UIMA Base: uimaj-document-annotation .............. SUCCESS [1.672s]
[INFO] UIMA Base: uimaj-tools: Tools ..................... SUCCESS [4.806s]
[INFO] UIMA Base: uimaj-examples: SDK Examples ........... SUCCESS [2.345s]
[INFO] UIMA Base: uimaj-adapter-soap: SOAP Adapter ....... SUCCESS [1.825s]
[INFO] UIMA Base: uimaj-component-test-util: for JUnit ... SUCCESS [1.474s]
[INFO] UIMA Eclipse: uimaj-ep-debug ...................... SUCCESS [5.734s]
[INFO] UIMA Eclipse: uimaj-ep-jcasgen .................... SUCCESS [2.262s]
[INFO] UIMA Eclipse: uimaj-ep-configurator: Descriptor Editor  SUCCESS [4.291s]
[INFO] UIMA Eclipse: uimaj-ep-pear-packager .............. SUCCESS [2.232s]
[INFO] UIMA Eclipse: uimaj-ep-launcher ................... SUCCESS [2.737s]
[INFO] UIMA Eclipse: uimaj-ep-cas-editor ................. SUCCESS [5.104s]
[INFO] UIMA Eclipse: uimaj-ep-cas-editor-ide ............. SUCCESS [2.392s]
[INFO] UIMA Eclipse: uimaj-ep-runtime .................... SUCCESS [4.228s]
[INFO] UIMA Eclipse: uimaj-eclipse-feature-tools ......... SUCCESS [1.043s]
[INFO] UIMA Eclipse: uimaj-eclipse-feature-runtime ....... SUCCESS [1.061s]
[INFO] UIMA Aggregate: aggregate-uimaj-eclipse-plugins ... SUCCESS [0.421s]
[INFO] Apache UIMA SDK Documentation - overview and setup  SUCCESS [16.134s]
[INFO] Apache UIMA SDK Documentation - references ........ SUCCESS [11.578s]
[INFO] Apache UIMA SDK Documentation - tools ............. SUCCESS [9.950s]
[INFO] Apache UIMA SDK Documentation - tutorials and user's guides  SUCCESS [13.063s]
[INFO] UIMA Aggregate POM aggregate-uimaj-docbooks: UIMA Base  SUCCESS [0.400s]
[INFO] UIMA Maven Plugin PearPackagingMavenPlugin ........ SUCCESS [6.333s]
[INFO] UIMA Base: uimaj-bootstrap: Bootstrap launcher .... SUCCESS [1.158s]
[INFO] UIMA Aggregate: aggregate-uimaj: UIMA Base ........ SUCCESS [0.422s]
[INFO] UIMA Java SDK: uimaj .............................. SUCCESS [34.047s]
[INFO] ------------------------------------------------------------------------
[INFO] BUILD SUCCESS
[INFO] ------------------------------------------------------------------------
[INFO] Total time: 4:58.777s
[INFO] Finished at: Tue Oct 04 18:07:57 GMT 2011
[INFO] Final Memory: 54M/217M
[INFO] ------------------------------------------------------------------------
channel stopped
Maven RedeployPublished use remote ubuntu3 maven settings from : /home/jenkins/.m2/settings.xml
[ERROR] uniqueVersion == false is not anymore supported in maven 3
[INFO] Deployment in https://repository.apache.org/content/repositories/snapshots (id=,uniqueVersion=false)
Deploying the main artifact PearPackagingMavenPlugin-2.3.2-SNAPSHOT.jar
Downloading: https://repository.apache.org/content/repositories/snapshots/org/apache/uima/PearPackagingMavenPlugin/2.3.2-SNAPSHOT/maven-metadata.xml
Downloaded: https://repository.apache.org/content/repositories/snapshots/org/apache/uima/PearPackagingMavenPlugin/2.3.2-SNAPSHOT/maven-metadata.xml
(792 B at 2.0 KB/sec)
Uploading: https://repository.apache.org/content/repositories/snapshots/org/apache/uima/PearPackagingMavenPlugin/2.3.2-SNAPSHOT/PearPackagingMavenPlugin-2.3.2-20111004.180800-62.jar
Uploading: https://repository.apache.org/content/repositories/snapshots/org/apache/uima/PearPackagingMavenPlugin/2.3.2-SNAPSHOT/PearPackagingMavenPlugin-2.3.2-20111004.180800-62.pom
ERROR: Failed to deploy artifacts: Could not transfer artifact org.apache.uima:PearPackagingMavenPlugin:jar:2.3.2-20111004.180800-62
from/to  (https://repository.apache.org/content/repositories/snapshots): Failed to transfer
file: https://repository.apache.org/content/repositories/snapshots/org/apache/uima/PearPackagingMavenPlugin/2.3.2-SNAPSHOT/PearPackagingMavenPlugin-2.3.2-20111004.180800-62.jar.
Return code is: 401
org.apache.maven.artifact.deployer.ArtifactDeploymentException: Failed to deploy artifacts:
Could not transfer artifact org.apache.uima:PearPackagingMavenPlugin:jar:2.3.2-20111004.180800-62
from/to  (https://repository.apache.org/content/repositories/snapshots): Failed to transfer
file: https://repository.apache.org/content/repositories/snapshots/org/apache/uima/PearPackagingMavenPlugin/2.3.2-SNAPSHOT/PearPackagingMavenPlugin-2.3.2-20111004.180800-62.jar.
Return code is: 401
	at org.apache.maven.artifact.deployer.DefaultArtifactDeployer.deploy(DefaultArtifactDeployer.java:141)
	at hudson.maven.reporters.MavenArtifactRecord.deploy(MavenArtifactRecord.java:189)
	at hudson.maven.RedeployPublisher.perform(RedeployPublisher.java:158)
	at hudson.tasks.BuildStepMonitor$1.perform(BuildStepMonitor.java:19)
	at hudson.model.AbstractBuild$AbstractRunner.perform(AbstractBuild.java:693)
	at hudson.model.AbstractBuild$AbstractRunner.performAllBuildSteps(AbstractBuild.java:668)
	at hudson.maven.MavenModuleSetBuild$RunnerImpl.post2(MavenModuleSetBuild.java:953)
	at hudson.model.AbstractBuild$AbstractRunner.post(AbstractBuild.java:615)
	at hudson.model.Run.run(Run.java:1401)
	at hudson.maven.MavenModuleSetBuild.run(MavenModuleSetBuild.java:474)
	at hudson.model.ResourceController.execute(ResourceController.java:88)
	at hudson.model.Executor.run(Executor.java:230)
Caused by: org.sonatype.aether.deployment.DeploymentException: Failed to deploy artifacts:
Could not transfer artifact org.apache.uima:PearPackagingMavenPlugin:jar:2.3.2-20111004.180800-62
from/to  (https://repository.apache.org/content/repositories/snapshots): Failed to transfer
file: https://repository.apache.org/content/repositories/snapshots/org/apache/uima/PearPackagingMavenPlugin/2.3.2-SNAPSHOT/PearPackagingMavenPlugin-2.3.2-20111004.180800-62.jar.
Return code is: 401
	at org.sonatype.aether.impl.internal.DefaultDeployer.deploy(DefaultDeployer.java:284)
	at org.sonatype.aether.impl.internal.DefaultDeployer.deploy(DefaultDeployer.java:215)
	at org.sonatype.aether.impl.internal.DefaultRepositorySystem.deploy(DefaultRepositorySystem.java:480)
	at org.apache.maven.artifact.deployer.DefaultArtifactDeployer.deploy(DefaultArtifactDeployer.java:137)
	... 11 more
Caused by: org.sonatype.aether.transfer.ArtifactTransferException: Could not transfer artifact
org.apache.uima:PearPackagingMavenPlugin:jar:2.3.2-20111004.180800-62 from/to  (https://repository.apache.org/content/repositories/snapshots):
Failed to transfer file: https://repository.apache.org/content/repositories/snapshots/org/apache/uima/PearPackagingMavenPlugin/2.3.2-SNAPSHOT/PearPackagingMavenPlugin-2.3.2-20111004.180800-62.jar.
Return code is: 401
	at org.sonatype.aether.connector.wagon.WagonRepositoryConnector$4.wrap(WagonRepositoryConnector.java:949)
	at org.sonatype.aether.connector.wagon.WagonRepositoryConnector$4.wrap(WagonRepositoryConnector.java:940)
	at org.sonatype.aether.connector.wagon.WagonRepositoryConnector$PutTask.flush(WagonRepositoryConnector.java:864)
	at org.sonatype.aether.connector.wagon.WagonRepositoryConnector.put(WagonRepositoryConnector.java:466)
	at org.sonatype.aether.impl.internal.DefaultDeployer.deploy(DefaultDeployer.java:278)
	... 14 more
Caused by: org.apache.maven.wagon.TransferFailedException: Failed to transfer file: https://repository.apache.org/content/repositories/snapshots/org/apache/uima/PearPackagingMavenPlugin/2.3.2-SNAPSHOT/PearPackagingMavenPlugin-2.3.2-20111004.180800-62.jar.
Return code is: 401
	at org.apache.maven.wagon.shared.http.AbstractHttpClientWagon.put(AbstractHttpClientWagon.java:368)
	at org.apache.maven.wagon.shared.http.AbstractHttpClientWagon.put(AbstractHttpClientWagon.java:280)
	at org.sonatype.aether.connector.wagon.WagonRepositoryConnector$PutTask.run(WagonRepositoryConnector.java:825)
	at org.sonatype.aether.connector.wagon.WagonRepositoryConnector.put(WagonRepositoryConnector.java:465)
	... 15 more
[INFO] Deployment failed after 1.4 sec
Build step 'Deploy artifacts to Maven repository' changed build result to FAILURE


Mime
View raw message