uima-dev mailing list archives

Site index · List index
Message view « Date » · « Thread »
Top « Date » · « Thread »
From Apache Jenkins Server <jenk...@builds.apache.org>
Subject Build failed in Jenkins: UIMA-AS #83
Date Tue, 13 Dec 2011 15:23:44 GMT
See <https://builds.apache.org/job/UIMA-AS/83/changes>

Changes:

[cwiklik] UIMA-2309 Refactored code that handles orderly shutdown of uima as service. On shutdown,
AE.destroy() is called on the same thread that initialized it.

------------------------------------------
[...truncated 50 lines...]
[INFO] [INFO] Setting property: classpath.resource.loader.class => 'org.codehaus.plexus.velocity.ContextClassLoaderResourceLoader'.
[INFO] Setting property: velocimacro.messages.on => 'false'.
[INFO] Setting property: resource.loader => 'classpath'.
[INFO] Setting property: resource.manager.logwhenfound => 'false'.

[INFO] --- maven-remote-resources-plugin:1.1:process (default) @ uima-as-parent ---
[INFO] [INFO] Installing <https://builds.apache.org/job/UIMA-AS/ws/trunk/uima-as-parent/pom.xml>
to /home/jenkins/.m2/repository/org/apache/uima/uima-as-parent/2.4.0-SNAPSHOT/uima-as-parent-2.4.0-SNAPSHOT.pom

[INFO] --- maven-install-plugin:2.3:install (default-install) @ uima-as-parent ---
[JENKINS] Archiving <https://builds.apache.org/job/UIMA-AS/ws/trunk/uima-as-parent/pom.xml>
to /home/hudson/hudson/jobs/UIMA-AS/modules/org.apache.uima$uima-as-parent/builds/2011-12-13_15-06-50/archive/org.apache.uima/uima-as-parent/2.4.0-SNAPSHOT/uima-as-parent-2.4.0-SNAPSHOT.pom
[INFO] Downloading: http://repository.apache.org/snapshots/org/apache/uima/uimaj-core/2.4.0-SNAPSHOT/maven-metadata.xml
Downloading: http://repository.apache.org/snapshots/org/apache/uima/uimaj-parent/2.4.0-SNAPSHOT/maven-metadata.xml
[INFO] Deleting file set: <https://builds.apache.org/job/UIMA-AS/ws/trunk/uimaj-as-core/target>
(included: [**], excluded: [])
                                                                        
[INFO] ------------------------------------------------------------------------
[INFO] Building Apache UIMA-AS: uimaj-as-core 2.4.0-SNAPSHOT
[INFO] ------------------------------------------------------------------------
[INFO] 
[INFO] --- maven-clean-plugin:2.3:clean (default-clean) @ uimaj-as-core ---
[INFO] 
[INFO] --- build-helper-maven-plugin:1.5:parse-version (parse-project-version) @ uimaj-as-core
---
[INFO] 
[INFO] --- uima-build-helper-maven-plugin:2:parse-date-time (set buildYear and buildMonth)
@ uimaj-as-core ---
[INFO] [INFO] Using 'UTF-8' encoding to copy filtered resources.
[INFO] Copying 1 resource

[INFO] --- maven-resources-plugin:2.4.3:copy-resources (setVersions) @ uimaj-as-core ---
[INFO] [INFO] Source directory: <https://builds.apache.org/job/UIMA-AS/ws/trunk/uimaj-as-core/target/generated-sources/releaseVersion>
added.

[INFO] --- build-helper-maven-plugin:1.5:add-source (addVersionSrc) @ uimaj-as-core ---
[INFO] 
[INFO] --- xmlbeans-maven-plugin:2.3.3:xmlbeans (default) @ uimaj-as-core ---
[INFO] 
[INFO] --- maven-remote-resources-plugin:1.1:process (default) @ uimaj-as-core ---
[INFO] Using 'UTF-8' encoding to copy filtered resources.
[INFO] [INFO] Copying 1 resource
[INFO] Copying 172 resources
[INFO] Copying 3 resources

[INFO] --- maven-resources-plugin:2.4.3:resources (default-resources) @ uimaj-as-core ---
[INFO] [INFO] Compiling 209 source files to <https://builds.apache.org/job/UIMA-AS/ws/trunk/uimaj-as-core/target/classes>

[INFO] --- maven-compiler-plugin:2.3.1:compile (default-compile) @ uimaj-as-core ---
[INFO] Using 'UTF-8' encoding to copy filtered resources.
[INFO] [INFO] Copying 0 resource
[INFO] Copying 3 resources

[INFO] --- maven-resources-plugin:2.4.3:testResources (default-testResources) @ uimaj-as-core
---
[INFO] [INFO] Nothing to compile - all classes are up to date

[INFO] --- maven-compiler-plugin:2.3.1:testCompile (default-testCompile) @ uimaj-as-core ---
[INFO] [INFO] Surefire report directory: <https://builds.apache.org/job/UIMA-AS/ws/trunk/uimaj-as-core/target/surefire-reports>

-------------------------------------------------------
 T E S T S
-------------------------------------------------------
There are no tests to run.

Results :

Tests run: 0, Failures: 0, Errors: 0, Skipped: 0


[INFO] --- maven-surefire-plugin:2.4.3:test (default-test) @ uimaj-as-core ---
[JENKINS] Recording test results
[INFO] [INFO] Building jar: <https://builds.apache.org/job/UIMA-AS/ws/trunk/uimaj-as-core/target/uimaj-as-core.jar>

[INFO] --- maven-jar-plugin:2.3.1:jar (default-jar) @ uimaj-as-core ---
[INFO] [INFO] Installing <https://builds.apache.org/job/UIMA-AS/ws/trunk/uimaj-as-core/target/uimaj-as-core.jar>
to /home/jenkins/.m2/repository/org/apache/uima/uimaj-as-core/2.4.0-SNAPSHOT/uimaj-as-core-2.4.0-SNAPSHOT.jar
[INFO] Installing <https://builds.apache.org/job/UIMA-AS/ws/trunk/uimaj-as-core/pom.xml>
to /home/jenkins/.m2/repository/org/apache/uima/uimaj-as-core/2.4.0-SNAPSHOT/uimaj-as-core-2.4.0-SNAPSHOT.pom

[INFO] --- maven-install-plugin:2.3:install (default-install) @ uimaj-as-core ---
[JENKINS] Archiving <https://builds.apache.org/job/UIMA-AS/ws/trunk/uimaj-as-core/pom.xml>
to /home/hudson/hudson/jobs/UIMA-AS/modules/org.apache.uima$uimaj-as-core/builds/2011-12-13_15-06-50/archive/org.apache.uima/uimaj-as-core/2.4.0-SNAPSHOT/uimaj-as-core-2.4.0-SNAPSHOT.pom
[JENKINS] Archiving <https://builds.apache.org/job/UIMA-AS/ws/trunk/uimaj-as-core/target/uimaj-as-core.jar>
to /home/hudson/hudson/jobs/UIMA-AS/modules/org.apache.uima$uimaj-as-core/builds/2011-12-13_15-06-50/archive/org.apache.uima/uimaj-as-core/2.4.0-SNAPSHOT/uimaj-as-core-2.4.0-SNAPSHOT.jar
[INFO] [INFO] Deleting file set: <https://builds.apache.org/job/UIMA-AS/ws/trunk/uimaj-as-jms/target>
(included: [**], excluded: [])
                                                                        
[INFO] ------------------------------------------------------------------------
[INFO] Building Apache UIMA-AS: uimaj-as-jms 2.4.0-SNAPSHOT
[INFO] ------------------------------------------------------------------------
[INFO] 
[INFO] --- maven-clean-plugin:2.3:clean (default-clean) @ uimaj-as-jms ---
[INFO] 
[INFO] --- build-helper-maven-plugin:1.5:parse-version (parse-project-version) @ uimaj-as-jms
---
[INFO] 
[INFO] --- uima-build-helper-maven-plugin:2:parse-date-time (set buildYear and buildMonth)
@ uimaj-as-jms ---
[INFO] 
[INFO] --- maven-remote-resources-plugin:1.1:process (default) @ uimaj-as-jms ---
[INFO] [INFO] Using 'UTF-8' encoding to copy filtered resources.
[INFO] Copying 1 resource
[INFO] Copying 3 resources

[INFO] --- maven-resources-plugin:2.4.3:resources (default-resources) @ uimaj-as-jms ---
[INFO] [INFO] Compiling 12 source files to <https://builds.apache.org/job/UIMA-AS/ws/trunk/uimaj-as-jms/target/classes>

[INFO] --- maven-compiler-plugin:2.3.1:compile (default-compile) @ uimaj-as-jms ---
[INFO] [INFO] Using 'UTF-8' encoding to copy filtered resources.
[INFO] Copying 0 resource
[INFO] Copying 3 resources

[INFO] --- maven-resources-plugin:2.4.3:testResources (default-testResources) @ uimaj-as-jms
---
[INFO] [INFO] Nothing to compile - all classes are up to date

[INFO] --- maven-compiler-plugin:2.3.1:testCompile (default-testCompile) @ uimaj-as-jms ---
[INFO] [INFO] Surefire report directory: <https://builds.apache.org/job/UIMA-AS/ws/trunk/uimaj-as-jms/target/surefire-reports>

-------------------------------------------------------
 T E S T S
-------------------------------------------------------
There are no tests to run.

Results :

Tests run: 0, Failures: 0, Errors: 0, Skipped: 0


[INFO] --- maven-surefire-plugin:2.4.3:test (default-test) @ uimaj-as-jms ---
[JENKINS] Recording test results
[INFO] [INFO] Building jar: <https://builds.apache.org/job/UIMA-AS/ws/trunk/uimaj-as-jms/target/uimaj-as-jms.jar>

[INFO] --- maven-jar-plugin:2.3.1:jar (default-jar) @ uimaj-as-jms ---
[INFO] Installing <https://builds.apache.org/job/UIMA-AS/ws/trunk/uimaj-as-jms/target/uimaj-as-jms.jar>
to /home/jenkins/.m2/repository/org/apache/uima/uimaj-as-jms/2.4.0-SNAPSHOT/uimaj-as-jms-2.4.0-SNAPSHOT.jar
[INFO] [INFO] Installing <https://builds.apache.org/job/UIMA-AS/ws/trunk/uimaj-as-jms/pom.xml>
to /home/jenkins/.m2/repository/org/apache/uima/uimaj-as-jms/2.4.0-SNAPSHOT/uimaj-as-jms-2.4.0-SNAPSHOT.pom

[INFO] --- maven-install-plugin:2.3:install (default-install) @ uimaj-as-jms ---
[JENKINS] Archiving <https://builds.apache.org/job/UIMA-AS/ws/trunk/uimaj-as-jms/pom.xml>
to /home/hudson/hudson/jobs/UIMA-AS/modules/org.apache.uima$uimaj-as-jms/builds/2011-12-13_15-06-50/archive/org.apache.uima/uimaj-as-jms/2.4.0-SNAPSHOT/uimaj-as-jms-2.4.0-SNAPSHOT.pom
[JENKINS] Archiving <https://builds.apache.org/job/UIMA-AS/ws/trunk/uimaj-as-jms/target/uimaj-as-jms.jar>
to /home/hudson/hudson/jobs/UIMA-AS/modules/org.apache.uima$uimaj-as-jms/builds/2011-12-13_15-06-50/archive/org.apache.uima/uimaj-as-jms/2.4.0-SNAPSHOT/uimaj-as-jms-2.4.0-SNAPSHOT.jar
[INFO]                                                                         
[INFO] ------------------------------------------------------------------------
[INFO] Building Apache UIMA-AS: uimaj-as-activemq 2.4.0-SNAPSHOT
[INFO] ------------------------------------------------------------------------
[INFO] 
[INFO] --- maven-clean-plugin:2.3:clean (default-clean) @ uimaj-as-activemq ---
[INFO] 
[INFO] --- build-helper-maven-plugin:1.5:parse-version (parse-project-version) @ uimaj-as-activemq
---
Downloading: http://repository.apache.org/snapshots/org/apache/uima/uimaj-examples/2.4.0-SNAPSHOT/maven-metadata.xml
Downloading: http://repository.apache.org/snapshots/org/apache/uima/uimaj-document-annotation/2.4.0-SNAPSHOT/maven-metadata.xml
Downloading: http://repository.apache.org/snapshots/org/apache/uima/uimaj-tools/2.4.0-SNAPSHOT/maven-metadata.xml
Downloading: http://repository.apache.org/snapshots/org/apache/uima/uimaj-test-util/2.4.0-SNAPSHOT/maven-metadata.xml
[INFO] Deleting file set: <https://builds.apache.org/job/UIMA-AS/ws/trunk/uimaj-as-activemq/target>
(included: [**], excluded: [])
[INFO] 
[INFO] --- uima-build-helper-maven-plugin:2:parse-date-time (set buildYear and buildMonth)
@ uimaj-as-activemq ---
[INFO] 
[INFO] --- maven-remote-resources-plugin:1.1:process (default) @ uimaj-as-activemq ---
[INFO] Downloading: http://repo1.maven.org/eclipse/net/sf/josql/josql/1.5/josql-1.5.pom
Downloading: http://repo1.maven.org/maven2/net/sf/josql/josql/1.5/josql-1.5.pom
Downloading: http://repo1.maven.org/eclipse/net/sf/josql/gentlyweb-utils/1.5/gentlyweb-utils-1.5.pom
Downloading: http://repo1.maven.org/maven2/net/sf/josql/gentlyweb-utils/1.5/gentlyweb-utils-1.5.pom
[INFO] Using 'UTF-8' encoding to copy filtered resources.
[INFO] Copying 0 resource
[INFO] Copying 3 resources

[INFO] --- maven-resources-plugin:2.4.3:resources (default-resources) @ uimaj-as-activemq
---
[INFO] 
[INFO] --- maven-compiler-plugin:2.3.1:compile (default-compile) @ uimaj-as-activemq ---
[INFO] Compiling 22 source files to <https://builds.apache.org/job/UIMA-AS/ws/trunk/uimaj-as-activemq/target/classes>
[INFO] -------------------------------------------------------------
[ERROR] COMPILATION ERROR : 
[INFO] -------------------------------------------------------------
[ERROR] <https://builds.apache.org/job/UIMA-AS/ws/trunk/uimaj-as-activemq/src/main/java/org/apache/uima/adapter/jms/activemq/UimaDefaultMessageListenerContainer.java>:[960,16]
cannot find symbol
symbol  : method allowCoreThreadTimeOut(boolean)
location: class java.util.concurrent.ThreadPoolExecutor

[INFO] 1error
[INFO] -------------------------------------------------------------
[JENKINS] Archiving <https://builds.apache.org/job/UIMA-AS/ws/trunk/uimaj-as-activemq/pom.xml>
to /home/hudson/hudson/jobs/UIMA-AS/modules/org.apache.uima$uimaj-as-activemq/builds/2011-12-13_15-06-50/archive/org.apache.uima/uimaj-as-activemq/2.4.0-SNAPSHOT/uimaj-as-activemq-2.4.0-SNAPSHOT.pom
[INFO] ------------------------------------------------------------------------
[INFO] Reactor Summary:
[INFO] 
[INFO] Apache UIMA-AS: uima-as-parent .................... SUCCESS [4:23.814s]
[INFO] Apache UIMA-AS: uimaj-as-core ..................... SUCCESS [1:25.703s]
[INFO] Apache UIMA-AS: uimaj-as-jms ...................... SUCCESS [51.483s]
[INFO] Apache UIMA-AS: uimaj-as-activemq ................. FAILURE [55.667s]
[INFO] Apache UIMA-AS Eclipse Plugin: uimaj-ep-runtime-deployeditor  SKIPPED
[INFO] Apache UIMA-AS Eclipse Plugin: uimaj-ep-deployeditor  SKIPPED
[INFO] Apache UIMA AS: uimaj-as-osgi-runtime ............. SKIPPED
[INFO] Apache UIMA-AS: uimaj-as-camel .................... SKIPPED
[INFO] Apache UIMA Eclipse: uimaj-eclipse-feature-deployeditor  SKIPPED
[INFO] Apache UIMA-AS Aggregate: aggregate-uima-as-eclipse-plugins  SKIPPED
[INFO] Apache UIMA-AS: uima-as-docbooks .................. SKIPPED
[INFO] Apache UIMA-AS Aggregate: aggregate-uima-as ....... SKIPPED
[INFO] Apache UIMA-AS: uima-as ........................... SKIPPED
[INFO] ------------------------------------------------------------------------
[INFO] BUILD FAILURE
[INFO] ------------------------------------------------------------------------
[INFO] Total time: 12:15.958s
[INFO] Finished at: Tue Dec 13 15:22:59 UTC 2011
[INFO] Final Memory: 22M/186M
[INFO] ------------------------------------------------------------------------
mavenExecutionResult exceptions not empty
message : Failed to execute goal org.apache.maven.plugins:maven-compiler-plugin:2.3.1:compile
(default-compile) on project uimaj-as-activemq: Compilation failure
<https://builds.apache.org/job/UIMA-AS/ws/trunk/uimaj-as-activemq/src/main/java/org/apache/uima/adapter/jms/activemq/UimaDefaultMessageListenerContainer.java>:[960,16]
cannot find symbol
symbol  : method allowCoreThreadTimeOut(boolean)
location: class java.util.concurrent.ThreadPoolExecutor


cause : Compilation failure
<https://builds.apache.org/job/UIMA-AS/ws/trunk/uimaj-as-activemq/src/main/java/org/apache/uima/adapter/jms/activemq/UimaDefaultMessageListenerContainer.java>:[960,16]
cannot find symbol
symbol  : method allowCoreThreadTimeOut(boolean)
location: class java.util.concurrent.ThreadPoolExecutor


Stack trace : 
org.apache.maven.lifecycle.LifecycleExecutionException: Failed to execute goal org.apache.maven.plugins:maven-compiler-plugin:2.3.1:compile
(default-compile) on project uimaj-as-activemq: Compilation failure
<https://builds.apache.org/job/UIMA-AS/ws/trunk/uimaj-as-activemq/src/main/java/org/apache/uima/adapter/jms/activemq/UimaDefaultMessageListenerContainer.java>:[960,16]
cannot find symbol
symbol  : method allowCoreThreadTimeOut(boolean)
location: class java.util.concurrent.ThreadPoolExecutor


	at org.apache.maven.lifecycle.internal.MojoExecutor.execute(MojoExecutor.java:213)
	at org.apache.maven.lifecycle.internal.MojoExecutor.execute(MojoExecutor.java:153)
	at org.apache.maven.lifecycle.internal.MojoExecutor.execute(MojoExecutor.java:145)
	at org.apache.maven.lifecycle.internal.LifecycleModuleBuilder.buildProject(LifecycleModuleBuilder.java:84)
	at org.apache.maven.lifecycle.internal.LifecycleModuleBuilder.buildProject(LifecycleModuleBuilder.java:59)
	at org.apache.maven.lifecycle.internal.LifecycleStarter.singleThreadedBuild(LifecycleStarter.java:183)
	at org.apache.maven.lifecycle.internal.LifecycleStarter.execute(LifecycleStarter.java:161)
	at org.apache.maven.DefaultMaven.doExecute(DefaultMaven.java:319)
	at org.apache.maven.DefaultMaven.execute(DefaultMaven.java:156)
	at org.jvnet.hudson.maven3.launcher.Maven3Launcher.main(Maven3Launcher.java:79)
	at sun.reflect.NativeMethodAccessorImpl.invoke0(Native Method)
	at sun.reflect.NativeMethodAccessorImpl.invoke(NativeMethodAccessorImpl.java:39)
	at sun.reflect.DelegatingMethodAccessorImpl.invoke(DelegatingMethodAccessorImpl.java:25)
	at java.lang.reflect.Method.invoke(Method.java:592)
	at org.codehaus.plexus.classworlds.launcher.Launcher.launchStandard(Launcher.java:329)
	at org.codehaus.plexus.classworlds.launcher.Launcher.launch(Launcher.java:239)
	at org.jvnet.hudson.maven3.agent.Maven3Main.launch(Maven3Main.java:158)
	at hudson.maven.Maven3Builder.call(Maven3Builder.java:122)
	at hudson.maven.Maven3Builder.call(Maven3Builder.java:74)
	at hudson.remoting.UserRequest.perform(UserRequest.java:118)
	at hudson.remoting.UserRequest.perform(UserRequest.java:48)
	at hudson.remoting.Request$2.run(Request.java:287)
	at java.util.concurrent.Executors$RunnableAdapter.call(Executors.java:417)
	at java.util.concurrent.FutureTask$Sync.innerRun(FutureTask.java:269)
	at java.util.concurrent.FutureTask.run(FutureTask.java:123)
	at java.util.concurrent.ThreadPoolExecutor$Worker.runTask(ThreadPoolExecutor.java:651)
	at java.util.concurrent.ThreadPoolExecutor$Worker.run(ThreadPoolExecutor.java:676)
	at java.lang.Thread.run(Thread.java:595)
Caused by: org.apache.maven.plugin.CompilationFailureException: Compilation failure
<https://builds.apache.org/job/UIMA-AS/ws/trunk/uimaj-as-activemq/src/main/java/org/apache/uima/adapter/jms/activemq/UimaDefaultMessageListenerContainer.java>:[960,16]
cannot find symbol
symbol  : method allowCoreThreadTimeOut(boolean)
location: class java.util.concurrent.ThreadPoolExecutor


	at org.apache.maven.plugin.AbstractCompilerMojo.execute(AbstractCompilerMojo.java:656)
	at org.apache.maven.plugin.CompilerMojo.execute(CompilerMojo.java:128)
	at org.apache.maven.plugin.DefaultBuildPluginManager.executeMojo(DefaultBuildPluginManager.java:101)
	at org.apache.maven.lifecycle.internal.MojoExecutor.execute(MojoExecutor.java:209)
	... 27 more
Sending e-mails to: dev@uima.apache.org
channel stopped


Mime
View raw message