uima-dev mailing list archives

Site index · List index
Message view « Date » · « Thread »
Top « Date » · « Thread »
From Apache Jenkins Server <jenk...@builds.apache.org>
Subject Build failed in Jenkins: UIMA-AS #102
Date Fri, 10 Feb 2012 20:29:47 GMT
See <https://builds.apache.org/job/UIMA-AS/102/changes>

Changes:

[burn] UIMA-2370  Removed the 3-arg EntityProcessComplete callback by putting the list of
performance metrics in the UimaASProcessStatus object, accessed with getPerformanceMetricsList.
 Updated documentation, and modified the pom to generate Javadocs for the callback classes.

------------------------------------------
[...truncated 132034 lines...]
[INFO] [INFO] No sources to compile

[INFO] --- maven-compiler-plugin:2.3.2:testCompile (default-testCompile) @ uimaj-eclipse-feature-deployeditor
---
[INFO] [INFO] Surefire report directory: <https://builds.apache.org/job/UIMA-AS/ws/trunk/uimaj-eclipse-feature-deployeditor/target/surefire-reports>

-------------------------------------------------------
 T E S T S
-------------------------------------------------------

Results :


Tests run: 0, Failures: 0, Errors: 0, Skipped: 0

[INFO] --- maven-surefire-plugin:2.9:test (default-test) @ uimaj-eclipse-feature-deployeditor
---
[JENKINS] Recording test results
[INFO] 
[INFO] --- maven-jar-plugin:2.3.1:jar (default-jar) @ uimaj-eclipse-feature-deployeditor ---
[INFO] Building jar: <https://builds.apache.org/job/UIMA-AS/ws/trunk/uimaj-eclipse-feature-deployeditor/target/uimaj-eclipse-feature-deployeditor_2.4.0.SNAPSHOT.jar>
[INFO] 
[INFO] --- maven-site-plugin:3.0:attach-descriptor (attach-descriptor) @ uimaj-eclipse-feature-deployeditor
---
[INFO] [INFO] Installing <https://builds.apache.org/job/UIMA-AS/ws/trunk/uimaj-eclipse-feature-deployeditor/target/uimaj-eclipse-feature-deployeditor_2.4.0.SNAPSHOT.jar>
to /home/jenkins/.m2/repository/org/apache/uima/uimaj-eclipse-feature-deployeditor/2.4.0-SNAPSHOT/uimaj-eclipse-feature-deployeditor-2.4.0-SNAPSHOT.jar
[INFO] Installing <https://builds.apache.org/job/UIMA-AS/ws/trunk/uimaj-eclipse-feature-deployeditor/pom.xml>
to /home/jenkins/.m2/repository/org/apache/uima/uimaj-eclipse-feature-deployeditor/2.4.0-SNAPSHOT/uimaj-eclipse-feature-deployeditor-2.4.0-SNAPSHOT.pom

[INFO] --- maven-install-plugin:2.3.1:install (default-install) @ uimaj-eclipse-feature-deployeditor
---
[JENKINS] Archiving <https://builds.apache.org/job/UIMA-AS/ws/trunk/uimaj-eclipse-feature-deployeditor/pom.xml>
to /home/hudson/hudson/jobs/UIMA-AS/modules/org.apache.uima$uimaj-eclipse-feature-deployeditor/builds/2012-02-10_20-03-06/archive/org.apache.uima/uimaj-eclipse-feature-deployeditor/2.4.0-SNAPSHOT/uimaj-eclipse-feature-deployeditor-2.4.0-SNAPSHOT.pom
[JENKINS] Archiving <https://builds.apache.org/job/UIMA-AS/ws/trunk/uimaj-eclipse-feature-deployeditor/target/uimaj-eclipse-feature-deployeditor_2.4.0.SNAPSHOT.jar>
to /home/hudson/hudson/jobs/UIMA-AS/modules/org.apache.uima$uimaj-eclipse-feature-deployeditor/builds/2012-02-10_20-03-06/archive/org.apache.uima/uimaj-eclipse-feature-deployeditor/2.4.0-SNAPSHOT/uimaj-eclipse-feature-deployeditor-2.4.0-SNAPSHOT.jar
[INFO] [INFO] Deleting <https://builds.apache.org/job/UIMA-AS/ws/trunk/aggregate-uima-as-eclipse-plugins/target>
                                                                        
[INFO] ------------------------------------------------------------------------
[INFO] Building Apache UIMA-AS Aggregate: aggregate-uima-as-eclipse-plugins 2.4.0-SNAPSHOT
[INFO] ------------------------------------------------------------------------
[INFO] 
[INFO] --- maven-clean-plugin:2.4.1:clean (default-clean) @ aggregate-uima-as-eclipse-plugins
---
[INFO] 
[INFO] --- build-helper-maven-plugin:1.5:parse-version (parse-project-version) @ aggregate-uima-as-eclipse-plugins
---
[INFO] 
[INFO] --- uima-build-helper-maven-plugin:3-SNAPSHOT:parse-date-time (set buildYear and buildMonth)
@ aggregate-uima-as-eclipse-plugins ---
[INFO] 
[INFO] --- maven-remote-resources-plugin:1.2.1:process (default) @ aggregate-uima-as-eclipse-plugins
---
[INFO] 
[INFO] --- maven-site-plugin:3.0:attach-descriptor (attach-descriptor) @ aggregate-uima-as-eclipse-plugins
---
[INFO] [INFO] Installing <https://builds.apache.org/job/UIMA-AS/ws/trunk/aggregate-uima-as-eclipse-plugins/pom.xml>
to /home/jenkins/.m2/repository/org/apache/uima/aggregate-uima-as-eclipse-plugins/2.4.0-SNAPSHOT/aggregate-uima-as-eclipse-plugins-2.4.0-SNAPSHOT.pom

[INFO] --- maven-install-plugin:2.3.1:install (default-install) @ aggregate-uima-as-eclipse-plugins
---
[JENKINS] Archiving <https://builds.apache.org/job/UIMA-AS/ws/trunk/aggregate-uima-as-eclipse-plugins/pom.xml>
to /home/hudson/hudson/jobs/UIMA-AS/modules/org.apache.uima$aggregate-uima-as-eclipse-plugins/builds/2012-02-10_20-03-06/archive/org.apache.uima/aggregate-uima-as-eclipse-plugins/2.4.0-SNAPSHOT/aggregate-uima-as-eclipse-plugins-2.4.0-SNAPSHOT.pom
[INFO]                                                                         
[INFO] ------------------------------------------------------------------------
[INFO] Building Apache UIMA-AS: uima-as-docbooks 2.4.0-SNAPSHOT
[INFO] ------------------------------------------------------------------------
[INFO] Deleting <https://builds.apache.org/job/UIMA-AS/ws/trunk/uima-as-docbooks/target>
[INFO] 
[INFO] --- maven-clean-plugin:2.4.1:clean (default-clean) @ uima-as-docbooks ---
[INFO] 
[INFO] --- build-helper-maven-plugin:1.5:parse-version (parse-project-version) @ uima-as-docbooks
---
[INFO] 
[INFO] --- uima-build-helper-maven-plugin:3-SNAPSHOT:parse-date-time (set buildYear and buildMonth)
@ uima-as-docbooks ---
[INFO] 
[INFO] --- maven-remote-resources-plugin:1.2.1:process (default) @ uima-as-docbooks ---
[INFO] 
[INFO] --- maven-dependency-plugin:2.3:unpack (copyDocbookInfo) @ uima-as-docbooks ---
[INFO] Configured Artifact: org.apache.uima:uima-build-resources:4-SNAPSHOT:jar
[INFO] Unpacking /home/jenkins/.m2/repository/org/apache/uima/uima-build-resources/4-SNAPSHOT/uima-build-resources-4-SNAPSHOT.jar
to <https://builds.apache.org/job/UIMA-AS/ws/trunk/uima-as-docbooks/target> with includes
"docbook-shared/**" and excludes ""
[INFO] [INFO] Configured Artifact: org.apache.uima:uima-build-resources:1:jar
> isMarkerOlder:
  artifact1 = /home/jenkins/.m2/repository/org/apache/uima/uima-build-resources/1/uima-build-resources-1.jar
  marker    = /home/jenkins/.m2/repository/org/apache/uima/uima-docbook-olink/1-SNAPSHOT/dependency-maven-plugin-markers/org.apache.uima-uima-build-resources-jar-1376161406
    artifact1 lastModified: 1311710535000
    marker lastModified: 1311710563000
< false = marker older than artifact?
[INFO] uima-build-resources-1.jar already unpacked.

[INFO] --- maven-dependency-plugin:2.3:unpack (copyDocbookInfoNextToOlink) @ uima-as-docbooks
---
[INFO] [INFO] Configured Artifact: org.apache.uima:uima-docbook-olink:olink:1-SNAPSHOT:zip
Downloading: http://repository.apache.org/snapshots/org/apache/uima/uima-docbook-olink/1-SNAPSHOT/maven-metadata.xml

[INFO] --- maven-dependency-plugin:2.3:unpack (getOlink) @ uima-as-docbooks ---
Downloaded: http://repository.apache.org/snapshots/org/apache/uima/uima-docbook-olink/1-SNAPSHOT/maven-metadata.xml
(810 B at 2.8 KB/sec)
> isMarkerOlder:
  artifact1 = /home/jenkins/.m2/repository/org/apache/uima/uima-docbook-olink/1-SNAPSHOT/uima-docbook-olink-1-SNAPSHOT-olink.zip
  marker    = /home/jenkins/.m2/repository/org/apache/uima/uima-docbook-olink/1-SNAPSHOT/dependency-maven-plugin-markers/org.apache.uima-uima-docbook-olink-zip-olink-1-SNAPSHOT.marker
    artifact1 lastModified: 1318860455000
    marker lastModified: 1318860455000
< false = marker older than artifact?
[INFO] uima-docbook-olink-1-SNAPSHOT-olink.zip already unpacked.
[INFO] 
[INFO] --- maven-site-plugin:3.0:attach-descriptor (attach-descriptor) @ uima-as-docbooks
---
[INFO] 
[INFO] --- docbkx-maven-plugin:2.0.13:generate-html (html) @ uima-as-docbooks ---
[INFO] Processing input file: uima_async_scaleout.xml
Recoverable error
Failure reading file://home/jenkins/.m2/repository/org/apache/uima/uima-docbook-olink/1-SNAPSHOT/docbook-olink/htmlsingle/site.xml:
home
Recoverable error
Failure reading file://home/jenkins/.m2/repository/org/apache/uima/uima-docbook-olink/1-SNAPSHOT/docbook-olink/htmlsingle/site.xml:
home
Recoverable error
Failure reading file://home/jenkins/.m2/repository/org/apache/uima/uima-docbook-olink/1-SNAPSHOT/docbook-olink/htmlsingle/site.xml:
home
[INFO] <https://builds.apache.org/job/UIMA-AS/ws/trunk/uima-as-docbooks/target/site/d/uima_async_scaleout.html>
has been generated.
[INFO] Processing input file: uima_async_scaleout.xml
[INFO] 
[INFO] --- docbkx-maven-plugin:2.0.13:generate-pdf (pdf) @ uima-as-docbooks ---
Recoverable error
Failure reading file://home/jenkins/.m2/repository/org/apache/uima/uima-docbook-olink/1-SNAPSHOT/docbook-olink/pdf/site.xml:
home
Recoverable error
Failure reading file://home/jenkins/.m2/repository/org/apache/uima/uima-docbook-olink/1-SNAPSHOT/docbook-olink/pdf/site.xml:
home
Recoverable error
Failure reading file://home/jenkins/.m2/repository/org/apache/uima/uima-docbook-olink/1-SNAPSHOT/docbook-olink/pdf/site.xml:
home
[INFO] targetFileExtension pdf
[INFO] type fo
Feb 10, 2012 8:29:29 PM org.apache.fop.events.LoggingEventListener processEvent
WARNING: Font "Symbol,normal,700" not found. Substituting with "Symbol,normal,400".
Feb 10, 2012 8:29:29 PM org.apache.fop.events.LoggingEventListener processEvent
WARNING: Font "ZapfDingbats,normal,700" not found. Substituting with "ZapfDingbats,normal,400".
Feb 10, 2012 8:29:31 PM org.apache.fop.events.LoggingEventListener processEvent
WARNING: Line 1 of a paragraph overflows the available area by 19400 millipoints. (See position
1031:600)
Feb 10, 2012 8:29:32 PM org.apache.fop.events.LoggingEventListener processEvent
WARNING: Line 1 of a paragraph overflows the available area by 8600 millipoints. (See position
1624:604)
[INFO] <https://builds.apache.org/job/UIMA-AS/ws/trunk/uima-as-docbooks/target/docbkx/pdf/uima_async_scaleout.pdf>
has been generated.
[INFO] <https://builds.apache.org/job/UIMA-AS/ws/trunk/uima-as-docbooks/target/docbkx/pdf/uima_async_scaleout.fo>
has been generated.
[debug] execute contextualize
[INFO] [INFO] Using 'UTF-8' encoding to copy filtered resources.

[INFO] --- maven-resources-plugin:2.5:copy-resources (docbook-copy-images) @ uima-as-docbooks
---
[INFO] Copying 15 resources
[debug] execute contextualize
[INFO] [INFO] Using 'UTF-8' encoding to copy filtered resources.
[INFO] Copying 1 resource

[INFO] --- maven-resources-plugin:2.5:copy-resources (docbook-copy-css) @ uima-as-docbooks
---
[debug] execute contextualize
[INFO] [INFO] Using 'UTF-8' encoding to copy filtered resources.
[INFO] Copying 1 resource

[INFO] --- maven-resources-plugin:2.5:copy-resources (docbook-move-pdf) @ uima-as-docbooks
---
[INFO] [INFO] Installing <https://builds.apache.org/job/UIMA-AS/ws/trunk/uima-as-docbooks/pom.xml>
to /home/jenkins/.m2/repository/org/apache/uima/uima-as-docbooks/2.4.0-SNAPSHOT/uima-as-docbooks-2.4.0-SNAPSHOT.pom

[INFO] --- maven-install-plugin:2.3.1:install (default-install) @ uima-as-docbooks ---
[JENKINS] Archiving <https://builds.apache.org/job/UIMA-AS/ws/trunk/uima-as-docbooks/pom.xml>
to /home/hudson/hudson/jobs/UIMA-AS/modules/org.apache.uima$uima-as-docbooks/builds/2012-02-10_20-03-06/archive/org.apache.uima/uima-as-docbooks/2.4.0-SNAPSHOT/uima-as-docbooks-2.4.0-SNAPSHOT.pom
[INFO] [INFO] Deleting <https://builds.apache.org/job/UIMA-AS/ws/trunk/aggregate-uima-as/target>
                                                                        
[INFO] ------------------------------------------------------------------------
[INFO] Building Apache UIMA-AS Aggregate: aggregate-uima-as 2.4.0-SNAPSHOT
[INFO] ------------------------------------------------------------------------
[INFO] 
[INFO] --- maven-clean-plugin:2.4.1:clean (default-clean) @ aggregate-uima-as ---
[INFO] 
[INFO] --- build-helper-maven-plugin:1.5:parse-version (parse-project-version) @ aggregate-uima-as
---
[INFO] 
[INFO] --- uima-build-helper-maven-plugin:3-SNAPSHOT:parse-date-time (set buildYear and buildMonth)
@ aggregate-uima-as ---
[INFO] 
[INFO] --- maven-remote-resources-plugin:1.2.1:process (default) @ aggregate-uima-as ---
[INFO] 
[INFO] --- maven-site-plugin:3.0:attach-descriptor (attach-descriptor) @ aggregate-uima-as
---
[INFO] [INFO] Installing <https://builds.apache.org/job/UIMA-AS/ws/trunk/aggregate-uima-as/pom.xml>
to /home/jenkins/.m2/repository/org/apache/uima/aggregate-uima-as/2.4.0-SNAPSHOT/aggregate-uima-as-2.4.0-SNAPSHOT.pom

[INFO] --- maven-install-plugin:2.3.1:install (default-install) @ aggregate-uima-as ---
[JENKINS] Archiving <https://builds.apache.org/job/UIMA-AS/ws/trunk/aggregate-uima-as/pom.xml>
to /home/hudson/hudson/jobs/UIMA-AS/modules/org.apache.uima$aggregate-uima-as/builds/2012-02-10_20-03-06/archive/org.apache.uima/aggregate-uima-as/2.4.0-SNAPSHOT/aggregate-uima-as-2.4.0-SNAPSHOT.pom
[INFO]                                                                         
[INFO] ------------------------------------------------------------------------
[INFO] Building Apache UIMA-AS: uima-as 2.4.0-SNAPSHOT
[INFO] ------------------------------------------------------------------------
[INFO] [INFO] Deleting <https://builds.apache.org/job/UIMA-AS/ws/trunk/uima-as/target>

[INFO] --- maven-clean-plugin:2.4.1:clean (default-clean) @ uima-as ---
[INFO] 
[INFO] --- build-helper-maven-plugin:1.5:parse-version (parse-project-version) @ uima-as ---
[INFO] 
[INFO] --- uima-build-helper-maven-plugin:3-SNAPSHOT:parse-date-time (set buildYear and buildMonth)
@ uima-as ---
[INFO] 
[INFO] --- maven-remote-resources-plugin:1.2.1:process (default) @ uima-as ---
Downloading: http://repo1.maven.org/eclipse/net/sf/josql/gentlyweb-utils/1.5/gentlyweb-utils-1.5.pom
Downloading: http://repo1.maven.org/maven2/net/sf/josql/gentlyweb-utils/1.5/gentlyweb-utils-1.5.pom
Downloading: http://repo1.maven.org/eclipse/net/sf/josql/josql/1.5/josql-1.5.pom
Downloading: http://repo1.maven.org/maven2/net/sf/josql/josql/1.5/josql-1.5.pom
[debug] execute contextualize
[INFO] [INFO] Using 'UTF-8' encoding to copy filtered resources.
[INFO] Copying 2 resources

[INFO] --- maven-resources-plugin:2.5:copy-resources (copy-resources) @ uima-as ---
[INFO] 
[INFO] --- uima-build-helper-maven-plugin:3-SNAPSHOT:copy-from-apache-dist (default) @ uima-as
---
[JENKINS] Archiving <https://builds.apache.org/job/UIMA-AS/ws/trunk/uima-as/pom.xml>
to /home/hudson/hudson/jobs/UIMA-AS/modules/org.apache.uima$uima-as/builds/2012-02-10_20-03-06/archive/org.apache.uima/uima-as/2.4.0-SNAPSHOT/uima-as-2.4.0-SNAPSHOT.pom
[INFO] ------------------------------------------------------------------------
[INFO] Reactor Summary:
[INFO] 
[INFO] Apache UIMA-AS: uima-as-parent .................... SUCCESS [44.775s]
[INFO] Apache UIMA-AS: uimaj-as-core ..................... SUCCESS [15.898s]
[INFO] Apache UIMA-AS: uimaj-as-jms ...................... SUCCESS [3.307s]
[INFO] Apache UIMA-AS: uimaj-as-activemq ................. SUCCESS [23:19.476s]
[INFO] Apache UIMA-AS Eclipse Plugin: uimaj-ep-runtime-deployeditor  SUCCESS [26.331s]
[INFO] Apache UIMA-AS Eclipse Plugin: uimaj-ep-deployeditor  SUCCESS [17.584s]
[INFO] Apache UIMA AS: uimaj-as-osgi-runtime ............. SUCCESS [5.836s]
[INFO] Apache UIMA-AS: uimaj-as-camel .................... SUCCESS [17.356s]
[INFO] Apache UIMA Eclipse: uimaj-eclipse-feature-deployeditor  SUCCESS [8.891s]
[INFO] Apache UIMA-AS Aggregate: aggregate-uima-as-eclipse-plugins  SUCCESS [0.755s]
[INFO] Apache UIMA-AS: uima-as-docbooks .................. SUCCESS [17.746s]
[INFO] Apache UIMA-AS Aggregate: aggregate-uima-as ....... SUCCESS [0.688s]
[INFO] Apache UIMA-AS: uima-as ........................... FAILURE [9.708s]
[INFO] ------------------------------------------------------------------------
[INFO] BUILD FAILURE
[INFO] ------------------------------------------------------------------------
[INFO] Total time: 26:28.556s
[INFO] Finished at: Fri Feb 10 20:29:45 UTC 2012
[INFO] Final Memory: 47M/203M
[INFO] ------------------------------------------------------------------------
mavenExecutionResult exceptions not empty
message : Failed to execute goal org.apache.uima:uima-build-helper-maven-plugin:3-SNAPSHOT:copy-from-apache-dist
(default) on project uima-as: While creating local file in location /home/jenkins/.m2/repository/org/apache/uima/uimaj/2.4.0/uimaj-2.4.0-bin.zip
cause : While creating local file in location /home/jenkins/.m2/repository/org/apache/uima/uimaj/2.4.0/uimaj-2.4.0-bin.zip
Stack trace : 
org.apache.maven.lifecycle.LifecycleExecutionException: Failed to execute goal org.apache.uima:uima-build-helper-maven-plugin:3-SNAPSHOT:copy-from-apache-dist
(default) on project uima-as: While creating local file in location /home/jenkins/.m2/repository/org/apache/uima/uimaj/2.4.0/uimaj-2.4.0-bin.zip
	at org.apache.maven.lifecycle.internal.MojoExecutor.execute(MojoExecutor.java:217)
	at org.apache.maven.lifecycle.internal.MojoExecutor.execute(MojoExecutor.java:153)
	at org.apache.maven.lifecycle.internal.MojoExecutor.execute(MojoExecutor.java:145)
	at org.apache.maven.lifecycle.internal.LifecycleModuleBuilder.buildProject(LifecycleModuleBuilder.java:84)
	at org.apache.maven.lifecycle.internal.LifecycleModuleBuilder.buildProject(LifecycleModuleBuilder.java:59)
	at org.apache.maven.lifecycle.internal.LifecycleStarter.singleThreadedBuild(LifecycleStarter.java:183)
	at org.apache.maven.lifecycle.internal.LifecycleStarter.execute(LifecycleStarter.java:161)
	at org.apache.maven.DefaultMaven.doExecute(DefaultMaven.java:319)
	at org.apache.maven.DefaultMaven.execute(DefaultMaven.java:156)
	at org.jvnet.hudson.maven3.launcher.Maven3Launcher.main(Maven3Launcher.java:79)
	at sun.reflect.NativeMethodAccessorImpl.invoke0(Native Method)
	at sun.reflect.NativeMethodAccessorImpl.invoke(NativeMethodAccessorImpl.java:39)
	at sun.reflect.DelegatingMethodAccessorImpl.invoke(DelegatingMethodAccessorImpl.java:25)
	at java.lang.reflect.Method.invoke(Method.java:592)
	at org.codehaus.plexus.classworlds.launcher.Launcher.launchStandard(Launcher.java:329)
	at org.codehaus.plexus.classworlds.launcher.Launcher.launch(Launcher.java:239)
	at org.jvnet.hudson.maven3.agent.Maven3Main.launch(Maven3Main.java:158)
	at hudson.maven.Maven3Builder.call(Maven3Builder.java:104)
	at hudson.maven.Maven3Builder.call(Maven3Builder.java:70)
	at hudson.remoting.UserRequest.perform(UserRequest.java:118)
	at hudson.remoting.UserRequest.perform(UserRequest.java:48)
	at hudson.remoting.Request$2.run(Request.java:287)
	at java.util.concurrent.Executors$RunnableAdapter.call(Executors.java:417)
	at java.util.concurrent.FutureTask$Sync.innerRun(FutureTask.java:269)
	at java.util.concurrent.FutureTask.run(FutureTask.java:123)
	at java.util.concurrent.ThreadPoolExecutor$Worker.runTask(ThreadPoolExecutor.java:651)
	at java.util.concurrent.ThreadPoolExecutor$Worker.run(ThreadPoolExecutor.java:676)
	at java.lang.Thread.run(Thread.java:595)
Caused by: org.apache.maven.plugin.MojoExecutionException: While creating local file in location
/home/jenkins/.m2/repository/org/apache/uima/uimaj/2.4.0/uimaj-2.4.0-bin.zip
	at org.apache.uima.buildhelper.CopyFromApacheDist.execute(CopyFromApacheDist.java:132)
	at org.apache.maven.plugin.DefaultBuildPluginManager.executeMojo(DefaultBuildPluginManager.java:101)
	at org.apache.maven.lifecycle.internal.MojoExecutor.execute(MojoExecutor.java:209)
	... 27 more
Caused by: java.io.FileNotFoundException: /home/jenkins/.m2/repository/org/apache/uima/uimaj/2.4.0/uimaj-2.4.0-bin.zip
(No such file or directory)
	at java.io.FileOutputStream.open(Native Method)
	at java.io.FileOutputStream.<init>(FileOutputStream.java:179)
	at java.io.FileOutputStream.<init>(FileOutputStream.java:131)
	at org.apache.uima.buildhelper.CopyFromApacheDist.execute(CopyFromApacheDist.java:130)
	... 29 more
channel stopped


Mime
View raw message