uima-dev mailing list archives

Site index · List index
Message view « Date » · « Thread »
Top « Date » · « Thread »
From Apache Jenkins Server <jenk...@builds.apache.org>
Subject Build failed in Jenkins: UIMA-AS #98
Date Wed, 01 Feb 2012 14:58:44 GMT
See <https://builds.apache.org/job/UIMA-AS/98/changes>

Changes:

[burn] [UIMA-2364] In the abstract callback class extended by applications the 3-arg entityProcessComplete
callback now calls the 2-arg one.  This lets the callbacks implemented in runRemoteAsyncAE
(and other old client apps) receive the notification.

------------------------------------------
[...truncated 121947 lines...]

[INFO] --- maven-surefire-plugin:2.4.3:test (default-test) @ uimaj-eclipse-feature-deployeditor
---

-------------------------------------------------------
 T E S T S
-------------------------------------------------------
There are no tests to run.

Results :

Tests run: 0, Failures: 0, Errors: 0, Skipped: 0

[JENKINS] Recording test results
[INFO] [INFO] Building jar: <https://builds.apache.org/job/UIMA-AS/ws/trunk/uimaj-eclipse-feature-deployeditor/target/uimaj-eclipse-feature-deployeditor_2.4.0.SNAPSHOT.jar>

[INFO] --- maven-jar-plugin:2.3.1:jar (default-jar) @ uimaj-eclipse-feature-deployeditor ---
[INFO] [INFO] Installing <https://builds.apache.org/job/UIMA-AS/ws/trunk/uimaj-eclipse-feature-deployeditor/target/uimaj-eclipse-feature-deployeditor_2.4.0.SNAPSHOT.jar>
to /home/hudson/.m2/repository/org/apache/uima/uimaj-eclipse-feature-deployeditor/2.4.0-SNAPSHOT/uimaj-eclipse-feature-deployeditor-2.4.0-SNAPSHOT.jar
[INFO] Installing <https://builds.apache.org/job/UIMA-AS/ws/trunk/uimaj-eclipse-feature-deployeditor/pom.xml>
to /home/hudson/.m2/repository/org/apache/uima/uimaj-eclipse-feature-deployeditor/2.4.0-SNAPSHOT/uimaj-eclipse-feature-deployeditor-2.4.0-SNAPSHOT.pom

[INFO] --- maven-install-plugin:2.3:install (default-install) @ uimaj-eclipse-feature-deployeditor
---
[JENKINS] Archiving <https://builds.apache.org/job/UIMA-AS/ws/trunk/uimaj-eclipse-feature-deployeditor/pom.xml>
to /home/hudson/hudson/jobs/UIMA-AS/modules/org.apache.uima$uimaj-eclipse-feature-deployeditor/builds/2012-02-01_14-08-46/archive/org.apache.uima/uimaj-eclipse-feature-deployeditor/2.4.0-SNAPSHOT/uimaj-eclipse-feature-deployeditor-2.4.0-SNAPSHOT.pom
[JENKINS] Archiving <https://builds.apache.org/job/UIMA-AS/ws/trunk/uimaj-eclipse-feature-deployeditor/target/uimaj-eclipse-feature-deployeditor_2.4.0.SNAPSHOT.jar>
to /home/hudson/hudson/jobs/UIMA-AS/modules/org.apache.uima$uimaj-eclipse-feature-deployeditor/builds/2012-02-01_14-08-46/archive/org.apache.uima/uimaj-eclipse-feature-deployeditor/2.4.0-SNAPSHOT/uimaj-eclipse-feature-deployeditor-2.4.0-SNAPSHOT.jar
[INFO]                                                                         
[INFO] ------------------------------------------------------------------------
[INFO] Building Apache UIMA-AS Aggregate: aggregate-uima-as-eclipse-plugins 2.4.0-SNAPSHOT
[INFO] ------------------------------------------------------------------------
[INFO] 
[INFO] --- maven-clean-plugin:2.3:clean (default-clean) @ aggregate-uima-as-eclipse-plugins
---
[INFO] 
[INFO] --- build-helper-maven-plugin:1.5:parse-version (parse-project-version) @ aggregate-uima-as-eclipse-plugins
---
[INFO] 
[INFO] --- uima-build-helper-maven-plugin:2:parse-date-time (set buildYear and buildMonth)
@ aggregate-uima-as-eclipse-plugins ---
[INFO] 
[INFO] --- maven-remote-resources-plugin:1.1:process (default) @ aggregate-uima-as-eclipse-plugins
---
[INFO] Installing <https://builds.apache.org/job/UIMA-AS/ws/trunk/aggregate-uima-as-eclipse-plugins/pom.xml>
to /home/hudson/.m2/repository/org/apache/uima/aggregate-uima-as-eclipse-plugins/2.4.0-SNAPSHOT/aggregate-uima-as-eclipse-plugins-2.4.0-SNAPSHOT.pom
[INFO] 
[INFO] --- maven-install-plugin:2.3:install (default-install) @ aggregate-uima-as-eclipse-plugins
---
[JENKINS] Archiving <https://builds.apache.org/job/UIMA-AS/ws/trunk/aggregate-uima-as-eclipse-plugins/pom.xml>
to /home/hudson/hudson/jobs/UIMA-AS/modules/org.apache.uima$aggregate-uima-as-eclipse-plugins/builds/2012-02-01_14-08-46/archive/org.apache.uima/aggregate-uima-as-eclipse-plugins/2.4.0-SNAPSHOT/aggregate-uima-as-eclipse-plugins-2.4.0-SNAPSHOT.pom
[INFO]                                                                         
[INFO] ------------------------------------------------------------------------
[INFO] Building Apache UIMA-AS: uima-as-docbooks 2.4.0-SNAPSHOT
[INFO] ------------------------------------------------------------------------
[INFO] 
[INFO] --- maven-clean-plugin:2.3:clean (default-clean) @ uima-as-docbooks ---
[INFO] 
[INFO] --- build-helper-maven-plugin:1.5:parse-version (parse-project-version) @ uima-as-docbooks
---
[INFO] 
[INFO] --- uima-build-helper-maven-plugin:2:parse-date-time (set buildYear and buildMonth)
@ uima-as-docbooks ---
[INFO] 
[INFO] --- maven-remote-resources-plugin:1.1:process (default) @ uima-as-docbooks ---
[INFO] 
[INFO] --- maven-dependency-plugin:2.1:unpack (copyDocbookInfo) @ uima-as-docbooks ---
[INFO] Configured Artifact: org.apache.uima:uima-build-resources:1:jar
[INFO] Unpacking /home/hudson/.m2/repository/org/apache/uima/uima-build-resources/1/uima-build-resources-1.jar
to
  <https://builds.apache.org/job/UIMA-AS/ws/trunk/uima-as-docbooks/target>
   with includes docbook-shared/** and excludes:null
[INFO] Configured Artifact: org.apache.uima:uima-build-resources:1:jar
[INFO] [INFO] uima-build-resources-1.jar already unpacked.

[INFO] --- maven-dependency-plugin:2.1:unpack (copyDocbookInfoNextToOlink) @ uima-as-docbooks
---
[INFO] Configured Artifact: org.apache.uima:uima-docbook-olink:olink:1-SNAPSHOT:zip
[INFO] Downloading: http://repository.apache.org/snapshots/org/apache/uima/uima-docbook-olink/1-SNAPSHOT/maven-metadata.xml

[INFO] --- maven-dependency-plugin:2.1:unpack (getOlink) @ uima-as-docbooks ---
Downloaded: http://repository.apache.org/snapshots/org/apache/uima/uima-docbook-olink/1-SNAPSHOT/maven-metadata.xml
(810 B at 0.3 KB/sec)
[INFO] uima-docbook-olink-1-SNAPSHOT-olink.zip already unpacked.
[INFO] 
[INFO] --- docbkx-maven-plugin:2.0.11:generate-html (html) @ uima-as-docbooks ---
[INFO] Processing input file: uima_async_scaleout.xml
Recoverable error
Failure reading file://home/hudson/.m2/repository/org/apache/uima/uima-docbook-olink/1-SNAPSHOT/docbook-olink/htmlsingle/site.xml:
home
Recoverable error
Failure reading file://home/hudson/.m2/repository/org/apache/uima/uima-docbook-olink/1-SNAPSHOT/docbook-olink/htmlsingle/site.xml:
home
Recoverable error
Failure reading file://home/hudson/.m2/repository/org/apache/uima/uima-docbook-olink/1-SNAPSHOT/docbook-olink/htmlsingle/site.xml:
home
[INFO] <https://builds.apache.org/job/UIMA-AS/ws/trunk/uima-as-docbooks/target/site/d/uima_async_scaleout.html>
has been generated.
[INFO] Processing input file: uima_async_scaleout.xml
[INFO] 
[INFO] --- docbkx-maven-plugin:2.0.11:generate-pdf (pdf) @ uima-as-docbooks ---
Recoverable error
Failure reading file://home/hudson/.m2/repository/org/apache/uima/uima-docbook-olink/1-SNAPSHOT/docbook-olink/pdf/site.xml:
home
Recoverable error
Failure reading file://home/hudson/.m2/repository/org/apache/uima/uima-docbook-olink/1-SNAPSHOT/docbook-olink/pdf/site.xml:
home
Recoverable error
Failure reading file://home/hudson/.m2/repository/org/apache/uima/uima-docbook-olink/1-SNAPSHOT/docbook-olink/pdf/site.xml:
home
Feb 1, 2012 2:53:31 PM org.apache.fop.fonts.FontInfo notifyFontReplacement
WARNING: Font 'Symbol,normal,700' not found. Substituting with 'Symbol,normal,400'.
Feb 1, 2012 2:53:31 PM org.apache.fop.fonts.FontInfo notifyFontReplacement
WARNING: Font 'ZapfDingbats,normal,700' not found. Substituting with 'ZapfDingbats,normal,400'.
Feb 1, 2012 2:53:31 PM org.apache.fop.fo.flow.table.TableColumn bind
WARNING: table-layout="fixed" and column-width unspecified => falling back to proportional-column-width(1)
Feb 1, 2012 2:53:31 PM org.apache.fop.fonts.FontInfo notifyFontReplacement
WARNING: Font 'ZapfDingbats,italic,400' not found. Substituting with 'ZapfDingbats,normal,400'.
Feb 1, 2012 2:53:32 PM org.apache.fop.fo.flow.table.TableColumn bind
WARNING: table-layout="fixed" and column-width unspecified => falling back to proportional-column-width(1)
Feb 1, 2012 2:53:33 PM org.apache.fop.layoutmgr.inline.LineLayoutManager$LineBreakingAlgorithm
updateData2
WARNING: Line 1 of a paragraph overflows the available area by 19400mpt. (fo:block, location:
1031/600)
Feb 1, 2012 2:53:33 PM org.apache.fop.fo.flow.table.TableColumn bind
WARNING: table-layout="fixed" and column-width unspecified => falling back to proportional-column-width(1)
Feb 1, 2012 2:53:33 PM org.apache.fop.fo.flow.table.TableColumn bind
WARNING: table-layout="fixed" and column-width unspecified => falling back to proportional-column-width(1)
Feb 1, 2012 2:53:33 PM org.apache.fop.fo.flow.table.TableColumn bind
WARNING: table-layout="fixed" and column-width unspecified => falling back to proportional-column-width(1)
Feb 1, 2012 2:53:33 PM org.apache.fop.fo.flow.table.TableColumn bind
WARNING: table-layout="fixed" and column-width unspecified => falling back to proportional-column-width(1)
Feb 1, 2012 2:53:33 PM org.apache.fop.fo.flow.table.TableColumn bind
WARNING: table-layout="fixed" and column-width unspecified => falling back to proportional-column-width(1)
Feb 1, 2012 2:53:33 PM org.apache.fop.fo.flow.table.TableColumn bind
WARNING: table-layout="fixed" and column-width unspecified => falling back to proportional-column-width(1)
Feb 1, 2012 2:53:33 PM org.apache.fop.fo.flow.table.TableColumn bind
WARNING: table-layout="fixed" and column-width unspecified => falling back to proportional-column-width(1)
Feb 1, 2012 2:53:33 PM org.apache.fop.fo.flow.table.TableColumn bind
WARNING: table-layout="fixed" and column-width unspecified => falling back to proportional-column-width(1)
Feb 1, 2012 2:53:33 PM org.apache.fop.fo.flow.table.TableColumn bind
WARNING: table-layout="fixed" and column-width unspecified => falling back to proportional-column-width(1)
Feb 1, 2012 2:53:33 PM org.apache.fop.fo.flow.table.TableColumn bind
WARNING: table-layout="fixed" and column-width unspecified => falling back to proportional-column-width(1)
Feb 1, 2012 2:53:33 PM org.apache.fop.fo.flow.table.TableColumn bind
WARNING: table-layout="fixed" and column-width unspecified => falling back to proportional-column-width(1)
Feb 1, 2012 2:53:33 PM org.apache.fop.fo.flow.table.TableColumn bind
WARNING: table-layout="fixed" and column-width unspecified => falling back to proportional-column-width(1)
Feb 1, 2012 2:53:33 PM org.apache.fop.fo.flow.table.TableColumn bind
WARNING: table-layout="fixed" and column-width unspecified => falling back to proportional-column-width(1)
Feb 1, 2012 2:53:33 PM org.apache.fop.fo.flow.table.TableColumn bind
WARNING: table-layout="fixed" and column-width unspecified => falling back to proportional-column-width(1)
[INFO] <https://builds.apache.org/job/UIMA-AS/ws/trunk/uima-as-docbooks/target/docbkx/pdf/uima_async_scaleout.fo>
has been generated.
[INFO] Using 'UTF-8' encoding to copy filtered resources.
[INFO] [INFO] Copying 15 resources

[INFO] --- maven-resources-plugin:2.4.3:copy-resources (docbook-copy-images) @ uima-as-docbooks
---
[INFO] Using 'UTF-8' encoding to copy filtered resources.
[INFO] Copying 1 resource
[INFO] 
[INFO] --- maven-resources-plugin:2.4.3:copy-resources (docbook-copy-css) @ uima-as-docbooks
---
[INFO] Using 'UTF-8' encoding to copy filtered resources.
[INFO] 
[INFO] --- maven-resources-plugin:2.4.3:copy-resources (docbook-move-pdf) @ uima-as-docbooks
---[INFO] Copying 1 resource

[INFO] Installing <https://builds.apache.org/job/UIMA-AS/ws/trunk/uima-as-docbooks/pom.xml>
to /home/hudson/.m2/repository/org/apache/uima/uima-as-docbooks/2.4.0-SNAPSHOT/uima-as-docbooks-2.4.0-SNAPSHOT.pom
[INFO] 
[INFO] --- maven-install-plugin:2.3:install (default-install) @ uima-as-docbooks ---
[JENKINS] Archiving <https://builds.apache.org/job/UIMA-AS/ws/trunk/uima-as-docbooks/pom.xml>
to /home/hudson/hudson/jobs/UIMA-AS/modules/org.apache.uima$uima-as-docbooks/builds/2012-02-01_14-08-46/archive/org.apache.uima/uima-as-docbooks/2.4.0-SNAPSHOT/uima-as-docbooks-2.4.0-SNAPSHOT.pom
[INFO]                                                                         
[INFO] ------------------------------------------------------------------------
[INFO] Building Apache UIMA-AS Aggregate: aggregate-uima-as 2.4.0-SNAPSHOT
[INFO] ------------------------------------------------------------------------
[INFO] 
[INFO] --- maven-clean-plugin:2.3:clean (default-clean) @ aggregate-uima-as ---
[INFO] 
[INFO] --- build-helper-maven-plugin:1.5:parse-version (parse-project-version) @ aggregate-uima-as
---
[INFO] 
[INFO] --- uima-build-helper-maven-plugin:2:parse-date-time (set buildYear and buildMonth)
@ aggregate-uima-as ---
[INFO] 
[INFO] --- maven-remote-resources-plugin:1.1:process (default) @ aggregate-uima-as ---
[INFO] Installing <https://builds.apache.org/job/UIMA-AS/ws/trunk/aggregate-uima-as/pom.xml>
to /home/hudson/.m2/repository/org/apache/uima/aggregate-uima-as/2.4.0-SNAPSHOT/aggregate-uima-as-2.4.0-SNAPSHOT.pom
[INFO] 
[INFO] --- maven-install-plugin:2.3:install (default-install) @ aggregate-uima-as ---
[JENKINS] Archiving <https://builds.apache.org/job/UIMA-AS/ws/trunk/aggregate-uima-as/pom.xml>
to /home/hudson/hudson/jobs/UIMA-AS/modules/org.apache.uima$aggregate-uima-as/builds/2012-02-01_14-08-46/archive/org.apache.uima/aggregate-uima-as/2.4.0-SNAPSHOT/aggregate-uima-as-2.4.0-SNAPSHOT.pom
[INFO] Downloading: http://repo1.maven.org/eclipse/org/apache/uima/uimaj/2.4.0/uimaj-2.4.0.pom
Downloading: http://repo1.maven.org/maven2/org/apache/uima/uimaj/2.4.0/uimaj-2.4.0.pom
[WARNING] The POM for org.apache.uima:uimaj:zip:bin:2.4.0 is missing, no dependency information
available
Downloading: http://repo1.maven.org/eclipse/org/apache/uima/uimaj/2.4.0/uimaj-2.4.0-bin.zip
Downloading: http://repo1.maven.org/maven2/org/apache/uima/uimaj/2.4.0/uimaj-2.4.0-bin.zip
                                                                        
[INFO] ------------------------------------------------------------------------
[INFO] Building Apache UIMA-AS: uima-as 2.4.0-SNAPSHOT
[INFO] ------------------------------------------------------------------------
[JENKINS] Archiving <https://builds.apache.org/job/UIMA-AS/ws/trunk/uima-as/pom.xml>
to /home/hudson/hudson/jobs/UIMA-AS/modules/org.apache.uima$uima-as/builds/2012-02-01_14-08-46/archive/org.apache.uima/uima-as/2.4.0-SNAPSHOT/uima-as-2.4.0-SNAPSHOT.pom
[INFO] ------------------------------------------------------------------------
[INFO] Reactor Summary:
[INFO] 
[INFO] Apache UIMA-AS: uima-as-parent .................... SUCCESS [58.282s]
[INFO] Apache UIMA-AS: uimaj-as-core ..................... SUCCESS [20.113s]
[INFO] Apache UIMA-AS: uimaj-as-jms ...................... SUCCESS [3.977s]
[INFO] Apache UIMA-AS: uimaj-as-activemq ................. SUCCESS [29:02.462s]
[INFO] Apache UIMA-AS Eclipse Plugin: uimaj-ep-runtime-deployeditor  SUCCESS [2:25.702s]
[INFO] Apache UIMA-AS Eclipse Plugin: uimaj-ep-deployeditor  SUCCESS [56.760s]
[INFO] Apache UIMA AS: uimaj-as-osgi-runtime ............. SUCCESS [1:11.177s]
[INFO] Apache UIMA-AS: uimaj-as-camel .................... SUCCESS [31.248s]
[INFO] Apache UIMA Eclipse: uimaj-eclipse-feature-deployeditor  SUCCESS [38.444s]
[INFO] Apache UIMA-AS Aggregate: aggregate-uima-as-eclipse-plugins  SUCCESS [34.283s]
[INFO] Apache UIMA-AS: uima-as-docbooks .................. SUCCESS [2:07.321s]
[INFO] Apache UIMA-AS Aggregate: aggregate-uima-as ....... SUCCESS [48.141s]
[INFO] Apache UIMA-AS: uima-as ........................... FAILURE [1.106s]
[INFO] ------------------------------------------------------------------------
[INFO] BUILD FAILURE
[INFO] ------------------------------------------------------------------------
[INFO] Total time: 48:29.533s
[INFO] Finished at: Wed Feb 01 14:57:34 UTC 2012
[INFO] Final Memory: 55M/282M
[INFO] ------------------------------------------------------------------------
mavenExecutionResult exceptions not empty
message : Failed to execute goal on project uima-as: Could not resolve dependencies for project
org.apache.uima:uima-as:pom:2.4.0-SNAPSHOT: Could not find artifact org.apache.uima:uimaj:zip:bin:2.4.0
in eclipsePlugins (http://repo1.maven.org/eclipse)
cause : Could not resolve dependencies for project org.apache.uima:uima-as:pom:2.4.0-SNAPSHOT:
Could not find artifact org.apache.uima:uimaj:zip:bin:2.4.0 in eclipsePlugins (http://repo1.maven.org/eclipse)
Stack trace : 
org.apache.maven.lifecycle.LifecycleExecutionException: Failed to execute goal on project
uima-as: Could not resolve dependencies for project org.apache.uima:uima-as:pom:2.4.0-SNAPSHOT:
Could not find artifact org.apache.uima:uimaj:zip:bin:2.4.0 in eclipsePlugins (http://repo1.maven.org/eclipse)
	at org.apache.maven.lifecycle.internal.LifecycleDependencyResolver.getDependencies(LifecycleDependencyResolver.java:196)
	at org.apache.maven.lifecycle.internal.LifecycleDependencyResolver.resolveProjectDependencies(LifecycleDependencyResolver.java:108)
	at org.apache.maven.lifecycle.internal.MojoExecutor.ensureDependenciesAreResolved(MojoExecutor.java:258)
	at org.apache.maven.lifecycle.internal.MojoExecutor.execute(MojoExecutor.java:201)
	at org.apache.maven.lifecycle.internal.MojoExecutor.execute(MojoExecutor.java:153)
	at org.apache.maven.lifecycle.internal.MojoExecutor.execute(MojoExecutor.java:145)
	at org.apache.maven.lifecycle.internal.LifecycleModuleBuilder.buildProject(LifecycleModuleBuilder.java:84)
	at org.apache.maven.lifecycle.internal.LifecycleModuleBuilder.buildProject(LifecycleModuleBuilder.java:59)
	at org.apache.maven.lifecycle.internal.LifecycleStarter.singleThreadedBuild(LifecycleStarter.java:183)
	at org.apache.maven.lifecycle.internal.LifecycleStarter.execute(LifecycleStarter.java:161)
	at org.apache.maven.DefaultMaven.doExecute(DefaultMaven.java:319)
	at org.apache.maven.DefaultMaven.execute(DefaultMaven.java:156)
	at org.jvnet.hudson.maven3.launcher.Maven3Launcher.main(Maven3Launcher.java:79)
	at sun.reflect.NativeMethodAccessorImpl.invoke0(Native Method)
	at sun.reflect.NativeMethodAccessorImpl.invoke(NativeMethodAccessorImpl.java:39)
	at sun.reflect.DelegatingMethodAccessorImpl.invoke(DelegatingMethodAccessorImpl.java:25)
	at java.lang.reflect.Method.invoke(Method.java:592)
	at org.codehaus.plexus.classworlds.launcher.Launcher.launchStandard(Launcher.java:329)
	at org.codehaus.plexus.classworlds.launcher.Launcher.launch(Launcher.java:239)
	at org.jvnet.hudson.maven3.agent.Maven3Main.launch(Maven3Main.java:158)
	at hudson.maven.Maven3Builder.call(Maven3Builder.java:104)
	at hudson.maven.Maven3Builder.call(Maven3Builder.java:70)
	at hudson.remoting.UserRequest.perform(UserRequest.java:118)
	at hudson.remoting.UserRequest.perform(UserRequest.java:48)
	at hudson.remoting.Request$2.run(Request.java:287)
	at java.util.concurrent.Executors$RunnableAdapter.call(Executors.java:417)
	at java.util.concurrent.FutureTask$Sync.innerRun(FutureTask.java:269)
	at java.util.concurrent.FutureTask.run(FutureTask.java:123)
	at java.util.concurrent.ThreadPoolExecutor$Worker.runTask(ThreadPoolExecutor.java:651)
	at java.util.concurrent.ThreadPoolExecutor$Worker.run(ThreadPoolExecutor.java:676)
	at java.lang.Thread.run(Thread.java:595)
Caused by: org.apache.maven.project.DependencyResolutionException: Could not resolve dependencies
for project org.apache.uima:uima-as:pom:2.4.0-SNAPSHOT: Could not find artifact org.apache.uima:uimaj:zip:bin:2.4.0
in eclipsePlugins (http://repo1.maven.org/eclipse)
	at org.apache.maven.project.DefaultProjectDependenciesResolver.resolve(DefaultProjectDependenciesResolver.java:170)
	at org.apache.maven.lifecycle.internal.LifecycleDependencyResolver.getDependencies(LifecycleDependencyResolver.java:171)
	... 30 more
Caused by: org.sonatype.aether.resolution.DependencyResolutionException: Could not find artifact
org.apache.uima:uimaj:zip:bin:2.4.0 in eclipsePlugins (http://repo1.maven.org/eclipse)
	at org.sonatype.aether.impl.internal.DefaultRepositorySystem.resolveDependencies(DefaultRepositorySystem.java:412)
	at org.apache.maven.project.DefaultProjectDependenciesResolver.resolve(DefaultProjectDependenciesResolver.java:164)
	... 31 more
Caused by: org.sonatype.aether.resolution.ArtifactResolutionException: Could not find artifact
org.apache.uima:uimaj:zip:bin:2.4.0 in eclipsePlugins (http://repo1.maven.org/eclipse)
	at org.sonatype.aether.impl.internal.DefaultArtifactResolver.resolve(DefaultArtifactResolver.java:541)
	at org.sonatype.aether.impl.internal.DefaultArtifactResolver.resolveArtifacts(DefaultArtifactResolver.java:220)
	at org.sonatype.aether.impl.internal.DefaultRepositorySystem.resolveDependencies(DefaultRepositorySystem.java:395)
	... 32 more
Caused by: org.sonatype.aether.transfer.ArtifactNotFoundException: Could not find artifact
org.apache.uima:uimaj:zip:bin:2.4.0 in eclipsePlugins (http://repo1.maven.org/eclipse)
	at org.sonatype.aether.connector.wagon.WagonRepositoryConnector$4.wrap(WagonRepositoryConnector.java:945)
	at org.sonatype.aether.connector.wagon.WagonRepositoryConnector$4.wrap(WagonRepositoryConnector.java:940)
	at org.sonatype.aether.connector.wagon.WagonRepositoryConnector$GetTask.flush(WagonRepositoryConnector.java:695)
	at org.sonatype.aether.connector.wagon.WagonRepositoryConnector$GetTask.flush(WagonRepositoryConnector.java:689)
	at org.sonatype.aether.connector.wagon.WagonRepositoryConnector.get(WagonRepositoryConnector.java:445)
	at org.sonatype.aether.impl.internal.DefaultArtifactResolver.resolve(DefaultArtifactResolver.java:460)
	... 34 more
channel stopped


Mime
View raw message