uima-dev mailing list archives

Site index · List index
Message view « Date » · « Thread »
Top « Date » · « Thread »
From Apache Jenkins Server <jenk...@builds.apache.org>
Subject Build failed in Jenkins: UIMA-SDK #200
Date Thu, 15 Mar 2012 19:48:29 GMT
See <https://builds.apache.org/job/UIMA-SDK/200/changes>

Changes:

[burn] [UIMA-2378] Avoid use of Java 1.6 Properties.load(Reader)

------------------------------------------
[...truncated 3748 lines...]
4 [main] INFO org.apache.uima.util.impl.TestLog4jLogger_impl  - Exception test message
5 [main] INFO org.apache.uima.util.impl.TestLog4jLogger_impl  - Exception test message
5 [main] INFO org.apache.uima.util.impl.TestLog4jLogger_impl  - Exception test message
5 [main] INFO   - Exception test message
5 [main] INFO   - MESSAGE LOCALIZATION FAILED: null
5 [main] INFO testClass  - Exception test message
6 [main] INFO org.apache.uima  - Exception test message
6 [main] INFO org.apache.uima  - Exception test message
6 [main] INFO org.apache.uima  - MESSAGE LOCALIZATION FAILED: null
6 [main] INFO org.apache.uima  - Exception test message
6 [main] INFO org.apache.uima  - Exception test message
6 [main] INFO org.apache.uima  - MESSAGE LOCALIZATION FAILED: null
7 [main] INFO org.apache.uima  - Exception test message
Mar 15, 2012 7:29:34 PM org.apache.uima.util.impl.TestLog4jLogger_impl testLoggerFromUIMAFramework(308)
INFO: ------------------------------------------------------------
Mar 15, 2012 7:29:34 PM org.apache.uima.util.impl.TestLog4jLogger_impl testLoggerFromUIMAFramework(310)
INFO: My first test message
Tests run: 5, Failures: 0, Errors: 0, Skipped: 0, Time elapsed: 0.022 sec
Running org.apache.uima.util.LevelTest
Tests run: 11, Failures: 0, Errors: 0, Skipped: 0, Time elapsed: 0.001 sec
Running org.apache.uima.util.CasCreationUtilsTest
Tests run: 12, Failures: 0, Errors: 0, Skipped: 0, Time elapsed: 0.412 sec
Running org.apache.uima.util.TypeSystemUtilTest
Tests run: 1, Failures: 0, Errors: 0, Skipped: 0, Time elapsed: 0.053 sec
Running org.apache.uima.util.CasCopierTest
Tests run: 5, Failures: 0, Errors: 0, Skipped: 0, Time elapsed: 0.55 sec
Running org.apache.uima.util.TestCollectionReader
Tests run: 0, Failures: 0, Errors: 0, Skipped: 0, Time elapsed: 0.001 sec
Running org.apache.uima.util.XMLSerializerTest
Tests run: 2, Failures: 0, Errors: 0, Skipped: 0, Time elapsed: 0.002 sec
Running org.apache.uima.jcas.test.JCasTest

Caught CAS Exception with message: The JCas cannot be initialized.  The following errors occurred:
The JCAS range type uima.cas.String for feature changedFType of type aa.MissingFeatureInCas
does not match the CAS range type uima.cas.Float for the feature.

This error msg expected: org.apache.uima.cas.CASException: Type information from the CAS cannot
be accessed while initializing the JCas type missing.type
This error msg expected: org.apache.uima.cas.CASException: Feature information from the CAS
cannot be accessed while initializing the JCAS type uima.tcas.Annotation with feature Begin.
Expected Error: JCas getNthElement method called via invalid object - an empty list: EmptyFSList.
Expected Error: JCas getNthElement method called with index "-1" which is negative.
Expected Error: JCas getNthElement method called with index "2" larger than the length of
the list.
Expected Error: JCas getNthElement method called via invalid object - an empty list: EmptyIntegerList.
Expected Error: JCas getNthElement method called with index "-1" which is negative.
Expected Error: JCas getNthElement method called with index "2" larger than the length of
the list.
Expected Error: JCas getNthElement method called via invalid object - an empty list: EmptyFloatList.
Expected Error: JCas getNthElement method called with index "-1" which is negative.
Expected Error: JCas getNthElement method called with index "2" larger than the length of
the list.
Expected Error: JCas getNthElement method called via invalid object - an empty list: EmptyStringList.
Expected Error: JCas getNthElement method called with index "-1" which is negative.
Expected Error: JCas getNthElement method called with index "2" larger than the length of
the list.
Tests run: 18, Failures: 0, Errors: 0, Skipped: 0, Time elapsed: 0.347 sec
Running org.apache.uima.impl.CasConsumerFactory_implTest
Tests run: 1, Failures: 0, Errors: 0, Skipped: 0, Time elapsed: 0.001 sec
Running org.apache.uima.impl.CustomResourceSpecifierFactory_implTest
Tests run: 1, Failures: 0, Errors: 0, Skipped: 0, Time elapsed: 0.001 sec
Running org.apache.uima.impl.AnalysisEngineFactory_implTest
Tests run: 1, Failures: 0, Errors: 0, Skipped: 0, Time elapsed: 0.001 sec
Running org.apache.uima.impl.CollectionReaderFactory_implTest
Tests run: 1, Failures: 0, Errors: 0, Skipped: 0, Time elapsed: 0 sec
Running org.apache.uima.impl.UimaContext_implTest
Mar 15, 2012 7:29:36 PM org.apache.uima.impl.RootUimaContext_impl getResourceURL
WARNING: The unmanaged resource org/apache/uima/analysis_engine/impl/testDataFile3.dat was
accessed.This feature is deprecated, and support may be removed in future versions.
Mar 15, 2012 7:29:36 PM org.apache.uima.impl.RootUimaContext_impl getResourceURL
WARNING: The unmanaged resource testDataFile.dat was accessed.This feature is deprecated,
and support may be removed in future versions.
Mar 15, 2012 7:29:36 PM org.apache.uima.impl.RootUimaContext_impl getResourceURL
WARNING: The unmanaged resource subdir was accessed.This feature is deprecated, and support
may be removed in future versions.
Mar 15, 2012 7:29:36 PM org.apache.uima.impl.RootUimaContext_impl getResourceURL
WARNING: The unmanaged resource org/apache/uima/analysis_engine/impl/testDataFile3.dat was
accessed.This feature is deprecated, and support may be removed in future versions.
Mar 15, 2012 7:29:36 PM org.apache.uima.impl.RootUimaContext_impl getResourceURL
WARNING: The unmanaged resource testDataFile.dat was accessed.This feature is deprecated,
and support may be removed in future versions.
Mar 15, 2012 7:29:36 PM org.apache.uima.impl.RootUimaContext_impl getResourceURL
WARNING: The unmanaged resource subdir was accessed.This feature is deprecated, and support
may be removed in future versions.
Mar 15, 2012 7:29:36 PM org.apache.uima.impl.RootUimaContext_impl getResourceURL
WARNING: The unmanaged resource org/apache/uima/analysis_engine/impl/testDataFile3.dat was
accessed.This feature is deprecated, and support may be removed in future versions.
Mar 15, 2012 7:29:36 PM org.apache.uima.impl.RootUimaContext_impl getResourceURL
WARNING: The unmanaged resource testDataFile.dat was accessed.This feature is deprecated,
and support may be removed in future versions.
Mar 15, 2012 7:29:36 PM org.apache.uima.impl.RootUimaContext_impl getResourceURL
WARNING: The unmanaged resource subdir was accessed.This feature is deprecated, and support
may be removed in future versions.
Mar 15, 2012 7:29:36 PM org.apache.uima.impl.RootUimaContext_impl getResourceAsStream
WARNING: The unmanaged resource org/apache/uima/analysis_engine/impl/testDataFile3.dat was
accessed.This feature is deprecated, and support may be removed in future versions.
Mar 15, 2012 7:29:36 PM org.apache.uima.impl.RootUimaContext_impl getResourceAsStream
WARNING: The unmanaged resource testDataFile.dat was accessed.This feature is deprecated,
and support may be removed in future versions.
Mar 15, 2012 7:29:36 PM org.apache.uima.impl.RootUimaContext_impl getResourceAsStream
WARNING: The unmanaged resource subdir was accessed.This feature is deprecated, and support
may be removed in future versions.
Tests run: 17, Failures: 0, Errors: 0, Skipped: 0, Time elapsed: 0.937 sec
Running org.apache.uima.cas.test.ArrayIndexTest
Tests run: 1, Failures: 0, Errors: 0, Skipped: 0, Time elapsed: 0.013 sec
Running org.apache.uima.cas.test.TypeSystemUtilsTest
Tests run: 1, Failures: 0, Errors: 0, Skipped: 0, Time elapsed: 0.007 sec
Running org.apache.uima.cas.test.SofaTest
Tests run: 10, Failures: 0, Errors: 0, Skipped: 0, Time elapsed: 0.297 sec
Running org.apache.uima.cas.test.NewPrimitiveTypesTest
Tests run: 8, Failures: 0, Errors: 0, Skipped: 0, Time elapsed: 0.068 sec
Running org.apache.uima.cas.test.CompleteSerializationTest
Tests run: 1, Failures: 0, Errors: 0, Skipped: 0, Time elapsed: 0.049 sec
Running org.apache.uima.cas.test.SerializationNoMDTest
Tests run: 1, Failures: 0, Errors: 0, Skipped: 0, Time elapsed: 0.22 sec
Running org.apache.uima.cas.test.IntArrayFSTest
Tests run: 2, Failures: 0, Errors: 0, Skipped: 0, Time elapsed: 0.037 sec
Running org.apache.uima.cas.test.TypePriorityTest
Tests run: 3, Failures: 0, Errors: 0, Skipped: 0, Time elapsed: 0.014 sec
Running org.apache.uima.cas.test.TypeSystemTest
Tests run: 13, Failures: 0, Errors: 0, Skipped: 0, Time elapsed: 0.238 sec
Running org.apache.uima.cas.test.FloatArrayFSTest
Tests run: 2, Failures: 0, Errors: 0, Skipped: 0, Time elapsed: 0.032 sec
Running org.apache.uima.cas.test.AnnotationTreeTest
Tests run: 1, Failures: 0, Errors: 0, Skipped: 0, Time elapsed: 0.085 sec
Running org.apache.uima.cas.test.TypeOrderTest
Tests run: 2, Failures: 0, Errors: 0, Skipped: 0, Time elapsed: 0.063 sec
Running org.apache.uima.cas.test.ArrayFSTest
Tests run: 4, Failures: 0, Errors: 0, Skipped: 0, Time elapsed: 0.049 sec
Running org.apache.uima.cas.test.FeatureStructureTest
Tests run: 8, Failures: 0, Errors: 0, Skipped: 0, Time elapsed: 0.103 sec
Running org.apache.uima.cas.test.IndexSerializationTest
Tests run: 1, Failures: 0, Errors: 0, Skipped: 0, Time elapsed: 0.027 sec
Running org.apache.uima.cas.test.UimacppDeserializationTest
Tests run: 1, Failures: 0, Errors: 0, Skipped: 0, Time elapsed: 0 sec
Running org.apache.uima.cas.test.IndexRepositoryTest
Tests run: 1, Failures: 0, Errors: 0, Skipped: 0, Time elapsed: 0.009 sec
Running org.apache.uima.cas.test.TestAnnotator
Tests run: 0, Failures: 0, Errors: 0, Skipped: 0, Time elapsed: 0 sec
Running org.apache.uima.cas.test.TypeSystemReinitTest
Tests run: 2, Failures: 0, Errors: 0, Skipped: 0, Time elapsed: 0.047 sec
Running org.apache.uima.cas.test.IndexComparitorTest
Tests run: 1, Failures: 0, Errors: 0, Skipped: 0, Time elapsed: 0.025 sec
Running org.apache.uima.cas.test.StringSubtypeTest
Tests run: 3, Failures: 0, Errors: 0, Skipped: 0, Time elapsed: 0.058 sec
Running org.apache.uima.cas.test.GetAllIndexedTest
Tests run: 1, Failures: 0, Errors: 0, Skipped: 0, Time elapsed: 0.021 sec
Running org.apache.uima.cas.test.JcasSofaTest
Tests run: 4, Failures: 0, Errors: 0, Skipped: 0, Time elapsed: 0.113 sec
Running org.apache.uima.cas.test.GrowingTheCasTest
Tests run: 1, Failures: 0, Errors: 0, Skipped: 0, Time elapsed: 19.966 sec
Running org.apache.uima.cas.test.IteratorTest
Tests run: 5, Failures: 0, Errors: 0, Skipped: 0, Time elapsed: 0.42 sec
Running org.apache.uima.cas.test.StringArrayTest
Tests run: 4, Failures: 0, Errors: 0, Skipped: 0, Time elapsed: 0.364 sec
Running org.apache.uima.cas.test.SerializationReinitTest
Tests run: 6, Failures: 0, Errors: 0, Skipped: 0, Time elapsed: 1.889 sec
Running org.apache.uima.cas.test.SubiteratorTest
Tests run: 1, Failures: 0, Errors: 0, Skipped: 0, Time elapsed: 0.051 sec
Running org.apache.uima.cas.test.AnnotationIteratorTest
Tests run: 2, Failures: 0, Errors: 0, Skipped: 0, Time elapsed: 0.029 sec
Running org.apache.uima.cas.test.FilteredIteratorTest
Tests run: 5, Failures: 0, Errors: 0, Skipped: 0, Time elapsed: 0.153 sec
Running org.apache.uima.cas.test.CASTest
Tests run: 7, Failures: 0, Errors: 0, Skipped: 0, Time elapsed: 0.102 sec
Running org.apache.uima.cas.impl.CasPoolTest
Tests run: 1, Failures: 0, Errors: 0, Skipped: 0, Time elapsed: 0.019 sec
Running org.apache.uima.cas.impl.FeaturePathTest
Tests run: 7, Failures: 0, Errors: 0, Skipped: 0, Time elapsed: 0.165 sec
Running org.apache.uima.cas.impl.CasResetResizeTest
Tests run: 1, Failures: 0, Errors: 0, Skipped: 0, Time elapsed: 2.786 sec
Running org.apache.uima.cas.impl.UnambiguousIteratorTest
Tests run: 1, Failures: 0, Errors: 0, Skipped: 0, Time elapsed: 0.202 sec
Running org.apache.uima.cas.impl.ComponentInfoTest
Tests run: 1, Failures: 0, Errors: 0, Skipped: 0, Time elapsed: 0.071 sec
Running org.apache.uima.cas.impl.CasPerformanceTuningSettingsTest
Tests run: 1, Failures: 0, Errors: 0, Skipped: 0, Time elapsed: 0.014 sec
Running org.apache.uima.cas.impl.XCASDeserializerTest
Tests run: 7, Failures: 0, Errors: 0, Skipped: 0, Time elapsed: 1.497 sec
Running org.apache.uima.cas.impl.XmiCasSerializerTest
Tests run: 2, Failures: 0, Errors: 0, Skipped: 0, Time elapsed: 0.041 sec
Running org.apache.uima.cas.impl.XmiCasDeserializerTest

Number of threads serializing: 1  Normalized millisecs (should be close to the same): 52

Number of threads serializing: 2  Normalized millisecs (should be close to the same): 16

Number of threads serializing: 4  Normalized millisecs (should be close to the same): 13

Number of threads serializing: 8  Normalized millisecs (should be close to the same): 15

Number of threads serializing: 16  Normalized millisecs (should be close to the same): 14

Number of threads serializing: 1  Normalized millisecs (should be close to the same): 33

Number of threads serializing: 2  Normalized millisecs (should be close to the same): 10

Number of threads serializing: 4  Normalized millisecs (should be close to the same): 12

Number of threads serializing: 8  Normalized millisecs (should be close to the same): 16

Number of threads serializing: 16  Normalized millisecs (should be close to the same): 15
<?xml version="1.0" encoding="UTF-8"?><xmi:XMI xmlns:testTypeSystem="http:///org/apache/uima/testTypeSystem.ecore"
xmlns:cas="http:///uima/cas.ecore" xmlns:test="http:///sofa/test.ecore" xmlns:tcas="http:///uima/tcas.ecore"
xmlns:xmi="http://www.omg.org/XMI" xmi:version="2.0"><cas:NULL xmi:id="0"/><cas:Sofa
xmi:id="1" sofaNum="1" sofaID="_InitialView" mimeType="text" sofaString="This is a test document
in the initial view"/><tcas:DocumentAnnotation xmi:id="2" sofa="1" begin="0" end="43"
language="x-unspecified"/><testTypeSystem:Referent xmi:id="3"/><cas:View sofa="1"
members="2 3"/></xmi:XMI>
<?xml version="1.0" encoding="UTF-8"?><xmi:XMI xmlns:testTypeSystem="http:///org/apache/uima/testTypeSystem.ecore"
xmlns:cas="http:///uima/cas.ecore" xmlns:test="http:///sofa/test.ecore" xmlns:tcas="http:///uima/tcas.ecore"
xmlns:xmi="http://www.omg.org/XMI" xmi:version="2.0"><cas:NULL xmi:id="0"/><cas:Sofa
xmi:id="4" sofaNum="2" sofaID="NewView"/><tcas:Annotation xmi:id="5" sofa="4" begin="6"
end="8"/><cas:View sofa="4" members="3 5"/></xmi:XMI>
<?xml version="1.0" encoding="UTF-8"?><xmi:XMI xmlns:testTypeSystem="http:///org/apache/uima/testTypeSystem.ecore"
xmlns:cas="http:///uima/cas.ecore" xmlns:test="http:///sofa/test.ecore" xmlns:tcas="http:///uima/tcas.ecore"
xmlns:xmi="http://www.omg.org/XMI" xmi:version="2.0"><cas:NULL xmi:id="0"/><cas:Sofa
xmi:id="1" sofaNum="1" sofaID="_InitialView" mimeType="text" sofaString="This is a test document
in the initial view"/><tcas:DocumentAnnotation xmi:id="2" sofa="1" begin="0" end="43"
language="x-unspecified"/><testTypeSystem:Referent xmi:id="3"/><cas:View sofa="1"
members="2 3"/></xmi:XMI>
<?xml version="1.0" encoding="UTF-8"?><xmi:XMI xmlns:testTypeSystem="http:///org/apache/uima/testTypeSystem.ecore"
xmlns:cas="http:///uima/cas.ecore" xmlns:test="http:///sofa/test.ecore" xmlns:tcas="http:///uima/tcas.ecore"
xmlns:xmi="http://www.omg.org/XMI" xmi:version="2.0"><cas:NULL xmi:id="0"/><cas:Sofa
xmi:id="4" sofaNum="2" sofaID="NewView"/><tcas:Annotation xmi:id="5" sofa="4" begin="6"
end="8"/><cas:View sofa="4" members="3 5"/></xmi:XMI>
Should catch MultipleCreateMarker message: CreateMarker called multiple times for one CAS.
 This implementation only supports one call.
Tests run: 23, Failures: 0, Errors: 0, Skipped: 0, Time elapsed: 5.671 sec
Running org.apache.uima.internal.util.ResourcePoolTest
Mar 15, 2012 7:30:14 PM org.apache.uima.internal.util.ResourcePoolTest testReleaseResource(154)
WARNING: Unit test is expecting to log ResourcePool warning.
Mar 15, 2012 7:30:14 PM org.apache.uima.internal.util.ResourcePool releaseResource
WARNING: The system tried to return a resource to the pool from which it was not checked out.
Tests run: 5, Failures: 0, Errors: 0, Skipped: 0, Time elapsed: 2.782 sec
Running org.apache.uima.internal.util.AnalysisEnginePoolTest
Tests run: 3, Failures: 0, Errors: 0, Skipped: 0, Time elapsed: 0.096 sec
Running org.apache.uima.internal.util.XmlUtilsTest
Tests run: 1, Failures: 0, Errors: 0, Skipped: 0, Time elapsed: 0 sec
Running org.apache.uima.internal.util.UIMAClassLoaderTest
Tests run: 6, Failures: 0, Errors: 0, Skipped: 0, Time elapsed: 0.039 sec
Running org.apache.uima.flow.impl.FixedFlowControllerTest
Tests run: 3, Failures: 0, Errors: 0, Skipped: 0, Time elapsed: 0.017 sec

Results :

Tests run: 431, Failures: 0, Errors: 0, Skipped: 0

Build timed out (after 30 minutes). Marking the build as failed.
java.lang.InterruptedException
	at java.lang.Object.wait(Native Method)
	at hudson.remoting.Request.call(Request.java:127)
	at hudson.remoting.Channel.call(Channel.java:681)
	at hudson.remoting.RemoteInvocationHandler.invoke(RemoteInvocationHandler.java:158)
	at $Proxy2.execute(Unknown Source)
	at hudson.maven.MavenBuildProxy$Filter.execute(MavenBuildProxy.java:191)
	at hudson.maven.reporters.SurefireArchiver.postExecute(SurefireArchiver.java:146)
	at hudson.maven.Maven3Builder$MavenExecutionListener.recordMojoSucceeded(Maven3Builder.java:478)
	at hudson.maven.Maven3Builder$MavenExecutionListener.mojoSucceeded(Maven3Builder.java:459)
	at org.apache.maven.lifecycle.internal.DefaultExecutionEventCatapult.fire(DefaultExecutionEventCatapult.java:87)
	at org.apache.maven.lifecycle.internal.DefaultExecutionEventCatapult.fire(DefaultExecutionEventCatapult.java:42)
	at org.apache.maven.lifecycle.internal.MojoExecutor.execute(MojoExecutor.java:228)
	at org.apache.maven.lifecycle.internal.MojoExecutor.execute(MojoExecutor.java:153)
	at org.apache.maven.lifecycle.internal.MojoExecutor.execute(MojoExecutor.java:145)
	at org.apache.maven.lifecycle.internal.LifecycleModuleBuilder.buildProject(LifecycleModuleBuilder.java:84)
	at org.apache.maven.lifecycle.internal.LifecycleModuleBuilder.buildProject(LifecycleModuleBuilder.java:59)
	at org.apache.maven.lifecycle.internal.LifecycleStarter.singleThreadedBuild(LifecycleStarter.java:183)
	at org.apache.maven.lifecycle.internal.LifecycleStarter.execute(LifecycleStarter.java:161)
	at org.apache.maven.DefaultMaven.doExecute(DefaultMaven.java:319)
	at org.apache.maven.DefaultMaven.execute(DefaultMaven.java:156)
	at org.jvnet.hudson.maven3.launcher.Maven3Launcher.main(Maven3Launcher.java:79)
	at sun.reflect.NativeMethodAccessorImpl.invoke0(Native Method)
	at sun.reflect.NativeMethodAccessorImpl.invoke(NativeMethodAccessorImpl.java:39)
	at sun.reflect.DelegatingMethodAccessorImpl.invoke(DelegatingMethodAccessorImpl.java:25)
	at java.lang.reflect.Method.invoke(Method.java:592)
	at org.codehaus.plexus.classworlds.launcher.Launcher.launchStandard(Launcher.java:329)
	at org.codehaus.plexus.classworlds.launcher.Launcher.launch(Launcher.java:239)
	at org.jvnet.hudson.maven3.agent.Maven3Main.launch(Maven3Main.java:158)
	at hudson.maven.Maven3Builder.call(Maven3Builder.java:104)
	at hudson.maven.Maven3Builder.call(Maven3Builder.java:70)
	at hudson.remoting.UserRequest.perform(UserRequest.java:118)
	at hudson.remoting.UserRequest.perform(UserRequest.java:48)
	at hudson.remoting.Request$2.run(Request.java:287)
	at hudson.remoting.InterceptingExecutorService$1.call(InterceptingExecutorService.java:72)
	at java.util.concurrent.FutureTask$Sync.innerRun(FutureTask.java:269)
	at java.util.concurrent.FutureTask.run(FutureTask.java:123)
	at java.util.concurrent.ThreadPoolExecutor$Worker.runTask(ThreadPoolExecutor.java:651)
	at java.util.concurrent.ThreadPoolExecutor$Worker.run(ThreadPoolExecutor.java:676)
	at java.lang.Thread.run(Thread.java:595)
channel stopped

Mime
View raw message