uima-dev mailing list archives

Site index · List index
Message view « Date » · « Thread »
Top « Date » · « Thread »
From Apache Jenkins Server <jenk...@builds.apache.org>
Subject Build failed in Jenkins: UIMA-SDK #198
Date Wed, 14 Mar 2012 22:07:27 GMT
See <https://builds.apache.org/job/UIMA-SDK/198/changes>

Changes:

[burn] [UIMA-2381] Avoid putting stack traces for expected exceptions in the console log

------------------------------------------
[...truncated 3209 lines...]
A         uimaj-internal-tools
A         uimaj-internal-tools/HOWTO
A         uimaj-internal-tools/src
A         uimaj-internal-tools/src/main
A         uimaj-internal-tools/src/main/java
A         uimaj-internal-tools/src/main/java/org
A         uimaj-internal-tools/src/main/java/org/apache
A         uimaj-internal-tools/src/main/java/org/apache/uima
A         uimaj-internal-tools/src/main/java/org/apache/uima/internal
A         uimaj-internal-tools/src/main/java/org/apache/uima/internal/tools
A         uimaj-internal-tools/src/main/java/org/apache/uima/internal/tools/LevelIssueAnalyzer.java
A         uimaj-internal-tools/pom.xml
 U        .
At revision 1300752
Parsing POMs
Downloaded artifact http://repository.apache.org/snapshots//org/apache/uima/parent-pom/4-SNAPSHOT/maven-metadata.xml
Modules changed, recalculating dependency graph
[trunk] $ /home/hudson/tools/java/latest1.5/bin/java -Xmx800m -XX:MaxPermSize=256m -cp /home/jenkins/jenkins-slave/maven3-agent.jar:/home/hudson/tools/maven/latest3/boot/plexus-classworlds-2.4.jar
org.jvnet.hudson.maven3.agent.Maven3Main /home/hudson/tools/maven/latest3 /home/jenkins/jenkins-slave/slave.jar
/home/jenkins/jenkins-slave/maven3-interceptor.jar 50561
<===[JENKINS REMOTING CAPACITY]===>channel started
   Executing Maven:  -B -f <https://builds.apache.org/job/UIMA-SDK/ws/trunk/pom.xml>
-Dmaven.repo.local=/home/jenkins/jenkins-slave/maven-repositories/1 clean install
[INFO] Scanning for projects...
[INFO] ------------------------------------------------------------------------
[INFO] Reactor Build Order:
[INFO] 
[INFO] Apache UIMA Java SDK: uimaj-parent
[INFO] Apache UIMA Base: uimaj-test-util: JUnit utilities
[INFO] UIMA Base: uimaj-core
[INFO] Apache UIMA Base: jVinci: Vinci Transport Library
[INFO] Apache UIMA Base: uimaj-adapter-vinci: Vinci Adapter
[INFO] Apache UIMA Base: uimaj-cpe: Collection Processing Engine
[INFO] Apache UIMA Base: uimaj-document-annotation
[INFO] Apache UIMA Base: uimaj-tools: Tools
[INFO] Apache UIMA Base: uimaj-examples: SDK Examples
[INFO] Apache UIMA Base: uimaj-adapter-soap: SOAP Adapter
[INFO] Apache UIMA Base: uimaj-component-test-util: for JUnit
[INFO] Apache UIMA Eclipse: uimaj-ep-debug
[INFO] Apache UIMA Eclipse: uimaj-ep-jcasgen
[INFO] Apache UIMA Eclipse: uimaj-ep-configurator: Descriptor Editor
[INFO] Apache UIMA Eclipse: uimaj-ep-pear-packager
[INFO] Apache UIMA Eclipse: uimaj-ep-launcher
[INFO] Apache UIMA Eclipse: uimaj-ep-cas-editor
[INFO] Apache UIMA Eclipse: uimaj-ep-cas-editor-ide
[INFO] Apache UIMA Eclipse: uimaj-ep-runtime
[INFO] Apache UIMA Eclipse: uimaj-eclipse-feature-tools
[INFO] Apache UIMA Eclipse: uimaj-eclipse-feature-runtime
[INFO] Apache UIMA Aggregate: aggregate-uimaj-eclipse-plugins
[INFO] Apache UIMA SDK Documentation - overview and setup
[INFO] Apache UIMA SDK Documentation - references
[INFO] Apache UIMA SDK Documentation - tools
[INFO] Apache UIMA SDK Documentation - tutorials and user's guides
[INFO] Apache UIMA Aggregate POM aggregate-uimaj-docbooks: UIMA Base
[INFO] Apache UIMA Maven Plugin PearPackagingMavenPlugin
[INFO] Apache UIMA Base: uimaj-bootstrap: Bootstrap launcher
[INFO] Apache UIMA Aggregate: aggregate-uimaj: UIMA Base
[INFO] Apache UIMA Java SDK: uimaj
[INFO]                                                                         
[INFO] ------------------------------------------------------------------------
[INFO] Building Apache UIMA Java SDK: uimaj-parent 2.4.1-SNAPSHOT
[INFO] ------------------------------------------------------------------------
[INFO] 
[INFO] --- maven-clean-plugin:2.4.1:clean (default-clean) @ uimaj-parent ---
log4j:WARN No appenders could be found for logger (org.apache.commons.beanutils.converters.BooleanConverter).
log4j:WARN Please initialize the log4j system properly.
[INFO] 
[INFO] --- build-helper-maven-plugin:1.5:parse-version (parse-project-version) @ uimaj-parent
---
[INFO] 
[INFO] --- uima-build-helper-maven-plugin:3-SNAPSHOT:parse-date-time (set buildYear and buildMonth)
@ uimaj-parent ---
[INFO] 
[INFO] --- maven-remote-resources-plugin:1.2.1:process (default) @ uimaj-parent ---
Downloading: http://repository.apache.org/snapshots/org/apache/uima/uima-build-resources/4-SNAPSHOT/maven-metadata.xml
Downloaded: http://repository.apache.org/snapshots/org/apache/uima/uima-build-resources/4-SNAPSHOT/maven-metadata.xml
(773 B at 0.7 KB/sec)
[INFO] 
[INFO] --- maven-site-plugin:3.0:attach-descriptor (attach-descriptor) @ uimaj-parent ---
[INFO] 
[INFO] --- maven-install-plugin:2.3.1:install (default-install) @ uimaj-parent ---
[INFO] Installing <https://builds.apache.org/job/UIMA-SDK/ws/trunk/uimaj-parent/pom.xml>
to /home/jenkins/jenkins-slave/maven-repositories/1/org/apache/uima/uimaj-parent/2.4.1-SNAPSHOT/uimaj-parent-2.4.1-SNAPSHOT.pom
[JENKINS] Archiving <https://builds.apache.org/job/UIMA-SDK/ws/trunk/uimaj-parent/pom.xml>
to /home/hudson/hudson/jobs/UIMA-SDK/modules/org.apache.uima$uimaj-parent/builds/2012-03-14_22-06-28/archive/org.apache.uima/uimaj-parent/2.4.1-SNAPSHOT/uimaj-parent-2.4.1-SNAPSHOT.pom
[INFO]                                                                         
[INFO] ------------------------------------------------------------------------
[INFO] Building Apache UIMA Base: uimaj-test-util: JUnit utilities 2.4.1-SNAPSHOT
[INFO] ------------------------------------------------------------------------
[INFO] 
[INFO] --- maven-clean-plugin:2.4.1:clean (default-clean) @ uimaj-test-util ---
[INFO] 
[INFO] --- build-helper-maven-plugin:1.5:parse-version (parse-project-version) @ uimaj-test-util
---
[INFO] 
[INFO] --- uima-build-helper-maven-plugin:3-SNAPSHOT:parse-date-time (set buildYear and buildMonth)
@ uimaj-test-util ---
[INFO] 
[INFO] --- maven-remote-resources-plugin:1.2.1:process (default) @ uimaj-test-util ---
[INFO] 
[INFO] --- maven-resources-plugin:2.5:resources (default-resources) @ uimaj-test-util ---
[debug] execute contextualize
[INFO] Using 'UTF-8' encoding to copy filtered resources.
[INFO] Copying 0 resource
[INFO] Copying 3 resources
[INFO] 
[INFO] --- maven-compiler-plugin:2.3.2:compile (default-compile) @ uimaj-test-util ---
[INFO] Compiling 7 source files to <https://builds.apache.org/job/UIMA-SDK/ws/trunk/uimaj-test-util/target/classes>
[INFO] [debug] execute contextualize
[INFO] Using 'UTF-8' encoding to copy filtered resources.
[INFO] skip non existing resourceDirectory <https://builds.apache.org/job/UIMA-SDK/ws/trunk/uimaj-test-util/src/test/resources>
[INFO] Copying 3 resources

[INFO] --- maven-resources-plugin:2.5:testResources (default-testResources) @ uimaj-test-util
---
[INFO] [INFO] Nothing to compile - all classes are up to date

[INFO] --- maven-compiler-plugin:2.3.2:testCompile (default-testCompile) @ uimaj-test-util
---
[INFO] 
[INFO] --- maven-surefire-plugin:2.9:test (default-test) @ uimaj-test-util ---
[INFO] Surefire report directory: <https://builds.apache.org/job/UIMA-SDK/ws/trunk/uimaj-test-util/target/surefire-reports>

-------------------------------------------------------
 T E S T S
-------------------------------------------------------

Results :

Tests run: 0, Failures: 0, Errors: 0, Skipped: 0

[JENKINS] Recording test results
[INFO] 
[INFO] --- maven-jar-plugin:2.3.1:jar (default-jar) @ uimaj-test-util ---
[INFO] Building jar: <https://builds.apache.org/job/UIMA-SDK/ws/trunk/uimaj-test-util/target/uimaj-test-util-2.4.1-SNAPSHOT.jar>
[INFO] 
[INFO] --- maven-site-plugin:3.0:attach-descriptor (attach-descriptor) @ uimaj-test-util ---
[INFO] [INFO] Installing <https://builds.apache.org/job/UIMA-SDK/ws/trunk/uimaj-test-util/target/uimaj-test-util-2.4.1-SNAPSHOT.jar>
to /home/jenkins/jenkins-slave/maven-repositories/1/org/apache/uima/uimaj-test-util/2.4.1-SNAPSHOT/uimaj-test-util-2.4.1-SNAPSHOT.jar
[INFO] Installing <https://builds.apache.org/job/UIMA-SDK/ws/trunk/uimaj-test-util/pom.xml>
to /home/jenkins/jenkins-slave/maven-repositories/1/org/apache/uima/uimaj-test-util/2.4.1-SNAPSHOT/uimaj-test-util-2.4.1-SNAPSHOT.pom

[INFO] --- maven-install-plugin:2.3.1:install (default-install) @ uimaj-test-util ---
[JENKINS] Archiving <https://builds.apache.org/job/UIMA-SDK/ws/trunk/uimaj-test-util/pom.xml>
to /home/hudson/hudson/jobs/UIMA-SDK/modules/org.apache.uima$uimaj-test-util/builds/2012-03-14_22-06-29/archive/org.apache.uima/uimaj-test-util/2.4.1-SNAPSHOT/uimaj-test-util-2.4.1-SNAPSHOT.pom
[JENKINS] Archiving <https://builds.apache.org/job/UIMA-SDK/ws/trunk/uimaj-test-util/target/uimaj-test-util-2.4.1-SNAPSHOT.jar>
to /home/hudson/hudson/jobs/UIMA-SDK/modules/org.apache.uima$uimaj-test-util/builds/2012-03-14_22-06-29/archive/org.apache.uima/uimaj-test-util/2.4.1-SNAPSHOT/uimaj-test-util-2.4.1-SNAPSHOT.jar
[INFO]                                                                         
[INFO] ------------------------------------------------------------------------
[INFO] Building UIMA Base: uimaj-core 2.4.1-SNAPSHOT
[INFO] ------------------------------------------------------------------------
[INFO] 
[INFO] --- maven-clean-plugin:2.4.1:clean (default-clean) @ uimaj-core ---
[INFO] 
[INFO] --- build-helper-maven-plugin:1.5:parse-version (parse-project-version) @ uimaj-core
---
[INFO] 
[INFO] --- uima-build-helper-maven-plugin:3-SNAPSHOT:parse-date-time (set buildYear and buildMonth)
@ uimaj-core ---
[INFO] [debug] execute contextualize
[INFO] Using 'UTF-8' encoding to copy filtered resources.
[INFO] Copying 1 resource

[INFO] --- maven-resources-plugin:2.5:copy-resources (setVersions) @ uimaj-core ---
[INFO] [INFO] Source directory: <https://builds.apache.org/job/UIMA-SDK/ws/trunk/uimaj-core/target/generated-sources/releaseVersion>
added.

[INFO] --- build-helper-maven-plugin:1.5:add-source (addVersionSrc) @ uimaj-core ---
[INFO] 
[INFO] --- maven-remote-resources-plugin:1.2.1:process (default) @ uimaj-core ---
[debug] execute contextualize
[INFO] [INFO] Using 'UTF-8' encoding to copy filtered resources.

[INFO] --- maven-resources-plugin:2.5:resources (default-resources) @ uimaj-core ---
[INFO] Copying 15 resources
[INFO] Copying 3 resources
[INFO] 
[INFO] --- maven-compiler-plugin:2.3.2:compile (default-compile) @ uimaj-core ---
[INFO] Compiling 680 source files to <https://builds.apache.org/job/UIMA-SDK/ws/trunk/uimaj-core/target/classes>
[INFO] -------------------------------------------------------------
[ERROR] COMPILATION ERROR : 
[INFO] -------------------------------------------------------------
[ERROR] <https://builds.apache.org/job/UIMA-SDK/ws/trunk/uimaj-core/src/main/java/org/apache/uima/resource/metadata/impl/ExternalOverrideSettings_impl.java>:[189,19]
load(java.io.InputStream) in java.util.Properties cannot be applied to (java.io.FileReader)
[ERROR] <https://builds.apache.org/job/UIMA-SDK/ws/trunk/uimaj-core/src/main/java/org/apache/uima/resource/metadata/impl/ExternalOverrideSettings_impl.java>:[205,15]
load(java.io.InputStream) in java.util.Properties cannot be applied to (java.io.StringReader)
[INFO] 2 errors 
[INFO] -------------------------------------------------------------
[JENKINS] Archiving <https://builds.apache.org/job/UIMA-SDK/ws/trunk/uimaj-core/pom.xml>
to /home/hudson/hudson/jobs/UIMA-SDK/modules/org.apache.uima$uimaj-core/builds/2012-03-14_22-06-28/archive/org.apache.uima/uimaj-core/2.4.1-SNAPSHOT/uimaj-core-2.4.1-SNAPSHOT.pom
[INFO] ------------------------------------------------------------------------
[INFO] Reactor Summary:
[INFO] 
[INFO] Apache UIMA Java SDK: uimaj-parent ................ SUCCESS [27.906s]
[INFO] Apache UIMA Base: uimaj-test-util: JUnit utilities  SUCCESS [3.785s]
[INFO] UIMA Base: uimaj-core ............................. FAILURE [5.739s]
[INFO] Apache UIMA Base: jVinci: Vinci Transport Library . SKIPPED
[INFO] Apache UIMA Base: uimaj-adapter-vinci: Vinci Adapter  SKIPPED
[INFO] Apache UIMA Base: uimaj-cpe: Collection Processing Engine  SKIPPED
[INFO] Apache UIMA Base: uimaj-document-annotation ....... SKIPPED
[INFO] Apache UIMA Base: uimaj-tools: Tools .............. SKIPPED
[INFO] Apache UIMA Base: uimaj-examples: SDK Examples .... SKIPPED
[INFO] Apache UIMA Base: uimaj-adapter-soap: SOAP Adapter  SKIPPED
[INFO] Apache UIMA Base: uimaj-component-test-util: for JUnit  SKIPPED
[INFO] Apache UIMA Eclipse: uimaj-ep-debug ............... SKIPPED
[INFO] Apache UIMA Eclipse: uimaj-ep-jcasgen ............. SKIPPED
[INFO] Apache UIMA Eclipse: uimaj-ep-configurator: Descriptor Editor  SKIPPED
[INFO] Apache UIMA Eclipse: uimaj-ep-pear-packager ....... SKIPPED
[INFO] Apache UIMA Eclipse: uimaj-ep-launcher ............ SKIPPED
[INFO] Apache UIMA Eclipse: uimaj-ep-cas-editor .......... SKIPPED
[INFO] Apache UIMA Eclipse: uimaj-ep-cas-editor-ide ...... SKIPPED
[INFO] Apache UIMA Eclipse: uimaj-ep-runtime ............. SKIPPED
[INFO] Apache UIMA Eclipse: uimaj-eclipse-feature-tools .. SKIPPED
[INFO] Apache UIMA Eclipse: uimaj-eclipse-feature-runtime  SKIPPED
[INFO] Apache UIMA Aggregate: aggregate-uimaj-eclipse-plugins  SKIPPED
[INFO] Apache UIMA SDK Documentation - overview and setup  SKIPPED
[INFO] Apache UIMA SDK Documentation - references ........ SKIPPED
[INFO] Apache UIMA SDK Documentation - tools ............. SKIPPED
[INFO] Apache UIMA SDK Documentation - tutorials and user's guides  SKIPPED
[INFO] Apache UIMA Aggregate POM aggregate-uimaj-docbooks: UIMA Base  SKIPPED
[INFO] Apache UIMA Maven Plugin PearPackagingMavenPlugin . SKIPPED
[INFO] Apache UIMA Base: uimaj-bootstrap: Bootstrap launcher  SKIPPED
[INFO] Apache UIMA Aggregate: aggregate-uimaj: UIMA Base . SKIPPED
[INFO] Apache UIMA Java SDK: uimaj ....................... SKIPPED
[INFO] ------------------------------------------------------------------------
[INFO] BUILD FAILURE
[INFO] ------------------------------------------------------------------------
[INFO] Total time: 43.886s
[INFO] Finished at: Wed Mar 14 22:07:26 UTC 2012
[INFO] Final Memory: 18M/77M
[INFO] ------------------------------------------------------------------------
mavenExecutionResult exceptions not empty
message : Failed to execute goal org.apache.maven.plugins:maven-compiler-plugin:2.3.2:compile
(default-compile) on project uimaj-core: Compilation failure
cause : Compilation failure
Stack trace : 
org.apache.maven.lifecycle.LifecycleExecutionException: Failed to execute goal org.apache.maven.plugins:maven-compiler-plugin:2.3.2:compile
(default-compile) on project uimaj-core: Compilation failure
	at org.apache.maven.lifecycle.internal.MojoExecutor.execute(MojoExecutor.java:213)
	at org.apache.maven.lifecycle.internal.MojoExecutor.execute(MojoExecutor.java:153)
	at org.apache.maven.lifecycle.internal.MojoExecutor.execute(MojoExecutor.java:145)
	at org.apache.maven.lifecycle.internal.LifecycleModuleBuilder.buildProject(LifecycleModuleBuilder.java:84)
	at org.apache.maven.lifecycle.internal.LifecycleModuleBuilder.buildProject(LifecycleModuleBuilder.java:59)
	at org.apache.maven.lifecycle.internal.LifecycleStarter.singleThreadedBuild(LifecycleStarter.java:183)
	at org.apache.maven.lifecycle.internal.LifecycleStarter.execute(LifecycleStarter.java:161)
	at org.apache.maven.DefaultMaven.doExecute(DefaultMaven.java:319)
	at org.apache.maven.DefaultMaven.execute(DefaultMaven.java:156)
	at org.jvnet.hudson.maven3.launcher.Maven3Launcher.main(Maven3Launcher.java:79)
	at sun.reflect.NativeMethodAccessorImpl.invoke0(Native Method)
	at sun.reflect.NativeMethodAccessorImpl.invoke(NativeMethodAccessorImpl.java:39)
	at sun.reflect.DelegatingMethodAccessorImpl.invoke(DelegatingMethodAccessorImpl.java:25)
	at java.lang.reflect.Method.invoke(Method.java:592)
	at org.codehaus.plexus.classworlds.launcher.Launcher.launchStandard(Launcher.java:329)
	at org.codehaus.plexus.classworlds.launcher.Launcher.launch(Launcher.java:239)
	at org.jvnet.hudson.maven3.agent.Maven3Main.launch(Maven3Main.java:158)
	at hudson.maven.Maven3Builder.call(Maven3Builder.java:104)
	at hudson.maven.Maven3Builder.call(Maven3Builder.java:70)
	at hudson.remoting.UserRequest.perform(UserRequest.java:118)
	at hudson.remoting.UserRequest.perform(UserRequest.java:48)
	at hudson.remoting.Request$2.run(Request.java:287)
	at hudson.remoting.InterceptingExecutorService$1.call(InterceptingExecutorService.java:72)
	at java.util.concurrent.FutureTask$Sync.innerRun(FutureTask.java:269)
	at java.util.concurrent.FutureTask.run(FutureTask.java:123)
	at java.util.concurrent.ThreadPoolExecutor$Worker.runTask(ThreadPoolExecutor.java:651)
	at java.util.concurrent.ThreadPoolExecutor$Worker.run(ThreadPoolExecutor.java:676)
	at java.lang.Thread.run(Thread.java:595)
Caused by: org.apache.maven.plugin.CompilationFailureException: Compilation failure
	at org.apache.maven.plugin.AbstractCompilerMojo.execute(AbstractCompilerMojo.java:656)
	at org.apache.maven.plugin.CompilerMojo.execute(CompilerMojo.java:128)
	at org.apache.maven.plugin.DefaultBuildPluginManager.executeMojo(DefaultBuildPluginManager.java:101)
	at org.apache.maven.lifecycle.internal.MojoExecutor.execute(MojoExecutor.java:209)
	... 27 more
channel stopped

Mime
View raw message