uima-dev mailing list archives

Site index · List index
Message view « Date » · « Thread »
Top « Date » · « Thread »
From Apache Jenkins Server <jenk...@builds.apache.org>
Subject Build failed in Jenkins: UIMA-SDK #199
Date Thu, 15 Mar 2012 15:20:26 GMT
See <https://builds.apache.org/job/UIMA-SDK/199/changes>

Changes:

[burn] [UINA-2378] Fixed bug in handling arrays; evaluate variables before substitution; added
another JUnit test.

------------------------------------------
[...truncated 3270 lines...]
Downloaded: http://repository.apache.org/snapshots/org/apache/uima/uima-build-helper-maven-plugin/3-SNAPSHOT/maven-metadata.xml
(786 B at 1.2 KB/sec)
Downloading: http://repository.apache.org/snapshots/org/apache/uima/uima-build-helper-maven-plugin/3-SNAPSHOT/uima-build-helper-maven-plugin-3-20120210.223548-10.pom
Downloaded: http://repository.apache.org/snapshots/org/apache/uima/uima-build-helper-maven-plugin/3-SNAPSHOT/uima-build-helper-maven-plugin-3-20120210.223548-10.pom
(4 KB at 8.8 KB/sec)
Downloading: http://repo1.maven.org/maven2/org/apache/uima/parent-pom/3/parent-pom-3.pom
Downloaded: http://repo1.maven.org/maven2/org/apache/uima/parent-pom/3/parent-pom-3.pom (74
KB at 240.2 KB/sec)
Downloading: http://repository.apache.org/snapshots/org/apache/uima/uima-build-helper-maven-plugin/3-SNAPSHOT/uima-build-helper-maven-plugin-3-20120210.223548-10.jar
Downloaded: http://repository.apache.org/snapshots/org/apache/uima/uima-build-helper-maven-plugin/3-SNAPSHOT/uima-build-helper-maven-plugin-3-20120210.223548-10.jar
(19 KB at 30.2 KB/sec)
[INFO] 
[INFO] --- maven-clean-plugin:2.4.1:clean (default-clean) @ uimaj-parent ---
log4j:WARN No appenders could be found for logger (org.apache.commons.beanutils.converters.BooleanConverter).
log4j:WARN Please initialize the log4j system properly.
[INFO] 
[INFO] --- build-helper-maven-plugin:1.5:parse-version (parse-project-version) @ uimaj-parent
---
[INFO] 
[INFO] --- uima-build-helper-maven-plugin:3-SNAPSHOT:parse-date-time (set buildYear and buildMonth)
@ uimaj-parent ---
Downloading: http://repo1.maven.org/maven2/org/apache/maven/maven-model/3.0.4/maven-model-3.0.4.pom
Downloaded: http://repo1.maven.org/maven2/org/apache/maven/maven-model/3.0.4/maven-model-3.0.4.pom
(4 KB at 13.6 KB/sec)
Downloading: http://repo1.maven.org/maven2/org/apache/maven/maven/3.0.4/maven-3.0.4.pom
Downloaded: http://repo1.maven.org/maven2/org/apache/maven/maven/3.0.4/maven-3.0.4.pom (22
KB at 42.9 KB/sec)
Downloading: http://repo1.maven.org/maven2/org/apache/maven/maven-project/3.0-alpha-2/maven-project-3.0-alpha-2.pom
Downloaded: http://repo1.maven.org/maven2/org/apache/maven/maven-project/3.0-alpha-2/maven-project-3.0-alpha-2.pom
(4 KB at 8.4 KB/sec)
Downloading: http://repo1.maven.org/maven2/org/apache/maven/maven/3.0-alpha-2/maven-3.0-alpha-2.pom
Downloaded: http://repo1.maven.org/maven2/org/apache/maven/maven/3.0-alpha-2/maven-3.0-alpha-2.pom
(21 KB at 40.1 KB/sec)
Downloading: http://repo1.maven.org/maven2/org/apache/maven/maven-model/3.0-alpha-2/maven-model-3.0-alpha-2.pom
Downloaded: http://repo1.maven.org/maven2/org/apache/maven/maven-model/3.0-alpha-2/maven-model-3.0-alpha-2.pom
(4 KB at 11.0 KB/sec)
Downloading: http://repo1.maven.org/maven2/org/apache/maven/maven-compat/3.0-alpha-2/maven-compat-3.0-alpha-2.pom
Downloaded: http://repo1.maven.org/maven2/org/apache/maven/maven-compat/3.0-alpha-2/maven-compat-3.0-alpha-2.pom
(3 KB at 10.4 KB/sec)
Downloading: http://repo1.maven.org/maven2/org/codehaus/plexus/plexus-container-default/1.0-beta-3.0.5/plexus-container-default-1.0-beta-3.0.5.pom
Downloaded: http://repo1.maven.org/maven2/org/codehaus/plexus/plexus-container-default/1.0-beta-3.0.5/plexus-container-default-1.0-beta-3.0.5.pom
(2 KB at 2.3 KB/sec)
Downloading: http://repo1.maven.org/maven2/org/codehaus/plexus/plexus-containers/1.0-beta-3.0.5/plexus-containers-1.0-beta-3.0.5.pom
Downloaded: http://repo1.maven.org/maven2/org/codehaus/plexus/plexus-containers/1.0-beta-3.0.5/plexus-containers-1.0-beta-3.0.5.pom
(5 KB at 10.5 KB/sec)
Downloading: http://repo1.maven.org/maven2/org/codehaus/plexus/plexus-classworlds/1.4/plexus-classworlds-1.4.pom
Downloaded: http://repo1.maven.org/maven2/org/codehaus/plexus/plexus-classworlds/1.4/plexus-classworlds-1.4.pom
(5 KB at 10.7 KB/sec)
Downloading: http://repo1.maven.org/maven2/org/codehaus/plexus/plexus/2.0.0/plexus-2.0.0.pom
Downloaded: http://repo1.maven.org/maven2/org/codehaus/plexus/plexus/2.0.0/plexus-2.0.0.pom
(8 KB at 15.7 KB/sec)
Downloading: http://repo1.maven.org/maven2/org/apache/xbean/xbean-reflect/3.4/xbean-reflect-3.4.pom
Downloaded: http://repo1.maven.org/maven2/org/apache/xbean/xbean-reflect/3.4/xbean-reflect-3.4.pom
(3 KB at 4.4 KB/sec)
Downloading: http://repo1.maven.org/maven2/org/apache/xbean/xbean/3.4/xbean-3.4.pom
Downloaded: http://repo1.maven.org/maven2/org/apache/xbean/xbean/3.4/xbean-3.4.pom (19 KB
at 64.6 KB/sec)
Downloading: http://repo1.maven.org/maven2/log4j/log4j/1.2.12/log4j-1.2.12.pom
Downloaded: http://repo1.maven.org/maven2/log4j/log4j/1.2.12/log4j-1.2.12.pom (145 B at 0.3
KB/sec)
Downloading: http://repo1.maven.org/maven2/com/google/code/google-collections/google-collect/snapshot-20080530/google-collect-snapshot-20080530.pom
Downloaded: http://repo1.maven.org/maven2/com/google/code/google-collections/google-collect/snapshot-20080530/google-collect-snapshot-20080530.pom
(2 KB at 5.4 KB/sec)
Downloading: http://repo1.maven.org/maven2/org/codehaus/plexus/plexus-component-annotations/1.0-beta-3.0.5/plexus-component-annotations-1.0-beta-3.0.5.pom
Downloaded: http://repo1.maven.org/maven2/org/codehaus/plexus/plexus-component-annotations/1.0-beta-3.0.5/plexus-component-annotations-1.0-beta-3.0.5.pom
(602 B at 1.2 KB/sec)
Downloading: http://repo1.maven.org/maven2/org/codehaus/woodstox/wstx-asl/3.2.6/wstx-asl-3.2.6.pom
Downloaded: http://repo1.maven.org/maven2/org/codehaus/woodstox/wstx-asl/3.2.6/wstx-asl-3.2.6.pom
(2 KB at 3.4 KB/sec)
Downloading: http://repo1.maven.org/maven2/org/sonatype/spice/model-builder/1.3/model-builder-1.3.pom
Downloaded: http://repo1.maven.org/maven2/org/sonatype/spice/model-builder/1.3/model-builder-1.3.pom
(3 KB at 7.2 KB/sec)
Downloading: http://repo1.maven.org/maven2/org/apache/maven/maven-project-builder/3.0-alpha-2/maven-project-builder-3.0-alpha-2.pom
Downloaded: http://repo1.maven.org/maven2/org/apache/maven/maven-project-builder/3.0-alpha-2/maven-project-builder-3.0-alpha-2.pom
(2 KB at 3.7 KB/sec)
Downloading: http://repo1.maven.org/maven2/org/codehaus/plexus/plexus-utils/2.0.6/plexus-utils-2.0.6.jar
Downloading: http://repo1.maven.org/maven2/org/apache/xbean/xbean-reflect/3.4/xbean-reflect-3.4.jar
Downloading: http://repo1.maven.org/maven2/log4j/log4j/1.2.12/log4j-1.2.12.jar
Downloading: http://repo1.maven.org/maven2/com/google/code/google-collections/google-collect/snapshot-20080530/google-collect-snapshot-20080530.jar
Downloading: http://repo1.maven.org/maven2/org/codehaus/woodstox/wstx-asl/3.2.6/wstx-asl-3.2.6.jar
Downloaded: http://repo1.maven.org/maven2/log4j/log4j/1.2.12/log4j-1.2.12.jar (350 KB at 241.5
KB/sec)
Downloading: http://repo1.maven.org/maven2/org/sonatype/spice/model-builder/1.3/model-builder-1.3.jar
Downloaded: http://repo1.maven.org/maven2/org/codehaus/plexus/plexus-utils/2.0.6/plexus-utils-2.0.6.jar
(219 KB at 128.3 KB/sec)
Downloading: http://repo1.maven.org/maven2/org/apache/maven/maven-project-builder/3.0-alpha-2/maven-project-builder-3.0-alpha-2.jar
Downloaded: http://repo1.maven.org/maven2/org/apache/xbean/xbean-reflect/3.4/xbean-reflect-3.4.jar
(131 KB at 66.5 KB/sec)
Downloaded: http://repo1.maven.org/maven2/org/codehaus/woodstox/wstx-asl/3.2.6/wstx-asl-3.2.6.jar
(509 KB at 229.3 KB/sec)
Downloaded: http://repo1.maven.org/maven2/com/google/code/google-collections/google-collect/snapshot-20080530/google-collect-snapshot-20080530.jar
(490 KB at 200.2 KB/sec)
Downloaded: http://repo1.maven.org/maven2/org/sonatype/spice/model-builder/1.3/model-builder-1.3.jar
(35 KB at 19.9 KB/sec)
Downloaded: http://repo1.maven.org/maven2/org/apache/maven/maven-project-builder/3.0-alpha-2/maven-project-builder-3.0-alpha-2.jar
(166 KB at 92.0 KB/sec)
[INFO] 
[INFO] --- maven-remote-resources-plugin:1.2.1:process (default) @ uimaj-parent ---
Downloading: http://repository.apache.org/snapshots/org/apache/uima/uima-build-resources/4-SNAPSHOT/maven-metadata.xml
Downloaded: http://repository.apache.org/snapshots/org/apache/uima/uima-build-resources/4-SNAPSHOT/maven-metadata.xml
(773 B at 0.9 KB/sec)
Downloading: http://repository.apache.org/snapshots/org/apache/uima/uima-build-resources/4-SNAPSHOT/uima-build-resources-4-20120118.190303-1.jar
Downloaded: http://repository.apache.org/snapshots/org/apache/uima/uima-build-resources/4-SNAPSHOT/uima-build-resources-4-20120118.190303-1.jar
(47 KB at 59.2 KB/sec)
[INFO] 
[INFO] --- maven-site-plugin:3.0:attach-descriptor (attach-descriptor) @ uimaj-parent ---
[INFO] [INFO] Installing <https://builds.apache.org/job/UIMA-SDK/ws/trunk/uimaj-parent/pom.xml>
to /export/home/hudson/hudson-slave/maven-repositories/1/org/apache/uima/uimaj-parent/2.4.1-SNAPSHOT/uimaj-parent-2.4.1-SNAPSHOT.pom

[INFO] --- maven-install-plugin:2.3.1:install (default-install) @ uimaj-parent ---
[JENKINS] Archiving <https://builds.apache.org/job/UIMA-SDK/ws/trunk/uimaj-parent/pom.xml>
to /home/hudson/hudson/jobs/UIMA-SDK/modules/org.apache.uima$uimaj-parent/builds/2012-03-15_15-13-59/archive/org.apache.uima/uimaj-parent/2.4.1-SNAPSHOT/uimaj-parent-2.4.1-SNAPSHOT.pom
[INFO]                                                                         
[INFO] ------------------------------------------------------------------------
[INFO] Building Apache UIMA Base: uimaj-test-util: JUnit utilities 2.4.1-SNAPSHOT
[INFO] ------------------------------------------------------------------------
[INFO] 
[INFO] --- maven-clean-plugin:2.4.1:clean (default-clean) @ uimaj-test-util ---
[INFO] 
[INFO] --- build-helper-maven-plugin:1.5:parse-version (parse-project-version) @ uimaj-test-util
---
[INFO] 
[INFO] --- uima-build-helper-maven-plugin:3-SNAPSHOT:parse-date-time (set buildYear and buildMonth)
@ uimaj-test-util ---
[INFO] 
[INFO] --- maven-remote-resources-plugin:1.2.1:process (default) @ uimaj-test-util ---
[INFO] 
[INFO] --- maven-resources-plugin:2.5:resources (default-resources) @ uimaj-test-util ---[debug]
execute contextualize
[INFO] Using 'UTF-8' encoding to copy filtered resources.
[INFO] Copying 0 resource
[INFO] Copying 3 resources

[INFO] 
[INFO] --- maven-compiler-plugin:2.3.2:compile (default-compile) @ uimaj-test-util ---
[INFO] Compiling 7 source files to <https://builds.apache.org/job/UIMA-SDK/ws/trunk/uimaj-test-util/target/classes>
[INFO] [debug] execute contextualize

[INFO] Using 'UTF-8' encoding to copy filtered resources.
[INFO] skip non existing resourceDirectory <https://builds.apache.org/job/UIMA-SDK/ws/trunk/uimaj-test-util/src/test/resources>
[INFO] Copying 3 resources
[INFO] --- maven-resources-plugin:2.5:testResources (default-testResources) @ uimaj-test-util
---
[INFO] 
[INFO] --- maven-compiler-plugin:2.3.2:testCompile (default-testCompile) @ uimaj-test-util
---[INFO] Nothing to compile - all classes are up to date

[INFO] 
[INFO] --- maven-surefire-plugin:2.9:test (default-test) @ uimaj-test-util ---
[INFO] Surefire report directory: <https://builds.apache.org/job/UIMA-SDK/ws/trunk/uimaj-test-util/target/surefire-reports>

-------------------------------------------------------
 T E S T S
-------------------------------------------------------

Results :

Tests run: 0, Failures: 0, Errors: 0, Skipped: 0

[JENKINS] Recording test results
[INFO] 
[INFO] --- maven-jar-plugin:2.3.1:jar (default-jar) @ uimaj-test-util ---
[INFO] Building jar: <https://builds.apache.org/job/UIMA-SDK/ws/trunk/uimaj-test-util/target/uimaj-test-util-2.4.1-SNAPSHOT.jar>
[INFO] 
[INFO] --- maven-site-plugin:3.0:attach-descriptor (attach-descriptor) @ uimaj-test-util ---
[INFO] 
[INFO] --- maven-install-plugin:2.3.1:install (default-install) @ uimaj-test-util ---[INFO]
Installing <https://builds.apache.org/job/UIMA-SDK/ws/trunk/uimaj-test-util/target/uimaj-test-util-2.4.1-SNAPSHOT.jar>
to /export/home/hudson/hudson-slave/maven-repositories/1/org/apache/uima/uimaj-test-util/2.4.1-SNAPSHOT/uimaj-test-util-2.4.1-SNAPSHOT.jar
[INFO] Installing <https://builds.apache.org/job/UIMA-SDK/ws/trunk/uimaj-test-util/pom.xml>
to /export/home/hudson/hudson-slave/maven-repositories/1/org/apache/uima/uimaj-test-util/2.4.1-SNAPSHOT/uimaj-test-util-2.4.1-SNAPSHOT.pom

[JENKINS] Archiving <https://builds.apache.org/job/UIMA-SDK/ws/trunk/uimaj-test-util/pom.xml>
to /home/hudson/hudson/jobs/UIMA-SDK/modules/org.apache.uima$uimaj-test-util/builds/2012-03-15_15-14-02/archive/org.apache.uima/uimaj-test-util/2.4.1-SNAPSHOT/uimaj-test-util-2.4.1-SNAPSHOT.pom
[JENKINS] Archiving <https://builds.apache.org/job/UIMA-SDK/ws/trunk/uimaj-test-util/target/uimaj-test-util-2.4.1-SNAPSHOT.jar>
to /home/hudson/hudson/jobs/UIMA-SDK/modules/org.apache.uima$uimaj-test-util/builds/2012-03-15_15-14-02/archive/org.apache.uima/uimaj-test-util/2.4.1-SNAPSHOT/uimaj-test-util-2.4.1-SNAPSHOT.jar
[INFO]                                                                         
[INFO] ------------------------------------------------------------------------
[INFO] Building UIMA Base: uimaj-core 2.4.1-SNAPSHOT
[INFO] ------------------------------------------------------------------------
[INFO] 
[INFO] --- maven-clean-plugin:2.4.1:clean (default-clean) @ uimaj-core ---
[INFO] 
[INFO] --- build-helper-maven-plugin:1.5:parse-version (parse-project-version) @ uimaj-core
---
[INFO] 
[INFO] --- uima-build-helper-maven-plugin:3-SNAPSHOT:parse-date-time (set buildYear and buildMonth)
@ uimaj-core ---
[INFO] 
[INFO] --- maven-resources-plugin:2.5:copy-resources (setVersions) @ uimaj-core ---[debug]
execute contextualize
[INFO] Using 'UTF-8' encoding to copy filtered resources.

[INFO] Copying 1 resource
[INFO] 
[INFO] --- build-helper-maven-plugin:1.5:add-source (addVersionSrc) @ uimaj-core ---[INFO]
Source directory: <https://builds.apache.org/job/UIMA-SDK/ws/trunk/uimaj-core/target/generated-sources/releaseVersion>
added.

[INFO] 
[INFO] --- maven-remote-resources-plugin:1.2.1:process (default) @ uimaj-core ---
[INFO] 
[INFO] --- maven-resources-plugin:2.5:resources (default-resources) @ uimaj-core ---[debug]
execute contextualize
[INFO] Using 'UTF-8' encoding to copy filtered resources.

[INFO] Copying 15 resources
[INFO] Copying 3 resources
[INFO] 
[INFO] --- maven-compiler-plugin:2.3.2:compile (default-compile) @ uimaj-core ---
[INFO] Compiling 680 source files to <https://builds.apache.org/job/UIMA-SDK/ws/trunk/uimaj-core/target/classes>
[INFO] -------------------------------------------------------------
[ERROR] COMPILATION ERROR : 
[INFO] -------------------------------------------------------------
[ERROR] <https://builds.apache.org/job/UIMA-SDK/ws/trunk/uimaj-core/src/main/java/org/apache/uima/resource/metadata/impl/ExternalOverrideSettings_impl.java>:[195,19]
load(java.io.InputStream) in java.util.Properties cannot be applied to (java.io.FileReader)
[ERROR] <https://builds.apache.org/job/UIMA-SDK/ws/trunk/uimaj-core/src/main/java/org/apache/uima/resource/metadata/impl/ExternalOverrideSettings_impl.java>:[211,15]
load(java.io.InputStream) in java.util.Properties cannot be applied to (java.io.StringReader)
[INFO] 2 errors 
[INFO] -------------------------------------------------------------
[JENKINS] Archiving <https://builds.apache.org/job/UIMA-SDK/ws/trunk/uimaj-core/pom.xml>
to /home/hudson/hudson/jobs/UIMA-SDK/modules/org.apache.uima$uimaj-core/builds/2012-03-15_15-14-00/archive/org.apache.uima/uimaj-core/2.4.1-SNAPSHOT/uimaj-core-2.4.1-SNAPSHOT.pom
[INFO] ------------------------------------------------------------------------
[INFO] Reactor Summary:
[INFO] 
[INFO] Apache UIMA Java SDK: uimaj-parent ................ SUCCESS [2:54.906s]
[INFO] Apache UIMA Base: uimaj-test-util: JUnit utilities  SUCCESS [30.699s]
[INFO] UIMA Base: uimaj-core ............................. FAILURE [19.897s]
[INFO] Apache UIMA Base: jVinci: Vinci Transport Library . SKIPPED
[INFO] Apache UIMA Base: uimaj-adapter-vinci: Vinci Adapter  SKIPPED
[INFO] Apache UIMA Base: uimaj-cpe: Collection Processing Engine  SKIPPED
[INFO] Apache UIMA Base: uimaj-document-annotation ....... SKIPPED
[INFO] Apache UIMA Base: uimaj-tools: Tools .............. SKIPPED
[INFO] Apache UIMA Base: uimaj-examples: SDK Examples .... SKIPPED
[INFO] Apache UIMA Base: uimaj-adapter-soap: SOAP Adapter  SKIPPED
[INFO] Apache UIMA Base: uimaj-component-test-util: for JUnit  SKIPPED
[INFO] Apache UIMA Eclipse: uimaj-ep-debug ............... SKIPPED
[INFO] Apache UIMA Eclipse: uimaj-ep-jcasgen ............. SKIPPED
[INFO] Apache UIMA Eclipse: uimaj-ep-configurator: Descriptor Editor  SKIPPED
[INFO] Apache UIMA Eclipse: uimaj-ep-pear-packager ....... SKIPPED
[INFO] Apache UIMA Eclipse: uimaj-ep-launcher ............ SKIPPED
[INFO] Apache UIMA Eclipse: uimaj-ep-cas-editor .......... SKIPPED
[INFO] Apache UIMA Eclipse: uimaj-ep-cas-editor-ide ...... SKIPPED
[INFO] Apache UIMA Eclipse: uimaj-ep-runtime ............. SKIPPED
[INFO] Apache UIMA Eclipse: uimaj-eclipse-feature-tools .. SKIPPED
[INFO] Apache UIMA Eclipse: uimaj-eclipse-feature-runtime  SKIPPED
[INFO] Apache UIMA Aggregate: aggregate-uimaj-eclipse-plugins  SKIPPED
[INFO] Apache UIMA SDK Documentation - overview and setup  SKIPPED
[INFO] Apache UIMA SDK Documentation - references ........ SKIPPED
[INFO] Apache UIMA SDK Documentation - tools ............. SKIPPED
[INFO] Apache UIMA SDK Documentation - tutorials and user's guides  SKIPPED
[INFO] Apache UIMA Aggregate POM aggregate-uimaj-docbooks: UIMA Base  SKIPPED
[INFO] Apache UIMA Maven Plugin PearPackagingMavenPlugin . SKIPPED
[INFO] Apache UIMA Base: uimaj-bootstrap: Bootstrap launcher  SKIPPED
[INFO] Apache UIMA Aggregate: aggregate-uimaj: UIMA Base . SKIPPED
[INFO] Apache UIMA Java SDK: uimaj ....................... SKIPPED
[INFO] ------------------------------------------------------------------------
[INFO] BUILD FAILURE
[INFO] ------------------------------------------------------------------------
[INFO] Total time: 4:50.752s
[INFO] Finished at: Thu Mar 15 15:20:17 GMT+00:00 2012
[INFO] Final Memory: 18M/112M
[INFO] ------------------------------------------------------------------------
mavenExecutionResult exceptions not empty
message : Failed to execute goal org.apache.maven.plugins:maven-compiler-plugin:2.3.2:compile
(default-compile) on project uimaj-core: Compilation failure
cause : Compilation failure
Stack trace : 
org.apache.maven.lifecycle.LifecycleExecutionException: Failed to execute goal org.apache.maven.plugins:maven-compiler-plugin:2.3.2:compile
(default-compile) on project uimaj-core: Compilation failure
	at org.apache.maven.lifecycle.internal.MojoExecutor.execute(MojoExecutor.java:213)
	at org.apache.maven.lifecycle.internal.MojoExecutor.execute(MojoExecutor.java:153)
	at org.apache.maven.lifecycle.internal.MojoExecutor.execute(MojoExecutor.java:145)
	at org.apache.maven.lifecycle.internal.LifecycleModuleBuilder.buildProject(LifecycleModuleBuilder.java:84)
	at org.apache.maven.lifecycle.internal.LifecycleModuleBuilder.buildProject(LifecycleModuleBuilder.java:59)
	at org.apache.maven.lifecycle.internal.LifecycleStarter.singleThreadedBuild(LifecycleStarter.java:183)
	at org.apache.maven.lifecycle.internal.LifecycleStarter.execute(LifecycleStarter.java:161)
	at org.apache.maven.DefaultMaven.doExecute(DefaultMaven.java:319)
	at org.apache.maven.DefaultMaven.execute(DefaultMaven.java:156)
	at org.jvnet.hudson.maven3.launcher.Maven3Launcher.main(Maven3Launcher.java:79)
	at sun.reflect.NativeMethodAccessorImpl.invoke0(Native Method)
	at sun.reflect.NativeMethodAccessorImpl.invoke(NativeMethodAccessorImpl.java:39)
	at sun.reflect.DelegatingMethodAccessorImpl.invoke(DelegatingMethodAccessorImpl.java:25)
	at java.lang.reflect.Method.invoke(Method.java:592)
	at org.codehaus.plexus.classworlds.launcher.Launcher.launchStandard(Launcher.java:329)
	at org.codehaus.plexus.classworlds.launcher.Launcher.launch(Launcher.java:239)
	at org.jvnet.hudson.maven3.agent.Maven3Main.launch(Maven3Main.java:158)
	at hudson.maven.Maven3Builder.call(Maven3Builder.java:104)
	at hudson.maven.Maven3Builder.call(Maven3Builder.java:70)
	at hudson.remoting.UserRequest.perform(UserRequest.java:118)
	at hudson.remoting.UserRequest.perform(UserRequest.java:48)
	at hudson.remoting.Request$2.run(Request.java:287)
	at hudson.remoting.InterceptingExecutorService$1.call(InterceptingExecutorService.java:72)
	at java.util.concurrent.FutureTask$Sync.innerRun(FutureTask.java:269)
	at java.util.concurrent.FutureTask.run(FutureTask.java:123)
	at java.util.concurrent.ThreadPoolExecutor$Worker.runTask(ThreadPoolExecutor.java:651)
	at java.util.concurrent.ThreadPoolExecutor$Worker.run(ThreadPoolExecutor.java:676)
	at java.lang.Thread.run(Thread.java:595)
Caused by: org.apache.maven.plugin.CompilationFailureException: Compilation failure
	at org.apache.maven.plugin.AbstractCompilerMojo.execute(AbstractCompilerMojo.java:656)
	at org.apache.maven.plugin.CompilerMojo.execute(CompilerMojo.java:128)
	at org.apache.maven.plugin.DefaultBuildPluginManager.executeMojo(DefaultBuildPluginManager.java:101)
	at org.apache.maven.lifecycle.internal.MojoExecutor.execute(MojoExecutor.java:209)
	... 27 more
channel stopped

Mime
View raw message