uima-dev mailing list archives

Site index · List index
Message view « Date » · « Thread »
Top « Date » · « Thread »
From Apache Jenkins Server <jenk...@builds.apache.org>
Subject Build failed in Jenkins: UIMA-SDK #232
Date Wed, 20 Jun 2012 20:51:11 GMT
See <https://builds.apache.org/job/UIMA-SDK/232/>

------------------------------------------
[...truncated 3753 lines...]
Running org.apache.uima.analysis_engine.impl.ResultSpecification_implTest
Tests run: 19, Failures: 0, Errors: 0, Skipped: 0, Time elapsed: 0.013 sec
Running org.apache.uima.analysis_engine.impl.AnnotatorForCollectionProcessCompleteTest
Tests run: 0, Failures: 0, Errors: 0, Skipped: 0, Time elapsed: 0 sec
Running org.apache.uima.analysis_engine.impl.ResultSpecTest
Tests run: 3, Failures: 0, Errors: 0, Skipped: 0, Time elapsed: 0.02 sec
Running org.apache.uima.analysis_engine.impl.TestAnnotator2
Tests run: 0, Failures: 0, Errors: 0, Skipped: 0, Time elapsed: 0 sec
Running org.apache.uima.analysis_engine.impl.AnalysisEngineDescription_implTest
Tests run: 8, Failures: 0, Errors: 0, Skipped: 0, Time elapsed: 1.034 sec
Running org.apache.uima.analysis_engine.impl.FlowControllerForErrorTest
Tests run: 0, Failures: 0, Errors: 0, Skipped: 0, Time elapsed: 0.001 sec
Running org.apache.uima.jcas.test.JCasTest

Caught CAS Exception with message: The JCas cannot be initialized.  The following errors occurred:
The JCAS range type uima.cas.String for feature changedFType of type aa.MissingFeatureInCas
does not match the CAS range type uima.cas.Float for the feature.

This error msg expected: org.apache.uima.cas.CASException: Type information from the CAS cannot
be accessed while initializing the JCas type missing.type
This error msg expected: org.apache.uima.cas.CASException: Feature information from the CAS
cannot be accessed while initializing the JCAS type uima.tcas.Annotation with feature Begin.
Expected Error: JCas getNthElement method called via invalid object - an empty list: EmptyFSList.
Expected Error: JCas getNthElement method called with index "-1" which is negative.
Expected Error: JCas getNthElement method called with index "2" larger than the length of
the list.
Expected Error: JCas getNthElement method called via invalid object - an empty list: EmptyIntegerList.
Expected Error: JCas getNthElement method called with index "-1" which is negative.
Expected Error: JCas getNthElement method called with index "2" larger than the length of
the list.
Expected Error: JCas getNthElement method called via invalid object - an empty list: EmptyFloatList.
Expected Error: JCas getNthElement method called with index "-1" which is negative.
Expected Error: JCas getNthElement method called with index "2" larger than the length of
the list.
Expected Error: JCas getNthElement method called via invalid object - an empty list: EmptyStringList.
Expected Error: JCas getNthElement method called with index "-1" which is negative.
Expected Error: JCas getNthElement method called with index "2" larger than the length of
the list.
Tests run: 18, Failures: 0, Errors: 0, Skipped: 0, Time elapsed: 0.512 sec
Running org.apache.uima.impl.CollectionReaderFactory_implTest
Tests run: 1, Failures: 0, Errors: 0, Skipped: 0, Time elapsed: 0 sec
Running org.apache.uima.impl.CasConsumerFactory_implTest
Tests run: 1, Failures: 0, Errors: 0, Skipped: 0, Time elapsed: 0 sec
Running org.apache.uima.impl.AnalysisEngineFactory_implTest
Tests run: 1, Failures: 0, Errors: 0, Skipped: 0, Time elapsed: 0.001 sec
Running org.apache.uima.impl.UimaContext_implTest
Jun 20, 2012 8:47:20 PM org.apache.uima.impl.RootUimaContext_impl getResourceURL
WARNING: The unmanaged resource org/apache/uima/analysis_engine/impl/testDataFile3.dat was
accessed.This feature is deprecated, and support may be removed in future versions.
Jun 20, 2012 8:47:20 PM org.apache.uima.impl.RootUimaContext_impl getResourceURL
WARNING: The unmanaged resource testDataFile.dat was accessed.This feature is deprecated,
and support may be removed in future versions.
Jun 20, 2012 8:47:20 PM org.apache.uima.impl.RootUimaContext_impl getResourceURL
WARNING: The unmanaged resource subdir was accessed.This feature is deprecated, and support
may be removed in future versions.
Jun 20, 2012 8:47:20 PM org.apache.uima.impl.RootUimaContext_impl getResourceURL
WARNING: The unmanaged resource org/apache/uima/analysis_engine/impl/testDataFile3.dat was
accessed.This feature is deprecated, and support may be removed in future versions.
Jun 20, 2012 8:47:20 PM org.apache.uima.impl.RootUimaContext_impl getResourceURL
WARNING: The unmanaged resource testDataFile.dat was accessed.This feature is deprecated,
and support may be removed in future versions.
Jun 20, 2012 8:47:20 PM org.apache.uima.impl.RootUimaContext_impl getResourceURL
WARNING: The unmanaged resource subdir was accessed.This feature is deprecated, and support
may be removed in future versions.
Jun 20, 2012 8:47:20 PM org.apache.uima.impl.RootUimaContext_impl getResourceURL
WARNING: The unmanaged resource org/apache/uima/analysis_engine/impl/testDataFile3.dat was
accessed.This feature is deprecated, and support may be removed in future versions.
Jun 20, 2012 8:47:20 PM org.apache.uima.impl.RootUimaContext_impl getResourceURL
WARNING: The unmanaged resource testDataFile.dat was accessed.This feature is deprecated,
and support may be removed in future versions.
Jun 20, 2012 8:47:20 PM org.apache.uima.impl.RootUimaContext_impl getResourceURL
WARNING: The unmanaged resource subdir was accessed.This feature is deprecated, and support
may be removed in future versions.
Jun 20, 2012 8:47:20 PM org.apache.uima.impl.RootUimaContext_impl getResourceAsStream
WARNING: The unmanaged resource org/apache/uima/analysis_engine/impl/testDataFile3.dat was
accessed.This feature is deprecated, and support may be removed in future versions.
Jun 20, 2012 8:47:20 PM org.apache.uima.impl.RootUimaContext_impl getResourceAsStream
WARNING: The unmanaged resource testDataFile.dat was accessed.This feature is deprecated,
and support may be removed in future versions.
Jun 20, 2012 8:47:20 PM org.apache.uima.impl.RootUimaContext_impl getResourceAsStream
WARNING: The unmanaged resource subdir was accessed.This feature is deprecated, and support
may be removed in future versions.
Tests run: 17, Failures: 0, Errors: 0, Skipped: 0, Time elapsed: 0.732 sec
Running org.apache.uima.impl.CustomResourceSpecifierFactory_implTest
Tests run: 1, Failures: 0, Errors: 0, Skipped: 0, Time elapsed: 0.001 sec
Running org.apache.uima.cas_data.impl.CasDataToXCasTest
Tests run: 1, Failures: 0, Errors: 0, Skipped: 0, Time elapsed: 0.003 sec
Running org.apache.uima.cas_data.impl.XCasToCasDataSaxHandlerTest
Tests run: 2, Failures: 0, Errors: 0, Skipped: 0, Time elapsed: 0.326 sec
Running org.apache.uima.collection.impl.CasConsumerDescription_implTest
Tests run: 2, Failures: 0, Errors: 0, Skipped: 0, Time elapsed: 0.013 sec
Running org.apache.uima.collection.impl.CollectionReaderDescription_implTest
Tests run: 2, Failures: 0, Errors: 0, Skipped: 0, Time elapsed: 0.012 sec
Running org.apache.uima.collection.impl.CasInitializerDescription_implTest
Tests run: 2, Failures: 0, Errors: 0, Skipped: 0, Time elapsed: 0.012 sec
Running org.apache.uima.resource.ConfigurableResource_implTest
Tests run: 2, Failures: 0, Errors: 0, Skipped: 0, Time elapsed: 0.016 sec
Running org.apache.uima.resource.service.impl.ResourceServiceAdapter_implTest
Tests run: 1, Failures: 0, Errors: 0, Skipped: 0, Time elapsed: 0 sec
Running org.apache.uima.resource.service.impl.TestResourceServiceStub
Tests run: 0, Failures: 0, Errors: 0, Skipped: 0, Time elapsed: 0.001 sec
Running org.apache.uima.resource.service.impl.ResourceService_implTest
Tests run: 1, Failures: 0, Errors: 0, Skipped: 0, Time elapsed: 0 sec
Running org.apache.uima.resource.metadata.impl.TestFruitBagObject
Tests run: 0, Failures: 0, Errors: 0, Skipped: 0, Time elapsed: 0 sec
Running org.apache.uima.resource.metadata.impl.Import_implTest
Tests run: 3, Failures: 0, Errors: 0, Skipped: 0, Time elapsed: 0.027 sec
Running org.apache.uima.resource.metadata.impl.ConfigurationParameterDeclarations_implTest
Tests run: 1, Failures: 0, Errors: 0, Skipped: 0, Time elapsed: 0.005 sec
Running org.apache.uima.resource.metadata.impl.TestFruitObject
Tests run: 0, Failures: 0, Errors: 0, Skipped: 0, Time elapsed: 0 sec
Running org.apache.uima.resource.metadata.impl.FsIndexCollection_implTest
Tests run: 2, Failures: 0, Errors: 0, Skipped: 0, Time elapsed: 0.028 sec
Running org.apache.uima.resource.metadata.impl.TypePriorities_implTest
Tests run: 3, Failures: 0, Errors: 0, Skipped: 0, Time elapsed: 0.048 sec
Running org.apache.uima.resource.metadata.impl.TypeSystemDescription_implTest
Tests run: 3, Failures: 0, Errors: 0, Skipped: 0, Time elapsed: 0.09 sec
Running org.apache.uima.resource.metadata.impl.ResourceManagerConfiguration_implTest
Tests run: 3, Failures: 0, Errors: 0, Skipped: 0, Time elapsed: 0.046 sec
Running org.apache.uima.resource.metadata.impl.MetaDataObject_implTest
Tests run: 5, Failures: 0, Errors: 0, Skipped: 0, Time elapsed: 0.013 sec
Running org.apache.uima.resource.TestCasConsumer
Tests run: 0, Failures: 0, Errors: 0, Skipped: 0, Time elapsed: 0 sec
Running org.apache.uima.resource.impl.ConfigurableDataResource_implTest
Tests run: 1, Failures: 0, Errors: 0, Skipped: 0, Time elapsed: 0.001 sec
Running org.apache.uima.resource.impl.PearSpecifier_implTest
Tests run: 2, Failures: 0, Errors: 0, Skipped: 0, Time elapsed: 0.005 sec
Running org.apache.uima.resource.impl.ConfigurableDataResourceSpecifier_implTest
Tests run: 1, Failures: 0, Errors: 0, Skipped: 0, Time elapsed: 0.006 sec
Running org.apache.uima.resource.impl.FileLanguageResource_implTest
Tests run: 1, Failures: 0, Errors: 0, Skipped: 0, Time elapsed: 0 sec
Running org.apache.uima.resource.impl.ResourceManager_implTest
Jun 20, 2012 8:47:21 PM org.apache.uima.resource.impl.ResourceManager_impl initializeExternalResources
WARNING: The external resource named MyFileLanguageResource has been declared multiple times
with different definitions. The definition of the resource in component /Annotator1/ will
be used.  The definition in component /Annotator2/ will be ignored.
Tests run: 4, Failures: 0, Errors: 0, Skipped: 0, Time elapsed: 0.025 sec
Running org.apache.uima.resource.impl.URISpecifier_implTest
Tests run: 1, Failures: 0, Errors: 0, Skipped: 0, Time elapsed: 0 sec
Running org.apache.uima.resource.impl.RelativePathResolver_implTest
Tests run: 2, Failures: 0, Errors: 0, Skipped: 0, Time elapsed: 0 sec
Running org.apache.uima.resource.impl.TestResourceInterface_impl
Tests run: 0, Failures: 0, Errors: 0, Skipped: 0, Time elapsed: 0 sec
Running org.apache.uima.resource.impl.CasManager_implTest
Tests run: 1, Failures: 0, Errors: 0, Skipped: 0, Time elapsed: 0.002 sec
Running org.apache.uima.resource.impl.ResourceCreationSpecifier_implTest
Tests run: 1, Failures: 0, Errors: 0, Skipped: 0, Time elapsed: 0.012 sec
Running org.apache.uima.resource.impl.DataResource_implTest
Tests run: 2, Failures: 0, Errors: 0, Skipped: 0, Time elapsed: 0 sec
Running org.apache.uima.util.CasCopierTest
Tests run: 5, Failures: 0, Errors: 0, Skipped: 0, Time elapsed: 0.357 sec
Running org.apache.uima.util.TestCollectionReader
Tests run: 0, Failures: 0, Errors: 0, Skipped: 0, Time elapsed: 0 sec
Running org.apache.uima.util.impl.ProcessTrace_implTest
Tests run: 6, Failures: 0, Errors: 0, Skipped: 0, Time elapsed: 0 sec
Running org.apache.uima.util.impl.Logger_implTest
Tests run: 2, Failures: 0, Errors: 0, Skipped: 0, Time elapsed: 0 sec
Running org.apache.uima.util.impl.TestLog4jLogger_impl
0 [main] INFO org.apache.uima.util.impl.TestLog4jLogger_impl  - ola
1 [main] INFO org.apache.uima.util.impl.TestLog4jLogger_impl  - OLA in info
1 [main] INFO org.apache.uima  - UIMA OLA in info
2 [main] INFO org.apache.uima  - My first test message
3 [main] INFO org.apache.uima  - My second test message
3 [main] INFO org.apache.uima  - My java.lang.Object@12aec21 test message
3 [main] INFO org.apache.uima  - My  test message
3 [main] INFO org.apache.uima  - My null test message
3 [main] INFO org.apache.uima  - My third test message
4 [main] INFO org.apache.uima  - My {0} test message
4 [main] INFO org.apache.uima  - My  test message
4 [main] INFO org.apache.uima  - My null test message
4 [main] INFO org.apache.uima.util.impl.TestLog4jLogger_impl  - My fifth test message
6 [main] INFO org.apache.uima.util.impl.TestLog4jLogger_impl  - Exception test message
6 [main] INFO org.apache.uima.util.impl.TestLog4jLogger_impl  - Exception test message
6 [main] INFO org.apache.uima.util.impl.TestLog4jLogger_impl  - Exception test message
7 [main] INFO   - Exception test message
7 [main] INFO   - MESSAGE LOCALIZATION FAILED: null
7 [main] INFO testClass  - Exception test message
7 [main] INFO org.apache.uima  - Exception test message
7 [main] INFO org.apache.uima  - Exception test message
7 [main] INFO org.apache.uima  - MESSAGE LOCALIZATION FAILED: null
8 [main] INFO org.apache.uima  - Exception test message
8 [main] INFO org.apache.uima  - Exception test message
8 [main] INFO org.apache.uima  - MESSAGE LOCALIZATION FAILED: null
8 [main] INFO org.apache.uima  - Exception test message
Jun 20, 2012 8:47:22 PM org.apache.uima.util.impl.TestLog4jLogger_impl testLoggerFromUIMAFramework(308)
INFO: ------------------------------------------------------------
Jun 20, 2012 8:47:22 PM org.apache.uima.util.impl.TestLog4jLogger_impl testLoggerFromUIMAFramework(310)
INFO: My first test message
Tests run: 5, Failures: 0, Errors: 0, Skipped: 0, Time elapsed: 0.033 sec
Running org.apache.uima.util.impl.LoggingTest
Jun 20, 2012 8:47:22 PM org.apache.uima.util.impl.LoggingTest testDefaultLoggerCreation(58)
SEVERE: Log test messege with Level SEVERE
Jun 20, 2012 8:47:22 PM org.apache.uima.util.impl.LoggingTest testClassLoggerCreation(83)
SEVERE: Log test messege with Level SEVERE
Tests run: 3, Failures: 0, Errors: 0, Skipped: 0, Time elapsed: 0.001 sec
Running org.apache.uima.util.impl.XMLParser_implTest
Tests run: 7, Failures: 0, Errors: 0, Skipped: 0, Time elapsed: 0.061 sec
Running org.apache.uima.util.impl.JSR47Logger_implTest
Jun 20, 2012 8:47:22 PM org.apache.uima.util.impl.JSR47Logger_implTest testMessageLogMethods(174)
INFO: My first test message
Jun 20, 2012 8:47:22 PM org.apache.uima.util.impl.JSR47Logger_implTest testMessageLogMethods(180)
INFO: My second test message
Jun 20, 2012 8:47:22 PM org.apache.uima.util.impl.JSR47Logger_implTest testMessageLogMethods(181)
INFO: My java.lang.Object@13abee1 test message
Jun 20, 2012 8:47:22 PM org.apache.uima.util.impl.JSR47Logger_implTest testMessageLogMethods(182)
INFO: My  test message
Jun 20, 2012 8:47:22 PM org.apache.uima.util.impl.JSR47Logger_implTest testMessageLogMethods(183)
INFO: My null test message
Jun 20, 2012 8:47:22 PM org.apache.uima.util.impl.JSR47Logger_implTest testMessageLogMethods(188)
INFO: My third test message
Jun 20, 2012 8:47:22 PM org.apache.uima.util.impl.JSR47Logger_implTest testMessageLogMethods(189)
INFO: My {0} test message
Jun 20, 2012 8:47:22 PM org.apache.uima.util.impl.JSR47Logger_implTest testMessageLogMethods(192)
INFO: My  test message
Jun 20, 2012 8:47:22 PM org.apache.uima.util.impl.JSR47Logger_implTest testMessageLogMethods(193)
INFO: My null test message
Jun 20, 2012 8:47:22 PM org.apache.uima.util.impl.JSR47Logger_implTest testMessageKeyLogMethods(231)
INFO: Exception test message
Jun 20, 2012 8:47:22 PM org.apache.uima.util.impl.JSR47Logger_implTest testMessageKeyLogMethods(233)
INFO: Exception test message
Jun 20, 2012 8:47:22 PM org.apache.uima.util.impl.JSR47Logger_implTest testMessageKeyLogMethods(234)
INFO: Exception test message
Jun 20, 2012 8:47:22 PM org.apache.uima
INFO: Exception test message
Jun 20, 2012 8:47:22 PM org.apache.uima
INFO: MESSAGE LOCALIZATION FAILED: null
Jun 20, 2012 8:47:22 PM testClass testMethod
INFO: Exception test message
Jun 20, 2012 8:47:22 PM org.apache.uima
INFO: Exception test message
Jun 20, 2012 8:47:22 PM org.apache.uima
INFO: Exception test message
Jun 20, 2012 8:47:22 PM org.apache.uima
INFO: MESSAGE LOCALIZATION FAILED: null
Jun 20, 2012 8:47:22 PM testClass testMethod
INFO: Exception test message
Jun 20, 2012 8:47:22 PM org.apache.uima
INFO: Exception test message
Jun 20, 2012 8:47:22 PM org.apache.uima
INFO: MESSAGE LOCALIZATION FAILED: null
Jun 20, 2012 8:47:22 PM testClass testMethod
INFO: Exception test message
Tests run: 4, Failures: 0, Errors: 0, Skipped: 0, Time elapsed: 0.005 sec
Running org.apache.uima.util.CasCreationUtilsTest
Tests run: 12, Failures: 0, Errors: 0, Skipped: 0, Time elapsed: 0.393 sec
Running org.apache.uima.util.TypeSystemUtilTest
Tests run: 1, Failures: 0, Errors: 0, Skipped: 0, Time elapsed: 0.028 sec
Running org.apache.uima.util.LevelTest
Tests run: 11, Failures: 0, Errors: 0, Skipped: 0, Time elapsed: 0.001 sec
Running org.apache.uima.util.FileUtilsTest
Tests run: 2, Failures: 0, Errors: 0, Skipped: 0, Time elapsed: 0.001 sec
Running org.apache.uima.util.XMLSerializerTest
Tests run: 2, Failures: 0, Errors: 0, Skipped: 0, Time elapsed: 0.001 sec
Running org.apache.uima.util.CasToInlineXmlTest
<?xml version="1.0" encoding="UTF-8"?>
<Document><uima.tcas.DocumentAnnotation sofa="Sofa" begin="0" end="17" language="x-unspecified"><org.apache.uima.testTypeSystem_arrays.OfShorts
sofa="Sofa" begin="0" end="0" f1Shorts="[0,1,2]"></org.apache.uima.testTypeSystem_arrays.OfShorts><org.apache.uima.testTypeSystem_arrays.OfStrings
sofa="Sofa" begin="0" end="0" f1Strings="[0s,1s,2s]"></org.apache.uima.testTypeSystem_arrays.OfStrings>1
2 3 4 5 6 7 8 9</uima.tcas.DocumentAnnotation>
</Document>

Tests run: 1, Failures: 0, Errors: 0, Skipped: 0, Time elapsed: 0.03 sec

Results :

Failed tests:   testManyDelegates(org.apache.uima.analysis_engine.impl.AnalysisEngine_implTest):
File size changed by 2 should be no more than 1

Tests run: 434, Failures: 1, Errors: 0, Skipped: 0

[ERROR] There are test failures.

Please refer to <https://builds.apache.org/job/UIMA-SDK/ws/trunk/uimaj-core/target/surefire-reports>
for the individual test results.
Build timed out (after 30 minutes). Marking the build as failed.
channel stopped

Mime
View raw message