uima-dev mailing list archives

Site index · List index
Message view « Date » · « Thread »
Top « Date » · « Thread »
From Apache Jenkins Server <jenk...@builds.apache.org>
Subject Build failed in Jenkins: UIMA-SDK #260
Date Wed, 07 Nov 2012 17:58:37 GMT
See <https://builds.apache.org/job/UIMA-SDK/260/changes>

Changes:

[cwiklik] UIMA-2494 Revert back to 2.4.0

------------------------------------------
[...truncated 3353 lines...]
mojoSucceeded org.apache.maven.plugins:maven-compiler-plugin:2.3.2(default-compile)
[debug] execute contextualize
mojoStarted org.apache.maven.plugins:maven-resources-plugin:2.5(default-testResources)[INFO]
Using 'UTF-8' encoding to copy filtered resources.
[INFO] skip non existing resourceDirectory <https://builds.apache.org/job/UIMA-SDK/ws/trunk/uimaj-test-util/src/test/resources>
[INFO] Copying 3 resources

[INFO] 
[INFO] --- maven-resources-plugin:2.5:testResources (default-testResources) @ uimaj-test-util
---
mojoSucceeded org.apache.maven.plugins:maven-resources-plugin:2.5(default-testResources)
mojoStarted org.apache.maven.plugins:maven-compiler-plugin:2.3.2(default-testCompile)[INFO]
Nothing to compile - all classes are up to date

[INFO] 
[INFO] --- maven-compiler-plugin:2.3.2:testCompile (default-testCompile) @ uimaj-test-util
---
mojoSucceeded org.apache.maven.plugins:maven-compiler-plugin:2.3.2(default-testCompile)
mojoStarted org.apache.maven.plugins:maven-surefire-plugin:2.9(default-test)
[INFO] 
[INFO] --- maven-surefire-plugin:2.9:test (default-test) @ uimaj-test-util ---
[INFO] Surefire report directory: <https://builds.apache.org/job/UIMA-SDK/ws/trunk/uimaj-test-util/target/surefire-reports>

-------------------------------------------------------
 T E S T S
-------------------------------------------------------

Results :

Tests run: 0, Failures: 0, Errors: 0, Skipped: 0

mojoSucceeded org.apache.maven.plugins:maven-surefire-plugin:2.9(default-test)
[JENKINS] Recording test results
mojoStarted org.apache.maven.plugins:maven-jar-plugin:2.3.1(default-jar)
[INFO] 
[INFO] --- maven-jar-plugin:2.3.1:jar (default-jar) @ uimaj-test-util ---
[INFO] Building jar: <https://builds.apache.org/job/UIMA-SDK/ws/trunk/uimaj-test-util/target/uimaj-test-util-2.4.1-SNAPSHOT.jar>
mojoSucceeded org.apache.maven.plugins:maven-jar-plugin:2.3.1(default-jar)
mojoStarted org.apache.maven.plugins:maven-site-plugin:3.0(attach-descriptor)
[INFO] 
[INFO] --- maven-site-plugin:3.0:attach-descriptor (attach-descriptor) @ uimaj-test-util ---
mojoSucceeded org.apache.maven.plugins:maven-site-plugin:3.0(attach-descriptor)
mojoStarted org.apache.maven.plugins:maven-install-plugin:2.3.1(default-install)[INFO] Installing
<https://builds.apache.org/job/UIMA-SDK/ws/trunk/uimaj-test-util/target/uimaj-test-util-2.4.1-SNAPSHOT.jar>
to /home/jenkins/jenkins-slave/maven-repositories/0/org/apache/uima/uimaj-test-util/2.4.1-SNAPSHOT/uimaj-test-util-2.4.1-SNAPSHOT.jar

[INFO] 
[INFO] --- maven-install-plugin:2.3.1:install (default-install) @ uimaj-test-util ---
[INFO] Installing <https://builds.apache.org/job/UIMA-SDK/ws/trunk/uimaj-test-util/pom.xml>
to /home/jenkins/jenkins-slave/maven-repositories/0/org/apache/uima/uimaj-test-util/2.4.1-SNAPSHOT/uimaj-test-util-2.4.1-SNAPSHOT.pom
mojoSucceeded org.apache.maven.plugins:maven-install-plugin:2.3.1(default-install)
projectSucceeded org.apache.uima:uimaj-test-util:2.4.1-SNAPSHOT
projectStarted org.apache.uima:uimaj-core:2.4.1-SNAPSHOT
[INFO]                                                                         
[INFO] ------------------------------------------------------------------------
[INFO] Building UIMA Base: uimaj-core 2.4.1-SNAPSHOT
[INFO] ------------------------------------------------------------------------
mojoStarted org.apache.maven.plugins:maven-clean-plugin:2.4.1(default-clean)
[INFO] 
[INFO] --- maven-clean-plugin:2.4.1:clean (default-clean) @ uimaj-core ---
mojoSucceeded org.apache.maven.plugins:maven-clean-plugin:2.4.1(default-clean)
mojoStarted org.codehaus.mojo:build-helper-maven-plugin:1.5(parse-project-version)
[INFO] 
[INFO] --- build-helper-maven-plugin:1.5:parse-version (parse-project-version) @ uimaj-core
---
mojoSucceeded org.codehaus.mojo:build-helper-maven-plugin:1.5(parse-project-version)
mojoStarted org.apache.uima:uima-build-helper-maven-plugin:4(set buildYear and buildMonth)
[INFO] 
[INFO] --- uima-build-helper-maven-plugin:4:parse-date-time (set buildYear and buildMonth)
@ uimaj-core ---
mojoSucceeded org.apache.uima:uima-build-helper-maven-plugin:4(set buildYear and buildMonth)
mojoStarted org.apache.maven.plugins:maven-resources-plugin:2.5(setVersions)[debug] execute
contextualize
[INFO] Using 'UTF-8' encoding to copy filtered resources.
[INFO] Copying 1 resource

[INFO] 
[INFO] --- maven-resources-plugin:2.5:copy-resources (setVersions) @ uimaj-core ---
mojoSucceeded org.apache.maven.plugins:maven-resources-plugin:2.5(setVersions)
mojoStarted org.codehaus.mojo:build-helper-maven-plugin:1.5(addVersionSrc)[INFO] Source directory:
<https://builds.apache.org/job/UIMA-SDK/ws/trunk/uimaj-core/target/generated-sources/releaseVersion>
added.

[INFO] 
[INFO] --- build-helper-maven-plugin:1.5:add-source (addVersionSrc) @ uimaj-core ---
mojoSucceeded org.codehaus.mojo:build-helper-maven-plugin:1.5(addVersionSrc)
mojoStarted org.apache.maven.plugins:maven-remote-resources-plugin:1.2.1(default)
[INFO] 
[INFO] --- maven-remote-resources-plugin:1.2.1:process (default) @ uimaj-core ---
mojoSucceeded org.apache.maven.plugins:maven-remote-resources-plugin:1.2.1(default)
mojoStarted org.apache.maven.plugins:maven-resources-plugin:2.5(default-resources)[debug]
execute contextualize
[INFO] Using 'UTF-8' encoding to copy filtered resources.
[INFO] Copying 15 resources
[INFO] Copying 3 resources

[INFO] 
[INFO] --- maven-resources-plugin:2.5:resources (default-resources) @ uimaj-core ---
mojoSucceeded org.apache.maven.plugins:maven-resources-plugin:2.5(default-resources)
mojoStarted org.apache.maven.plugins:maven-compiler-plugin:2.3.2(default-compile)
[INFO] 
[INFO] --- maven-compiler-plugin:2.3.2:compile (default-compile) @ uimaj-core ---
[INFO] Compiling 684 source files to <https://builds.apache.org/job/UIMA-SDK/ws/trunk/uimaj-core/target/classes>
mojoSucceeded org.apache.maven.plugins:maven-compiler-plugin:2.3.2(default-compile)
mojoStarted org.apache.maven.plugins:maven-resources-plugin:2.5(default-testResources)[debug]
execute contextualize
[INFO] Using 'UTF-8' encoding to copy filtered resources.

[INFO] 
[INFO] --- maven-resources-plugin:2.5:testResources (default-testResources) @ uimaj-core ---
[INFO] Copying 239 resources
[INFO] Copying 3 resources
mojoSucceeded org.apache.maven.plugins:maven-resources-plugin:2.5(default-testResources)
mojoStarted org.apache.maven.plugins:maven-compiler-plugin:2.3.2(default-testCompile)
[INFO] 
[INFO] --- maven-compiler-plugin:2.3.2:testCompile (default-testCompile) @ uimaj-core ---
[INFO] Compiling 178 source files to <https://builds.apache.org/job/UIMA-SDK/ws/trunk/uimaj-core/target/test-classes>
[INFO] -------------------------------------------------------------
[ERROR] COMPILATION ERROR : 
[INFO] -------------------------------------------------------------
[ERROR] <https://builds.apache.org/job/UIMA-SDK/ws/trunk/uimaj-core/src/test/java/org/apache/uima/cas/impl/SerDesTest.java>:[59,25]
cannot find symbol
symbol  : class DeltaCRLIndicatorExtension
location: package sun.security.x509
[ERROR] <https://builds.apache.org/job/UIMA-SDK/ws/trunk/uimaj-core/src/test/java/org/apache/uima/cas/impl/SerDesTest.java>:[422,21]
cannot find symbol
symbol  : variable MIN_NORMAL
location: class java.lang.Float
[ERROR] <https://builds.apache.org/job/UIMA-SDK/ws/trunk/uimaj-core/src/test/java/org/apache/uima/cas/impl/SerDesTest.java>:[422,8]
set(int,float) in org.apache.uima.cas.FloatArrayFS cannot be applied to (int,<nulltype>)
[ERROR] <https://builds.apache.org/job/UIMA-SDK/ws/trunk/uimaj-core/src/test/java/org/apache/uima/cas/impl/SerDesTest.java>:[433,22]
cannot find symbol
symbol  : variable MIN_NORMAL
location: class java.lang.Double
[ERROR] <https://builds.apache.org/job/UIMA-SDK/ws/trunk/uimaj-core/src/test/java/org/apache/uima/cas/impl/SerDesTest.java>:[433,8]
set(int,double) in org.apache.uima.cas.DoubleArrayFS cannot be applied to (int,<nulltype>)
[ERROR] <https://builds.apache.org/job/UIMA-SDK/ws/trunk/uimaj-core/src/test/java/org/apache/uima/cas/impl/SerDesTest.java>:[551,41]
cannot find symbol
symbol  : variable MIN_NORMAL
location: class java.lang.Double
[ERROR] <https://builds.apache.org/job/UIMA-SDK/ws/trunk/uimaj-core/src/test/java/org/apache/uima/cas/impl/SerDesTest.java>:[563,39]
cannot find symbol
symbol  : variable MIN_NORMAL
location: class java.lang.Float
[ERROR] <https://builds.apache.org/job/UIMA-SDK/ws/trunk/uimaj-core/src/test/java/org/apache/uima/cas/impl/SerDesTest.java>:[650,37]
cannot find symbol
symbol  : variable MIN_NORMAL
location: class java.lang.Float
mojoFailed org.apache.maven.plugins:maven-compiler-plugin:2.3.2(default-testCompile)[ERROR]
<https://builds.apache.org/job/UIMA-SDK/ws/trunk/uimaj-core/src/test/java/org/apache/uima/cas/impl/SerDesTest.java>:[651,40]
cannot find symbol
symbol  : variable MIN_NORMAL
location: class java.lang.Double
[INFO] 9 errors 
[INFO] -------------------------------------------------------------

projectFailed org.apache.uima:uimaj-core:2.4.1-SNAPSHOT
sessionEnded
[INFO] ------------------------------------------------------------------------
[INFO] Reactor Summary:
[INFO] 
[INFO] Apache UIMA Java SDK: uimaj-parent ................ SUCCESS [33.765s]
[INFO] Apache UIMA Base: uimaj-test-util: JUnit utilities  SUCCESS [8.280s]
[INFO] UIMA Base: uimaj-core ............................. FAILURE [12.450s]
[INFO] Apache UIMA Base: jVinci: Vinci Transport Library . SKIPPED
[INFO] Apache UIMA Base: uimaj-adapter-vinci: Vinci Adapter  SKIPPED
[INFO] Apache UIMA Base: uimaj-cpe: Collection Processing Engine  SKIPPED
[INFO] Apache UIMA Base: uimaj-document-annotation ....... SKIPPED
[INFO] Apache UIMA Base: uimaj-tools: Tools .............. SKIPPED
[INFO] Apache UIMA Base: uimaj-examples: SDK Examples .... SKIPPED
[INFO] Apache UIMA Base: uimaj-adapter-soap: SOAP Adapter  SKIPPED
[INFO] Apache UIMA Base: uimaj-component-test-util: for JUnit  SKIPPED
[INFO] Apache UIMA Eclipse: uimaj-ep-debug ............... SKIPPED
[INFO] Apache UIMA Eclipse: uimaj-ep-jcasgen ............. SKIPPED
[INFO] Apache UIMA Eclipse: uimaj-ep-configurator: Descriptor Editor  SKIPPED
[INFO] Apache UIMA Eclipse: uimaj-ep-pear-packager ....... SKIPPED
[INFO] Apache UIMA Eclipse: uimaj-ep-launcher ............ SKIPPED
[INFO] Apache UIMA Eclipse: uimaj-ep-cas-editor .......... SKIPPED
[INFO] Apache UIMA Eclipse: uimaj-ep-cas-editor-ide ...... SKIPPED
[INFO] Apache UIMA Eclipse: uimaj-ep-runtime ............. SKIPPED
[INFO] Apache UIMA Eclipse: uimaj-eclipse-feature-tools .. SKIPPED
[INFO] Apache UIMA Eclipse: uimaj-eclipse-feature-runtime  SKIPPED
[INFO] Apache UIMA Aggregate: aggregate-uimaj-eclipse-plugins  SKIPPED
[INFO] Apache UIMA SDK Documentation - overview and setup  SKIPPED
[INFO] Apache UIMA SDK Documentation - references ........ SKIPPED
[INFO] Apache UIMA SDK Documentation - tools ............. SKIPPED
[INFO] Apache UIMA SDK Documentation - tutorials and user's guides  SKIPPED
[INFO] Apache UIMA Aggregate POM aggregate-uimaj-docbooks: UIMA Base  SKIPPED
[INFO] Apache UIMA Maven Plugin PearPackagingMavenPlugin . SKIPPED
[INFO] Apache UIMA Base: uimaj-bootstrap: Bootstrap launcher  SKIPPED
[INFO] Apache UIMA Aggregate: aggregate-uimaj: UIMA Base . SKIPPED
[INFO] Apache UIMA Java SDK: uimaj ....................... SKIPPED
[INFO] ------------------------------------------------------------------------
[INFO] BUILD FAILURE
[INFO] ------------------------------------------------------------------------
[INFO] Total time: 1:00.320s
[INFO] Finished at: Wed Nov 07 17:58:12 UTC 2012
[INFO] Final Memory: 20M/86M
[INFO] ------------------------------------------------------------------------
Projects to build: [MavenProject: org.apache.uima:uimaj-parent:2.4.1-SNAPSHOT @ <https://builds.apache.org/job/UIMA-SDK/ws/trunk/uimaj-parent/pom.xml,>
MavenProject: org.apache.uima:uimaj-test-util:2.4.1-SNAPSHOT @ <https://builds.apache.org/job/UIMA-SDK/ws/trunk/uimaj-test-util/pom.xml,>
MavenProject: org.apache.uima:uimaj-core:2.4.1-SNAPSHOT @ <https://builds.apache.org/job/UIMA-SDK/ws/trunk/uimaj-core/pom.xml,>
MavenProject: org.apache.uima:jVinci:2.4.1-SNAPSHOT @ <https://builds.apache.org/job/UIMA-SDK/ws/trunk/jVinci/pom.xml,>
MavenProject: org.apache.uima:uimaj-adapter-vinci:2.4.1-SNAPSHOT @ <https://builds.apache.org/job/UIMA-SDK/ws/trunk/uimaj-adapter-vinci/pom.xml,>
MavenProject: org.apache.uima:uimaj-cpe:2.4.1-SNAPSHOT @ <https://builds.apache.org/job/UIMA-SDK/ws/trunk/uimaj-cpe/pom.xml,>
MavenProject: org.apache.uima:uimaj-document-annotation:2.4.1-SNAPSHOT @ <https://builds.apache.org/job/UIMA-SDK/ws/trunk/uimaj-document-annotation/pom.xml,>
MavenProject: org.apache.uima:uimaj-tools:2.4.1-SNAPSHOT @ <https://builds.apache.org/job/UIMA-SDK/ws/trunk/uimaj-tools/pom.xml,>
MavenProject: org.apache.uima:uimaj-examples:2.4.1-SNAPSHOT @ <https://builds.apache.org/job/UIMA-SDK/ws/trunk/uimaj-examples/pom.xml,>
MavenProject: org.apache.uima:uimaj-adapter-soap:2.4.1-SNAPSHOT @ <https://builds.apache.org/job/UIMA-SDK/ws/trunk/uimaj-adapter-soap/pom.xml,>
MavenProject: org.apache.uima:uimaj-component-test-util:2.4.1-SNAPSHOT @ <https://builds.apache.org/job/UIMA-SDK/ws/trunk/uimaj-component-test-util/pom.xml,>
MavenProject: org.apache.uima:uimaj-ep-debug:2.4.1-SNAPSHOT @ <https://builds.apache.org/job/UIMA-SDK/ws/trunk/uimaj-ep-debug/pom.xml,>
MavenProject: org.apache.uima:uimaj-ep-jcasgen:2.4.1-SNAPSHOT @ <https://builds.apache.org/job/UIMA-SDK/ws/trunk/uimaj-ep-jcasgen/pom.xml,>
MavenProject: org.apache.uima:uimaj-ep-configurator:2.4.1-SNAPSHOT @ <https://builds.apache.org/job/UIMA-SDK/ws/trunk/uimaj-ep-configurator/pom.xml,>
MavenProject: org.apache.uima:uimaj-ep-pear-packager:2.4.1-SNAPSHOT @ <https://builds.apache.org/job/UIMA-SDK/ws/trunk/uimaj-ep-pear-packager/pom.xml,>
MavenProject: org.apache.uima:uimaj-ep-launcher:2.4.1-SNAPSHOT @ <https://builds.apache.org/job/UIMA-SDK/ws/trunk/uimaj-ep-launcher/pom.xml,>
MavenProject: org.apache.uima:uimaj-ep-cas-editor:2.4.1-SNAPSHOT @ <https://builds.apache.org/job/UIMA-SDK/ws/trunk/uimaj-ep-cas-editor/pom.xml,>
MavenProject: org.apache.uima:uimaj-ep-cas-editor-ide:2.4.1-SNAPSHOT @ <https://builds.apache.org/job/UIMA-SDK/ws/trunk/uimaj-ep-cas-editor-ide/pom.xml,>
MavenProject: org.apache.uima:uimaj-ep-runtime:2.4.1-SNAPSHOT @ <https://builds.apache.org/job/UIMA-SDK/ws/trunk/uimaj-ep-runtime/pom.xml,>
MavenProject: org.apache.uima:uimaj-eclipse-feature-tools:2.4.0 @ <https://builds.apache.org/job/UIMA-SDK/ws/trunk/uimaj-eclipse-feature-tools/pom.xml,>
MavenProject: org.apache.uima:uimaj-eclipse-feature-runtime:2.4.0 @ <https://builds.apache.org/job/UIMA-SDK/ws/trunk/uimaj-eclipse-feature-runtime/pom.xml,>
MavenProject: org.apache.uima:aggregate-uimaj-eclipse-plugins:2.4.0 @ <https://builds.apache.org/job/UIMA-SDK/ws/trunk/aggregate-uimaj-eclipse-plugins/pom.xml,>
MavenProject: org.apache.uima:uima-docbook-overview-and-setup:2.4.1-SNAPSHOT @ <https://builds.apache.org/job/UIMA-SDK/ws/trunk/uima-docbook-overview-and-setup/pom.xml,>
MavenProject: org.apache.uima:uima-docbook-references:2.4.1-SNAPSHOT @ <https://builds.apache.org/job/UIMA-SDK/ws/trunk/uima-docbook-references/pom.xml,>
MavenProject: org.apache.uima:uima-docbook-tools:2.4.1-SNAPSHOT @ <https://builds.apache.org/job/UIMA-SDK/ws/trunk/uima-docbook-tools/pom.xml,>
MavenProject: org.apache.uima:uima-docbook-tutorials-and-users-guides:2.4.1-SNAPSHOT @ <https://builds.apache.org/job/UIMA-SDK/ws/trunk/uima-docbook-tutorials-and-users-guides/pom.xml,>
MavenProject: org.apache.uima:aggregate-uimaj-docbooks:2.4.1-SNAPSHOT @ <https://builds.apache.org/job/UIMA-SDK/ws/trunk/aggregate-uimaj-docbooks/pom.xml,>
MavenProject: org.apache.uima:PearPackagingMavenPlugin:2.4.1-SNAPSHOT @ <https://builds.apache.org/job/UIMA-SDK/ws/trunk/PearPackagingMavenPlugin/pom.xml,>
MavenProject: org.apache.uima:uimaj-bootstrap:2.4.1-SNAPSHOT @ <https://builds.apache.org/job/UIMA-SDK/ws/trunk/uimaj-bootstrap/pom.xml,>
MavenProject: org.apache.uima:aggregate-uimaj:2.4.1-SNAPSHOT @ <https://builds.apache.org/job/UIMA-SDK/ws/trunk/aggregate-uimaj/pom.xml,>
MavenProject: org.apache.uima:uimaj:2.4.1-SNAPSHOT @ <https://builds.apache.org/job/UIMA-SDK/ws/trunk/pom.xml]>
[JENKINS] Archiving <https://builds.apache.org/job/UIMA-SDK/ws/trunk/uima-docbook-tools/pom.xml>
to /home/hudson/hudson/jobs/UIMA-SDK/modules/org.apache.uima$uima-docbook-tools/builds/2012-11-07_17-56-43/archive/org.apache.uima/uima-docbook-tools/2.4.1-SNAPSHOT/uima-docbook-tools-2.4.1-SNAPSHOT.pom
[JENKINS] Archiving <https://builds.apache.org/job/UIMA-SDK/ws/trunk/uimaj-ep-launcher/pom.xml>
to /home/hudson/hudson/jobs/UIMA-SDK/modules/org.apache.uima$uimaj-ep-launcher/builds/2012-11-07_17-56-42/archive/org.apache.uima/uimaj-ep-launcher/2.4.1-SNAPSHOT/uimaj-ep-launcher-2.4.1-SNAPSHOT.pom
[JENKINS] Archiving <https://builds.apache.org/job/UIMA-SDK/ws/trunk/uimaj-eclipse-feature-runtime/pom.xml>
to /home/hudson/hudson/jobs/UIMA-SDK/modules/org.apache.uima$uimaj-eclipse-feature-runtime/builds/2012-11-07_17-56-43/archive/org.apache.uima/uimaj-eclipse-feature-runtime/2.4.0/uimaj-eclipse-feature-runtime-2.4.0.pom
[JENKINS] Archiving <https://builds.apache.org/job/UIMA-SDK/ws/trunk/uima-docbook-tutorials-and-users-guides/pom.xml>
to /home/hudson/hudson/jobs/UIMA-SDK/modules/org.apache.uima$uima-docbook-tutorials-and-users-guides/builds/2012-11-07_17-56-43/archive/org.apache.uima/uima-docbook-tutorials-and-users-guides/2.4.1-SNAPSHOT/uima-docbook-tutorials-and-users-guides-2.4.1-SNAPSHOT.pom
[JENKINS] Archiving <https://builds.apache.org/job/UIMA-SDK/ws/trunk/uimaj-ep-pear-packager/pom.xml>
to /home/hudson/hudson/jobs/UIMA-SDK/modules/org.apache.uima$uimaj-ep-pear-packager/builds/2012-11-07_17-56-42/archive/org.apache.uima/uimaj-ep-pear-packager/2.4.1-SNAPSHOT/uimaj-ep-pear-packager-2.4.1-SNAPSHOT.pom
[JENKINS] Archiving <https://builds.apache.org/job/UIMA-SDK/ws/trunk/uimaj-ep-jcasgen/pom.xml>
to /home/hudson/hudson/jobs/UIMA-SDK/modules/org.apache.uima$uimaj-ep-jcasgen/builds/2012-11-07_17-56-42/archive/org.apache.uima/uimaj-ep-jcasgen/2.4.1-SNAPSHOT/uimaj-ep-jcasgen-2.4.1-SNAPSHOT.pom
[JENKINS] Archiving <https://builds.apache.org/job/UIMA-SDK/ws/trunk/uimaj-document-annotation/pom.xml>
to /home/hudson/hudson/jobs/UIMA-SDK/modules/org.apache.uima$uimaj-document-annotation/builds/2012-11-07_17-56-43/archive/org.apache.uima/uimaj-document-annotation/2.4.1-SNAPSHOT/uimaj-document-annotation-2.4.1-SNAPSHOT.pom
[JENKINS] Archiving <https://builds.apache.org/job/UIMA-SDK/ws/trunk/aggregate-uimaj-eclipse-plugins/pom.xml>
to /home/hudson/hudson/jobs/UIMA-SDK/modules/org.apache.uima$aggregate-uimaj-eclipse-plugins/builds/2012-11-07_17-56-42/archive/org.apache.uima/aggregate-uimaj-eclipse-plugins/2.4.0/aggregate-uimaj-eclipse-plugins-2.4.0.pom
[JENKINS] Archiving <https://builds.apache.org/job/UIMA-SDK/ws/trunk/uimaj-adapter-vinci/pom.xml>
to /home/hudson/hudson/jobs/UIMA-SDK/modules/org.apache.uima$uimaj-adapter-vinci/builds/2012-11-07_17-56-42/archive/org.apache.uima/uimaj-adapter-vinci/2.4.1-SNAPSHOT/uimaj-adapter-vinci-2.4.1-SNAPSHOT.pom
[JENKINS] Archiving <https://builds.apache.org/job/UIMA-SDK/ws/trunk/uimaj-ep-runtime/pom.xml>
to /home/hudson/hudson/jobs/UIMA-SDK/modules/org.apache.uima$uimaj-ep-runtime/builds/2012-11-07_17-56-43/archive/org.apache.uima/uimaj-ep-runtime/2.4.1-SNAPSHOT/uimaj-ep-runtime-2.4.1-SNAPSHOT.pom
[JENKINS] Archiving <https://builds.apache.org/job/UIMA-SDK/ws/trunk/uimaj-ep-cas-editor/pom.xml>
to /home/hudson/hudson/jobs/UIMA-SDK/modules/org.apache.uima$uimaj-ep-cas-editor/builds/2012-11-07_17-56-43/archive/org.apache.uima/uimaj-ep-cas-editor/2.4.1-SNAPSHOT/uimaj-ep-cas-editor-2.4.1-SNAPSHOT.pom
[JENKINS] Archiving <https://builds.apache.org/job/UIMA-SDK/ws/trunk/uimaj-parent/pom.xml>
to /home/hudson/hudson/jobs/UIMA-SDK/modules/org.apache.uima$uimaj-parent/builds/2012-11-07_17-56-41/archive/org.apache.uima/uimaj-parent/2.4.1-SNAPSHOT/uimaj-parent-2.4.1-SNAPSHOT.pom
[JENKINS] Archiving <https://builds.apache.org/job/UIMA-SDK/ws/trunk/PearPackagingMavenPlugin/pom.xml>
to /home/hudson/hudson/jobs/UIMA-SDK/modules/org.apache.uima$PearPackagingMavenPlugin/builds/2012-11-07_17-56-43/archive/org.apache.uima/PearPackagingMavenPlugin/2.4.1-SNAPSHOT/PearPackagingMavenPlugin-2.4.1-SNAPSHOT.pom
[JENKINS] Archiving <https://builds.apache.org/job/UIMA-SDK/ws/trunk/uima-docbook-overview-and-setup/pom.xml>
to /home/hudson/hudson/jobs/UIMA-SDK/modules/org.apache.uima$uima-docbook-overview-and-setup/builds/2012-11-07_17-56-43/archive/org.apache.uima/uima-docbook-overview-and-setup/2.4.1-SNAPSHOT/uima-docbook-overview-and-setup-2.4.1-SNAPSHOT.pom
[JENKINS] Archiving <https://builds.apache.org/job/UIMA-SDK/ws/trunk/uimaj-eclipse-feature-tools/pom.xml>
to /home/hudson/hudson/jobs/UIMA-SDK/modules/org.apache.uima$uimaj-eclipse-feature-tools/builds/2012-11-07_17-56-43/archive/org.apache.uima/uimaj-eclipse-feature-tools/2.4.0/uimaj-eclipse-feature-tools-2.4.0.pom
[JENKINS] Archiving <https://builds.apache.org/job/UIMA-SDK/ws/trunk/uima-docbook-references/pom.xml>
to /home/hudson/hudson/jobs/UIMA-SDK/modules/org.apache.uima$uima-docbook-references/builds/2012-11-07_17-56-43/archive/org.apache.uima/uima-docbook-references/2.4.1-SNAPSHOT/uima-docbook-references-2.4.1-SNAPSHOT.pom
[JENKINS] Archiving <https://builds.apache.org/job/UIMA-SDK/ws/trunk/uimaj-component-test-util/pom.xml>
to /home/hudson/hudson/jobs/UIMA-SDK/modules/org.apache.uima$uimaj-component-test-util/builds/2012-11-07_17-56-42/archive/org.apache.uima/uimaj-component-test-util/2.4.1-SNAPSHOT/uimaj-component-test-util-2.4.1-SNAPSHOT.pom
[JENKINS] Archiving <https://builds.apache.org/job/UIMA-SDK/ws/trunk/uimaj-ep-debug/pom.xml>
to /home/hudson/hudson/jobs/UIMA-SDK/modules/org.apache.uima$uimaj-ep-debug/builds/2012-11-07_17-56-42/archive/org.apache.uima/uimaj-ep-debug/2.4.1-SNAPSHOT/uimaj-ep-debug-2.4.1-SNAPSHOT.pom
[JENKINS] Archiving <https://builds.apache.org/job/UIMA-SDK/ws/trunk/uimaj-adapter-soap/pom.xml>
to /home/hudson/hudson/jobs/UIMA-SDK/modules/org.apache.uima$uimaj-adapter-soap/builds/2012-11-07_17-56-42/archive/org.apache.uima/uimaj-adapter-soap/2.4.1-SNAPSHOT/uimaj-adapter-soap-2.4.1-SNAPSHOT.pom
[JENKINS] Archiving <https://builds.apache.org/job/UIMA-SDK/ws/trunk/uimaj-cpe/pom.xml>
to /home/hudson/hudson/jobs/UIMA-SDK/modules/org.apache.uima$uimaj-cpe/builds/2012-11-07_17-56-42/archive/org.apache.uima/uimaj-cpe/2.4.1-SNAPSHOT/uimaj-cpe-2.4.1-SNAPSHOT.pom
[JENKINS] Archiving <https://builds.apache.org/job/UIMA-SDK/ws/trunk/uimaj-test-util/pom.xml>
to /home/hudson/hudson/jobs/UIMA-SDK/modules/org.apache.uima$uimaj-test-util/builds/2012-11-07_17-56-42/archive/org.apache.uima/uimaj-test-util/2.4.1-SNAPSHOT/uimaj-test-util-2.4.1-SNAPSHOT.pom
[JENKINS] Archiving <https://builds.apache.org/job/UIMA-SDK/ws/trunk/uimaj-test-util/target/uimaj-test-util-2.4.1-SNAPSHOT.jar>
to /home/hudson/hudson/jobs/UIMA-SDK/modules/org.apache.uima$uimaj-test-util/builds/2012-11-07_17-56-42/archive/org.apache.uima/uimaj-test-util/2.4.1-SNAPSHOT/uimaj-test-util-2.4.1-SNAPSHOT.jar
[JENKINS] Archiving <https://builds.apache.org/job/UIMA-SDK/ws/trunk/pom.xml> to /home/hudson/hudson/jobs/UIMA-SDK/modules/org.apache.uima$uimaj/builds/2012-11-07_17-56-41/archive/org.apache.uima/uimaj/2.4.1-SNAPSHOT/uimaj-2.4.1-SNAPSHOT.pom
[JENKINS] Archiving <https://builds.apache.org/job/UIMA-SDK/ws/trunk/uimaj-core/pom.xml>
to /home/hudson/hudson/jobs/UIMA-SDK/modules/org.apache.uima$uimaj-core/builds/2012-11-07_17-56-41/archive/org.apache.uima/uimaj-core/2.4.1-SNAPSHOT/uimaj-core-2.4.1-SNAPSHOT.pom
[JENKINS] Archiving <https://builds.apache.org/job/UIMA-SDK/ws/trunk/uimaj-examples/pom.xml>
to /home/hudson/hudson/jobs/UIMA-SDK/modules/org.apache.uima$uimaj-examples/builds/2012-11-07_17-56-42/archive/org.apache.uima/uimaj-examples/2.4.1-SNAPSHOT/uimaj-examples-2.4.1-SNAPSHOT.pom
[JENKINS] Archiving <https://builds.apache.org/job/UIMA-SDK/ws/trunk/uimaj-ep-cas-editor-ide/pom.xml>
to /home/hudson/hudson/jobs/UIMA-SDK/modules/org.apache.uima$uimaj-ep-cas-editor-ide/builds/2012-11-07_17-56-43/archive/org.apache.uima/uimaj-ep-cas-editor-ide/2.4.1-SNAPSHOT/uimaj-ep-cas-editor-ide-2.4.1-SNAPSHOT.pom
[JENKINS] Archiving <https://builds.apache.org/job/UIMA-SDK/ws/trunk/aggregate-uimaj-docbooks/pom.xml>
to /home/hudson/hudson/jobs/UIMA-SDK/modules/org.apache.uima$aggregate-uimaj-docbooks/builds/2012-11-07_17-56-43/archive/org.apache.uima/aggregate-uimaj-docbooks/2.4.1-SNAPSHOT/aggregate-uimaj-docbooks-2.4.1-SNAPSHOT.pom
[JENKINS] Archiving <https://builds.apache.org/job/UIMA-SDK/ws/trunk/jVinci/pom.xml>
to /home/hudson/hudson/jobs/UIMA-SDK/modules/org.apache.uima$jVinci/builds/2012-11-07_17-56-42/archive/org.apache.uima/jVinci/2.4.1-SNAPSHOT/jVinci-2.4.1-SNAPSHOT.pom
[JENKINS] Archiving <https://builds.apache.org/job/UIMA-SDK/ws/trunk/uimaj-tools/pom.xml>
to /home/hudson/hudson/jobs/UIMA-SDK/modules/org.apache.uima$uimaj-tools/builds/2012-11-07_17-56-42/archive/org.apache.uima/uimaj-tools/2.4.1-SNAPSHOT/uimaj-tools-2.4.1-SNAPSHOT.pom
[JENKINS] Archiving <https://builds.apache.org/job/UIMA-SDK/ws/trunk/uimaj-bootstrap/pom.xml>
to /home/hudson/hudson/jobs/UIMA-SDK/modules/org.apache.uima$uimaj-bootstrap/builds/2012-11-07_17-56-43/archive/org.apache.uima/uimaj-bootstrap/2.4.1-SNAPSHOT/uimaj-bootstrap-2.4.1-SNAPSHOT.pom
[JENKINS] Archiving <https://builds.apache.org/job/UIMA-SDK/ws/trunk/aggregate-uimaj/pom.xml>
to /home/hudson/hudson/jobs/UIMA-SDK/modules/org.apache.uima$aggregate-uimaj/builds/2012-11-07_17-56-41/archive/org.apache.uima/aggregate-uimaj/2.4.1-SNAPSHOT/aggregate-uimaj-2.4.1-SNAPSHOT.pom
[JENKINS] Archiving <https://builds.apache.org/job/UIMA-SDK/ws/trunk/uimaj-ep-configurator/pom.xml>
to /home/hudson/hudson/jobs/UIMA-SDK/modules/org.apache.uima$uimaj-ep-configurator/builds/2012-11-07_17-56-42/archive/org.apache.uima/uimaj-ep-configurator/2.4.1-SNAPSHOT/uimaj-ep-configurator-2.4.1-SNAPSHOT.pom
Waiting for Jenkins to finish collecting data
mavenExecutionResult exceptions not empty
message : Failed to execute goal org.apache.maven.plugins:maven-compiler-plugin:2.3.2:testCompile
(default-testCompile) on project uimaj-core: Compilation failure
cause : Compilation failure
Stack trace : 
org.apache.maven.lifecycle.LifecycleExecutionException: Failed to execute goal org.apache.maven.plugins:maven-compiler-plugin:2.3.2:testCompile
(default-testCompile) on project uimaj-core: Compilation failure
	at org.apache.maven.lifecycle.internal.MojoExecutor.execute(MojoExecutor.java:213)
	at org.apache.maven.lifecycle.internal.MojoExecutor.execute(MojoExecutor.java:153)
	at org.apache.maven.lifecycle.internal.MojoExecutor.execute(MojoExecutor.java:145)
	at org.apache.maven.lifecycle.internal.LifecycleModuleBuilder.buildProject(LifecycleModuleBuilder.java:84)
	at org.apache.maven.lifecycle.internal.LifecycleModuleBuilder.buildProject(LifecycleModuleBuilder.java:59)
	at org.apache.maven.lifecycle.internal.LifecycleStarter.singleThreadedBuild(LifecycleStarter.java:183)
	at org.apache.maven.lifecycle.internal.LifecycleStarter.execute(LifecycleStarter.java:161)
	at org.apache.maven.DefaultMaven.doExecute(DefaultMaven.java:319)
	at org.apache.maven.DefaultMaven.execute(DefaultMaven.java:156)
	at org.jvnet.hudson.maven3.launcher.Maven3Launcher.main(Maven3Launcher.java:79)
	at sun.reflect.NativeMethodAccessorImpl.invoke0(Native Method)
	at sun.reflect.NativeMethodAccessorImpl.invoke(NativeMethodAccessorImpl.java:39)
	at sun.reflect.DelegatingMethodAccessorImpl.invoke(DelegatingMethodAccessorImpl.java:25)
	at java.lang.reflect.Method.invoke(Method.java:592)
	at org.codehaus.plexus.classworlds.launcher.Launcher.launchStandard(Launcher.java:329)
	at org.codehaus.plexus.classworlds.launcher.Launcher.launch(Launcher.java:239)
	at org.jvnet.hudson.maven3.agent.Maven3Main.launch(Maven3Main.java:158)
	at hudson.maven.Maven3Builder.call(Maven3Builder.java:98)
	at hudson.maven.Maven3Builder.call(Maven3Builder.java:64)
	at hudson.remoting.UserRequest.perform(UserRequest.java:118)
	at hudson.remoting.UserRequest.perform(UserRequest.java:48)
	at hudson.remoting.Request$2.run(Request.java:326)
	at hudson.remoting.InterceptingExecutorService$1.call(InterceptingExecutorService.java:72)
	at java.util.concurrent.FutureTask$Sync.innerRun(FutureTask.java:269)
	at java.util.concurrent.FutureTask.run(FutureTask.java:123)
	at java.util.concurrent.ThreadPoolExecutor$Worker.runTask(ThreadPoolExecutor.java:651)
	at java.util.concurrent.ThreadPoolExecutor$Worker.run(ThreadPoolExecutor.java:676)
	at java.lang.Thread.run(Thread.java:595)
Caused by: org.apache.maven.plugin.CompilationFailureException: Compilation failure
	at org.apache.maven.plugin.AbstractCompilerMojo.execute(AbstractCompilerMojo.java:656)
	at org.apache.maven.plugin.TestCompilerMojo.execute(TestCompilerMojo.java:161)
	at org.apache.maven.plugin.DefaultBuildPluginManager.executeMojo(DefaultBuildPluginManager.java:101)
	at org.apache.maven.lifecycle.internal.MojoExecutor.execute(MojoExecutor.java:209)
	... 27 more
channel stopped

Mime
View raw message