uima-dev mailing list archives

Site index · List index
Message view « Date » · « Thread »
Top « Date » · « Thread »
From Apache Jenkins Server <jenk...@builds.apache.org>
Subject Build failed in Jenkins: UIMA Addons #111
Date Fri, 11 Jan 2013 09:14:30 GMT
See <https://builds.apache.org/job/UIMA%20Addons/111/changes>

Changes:

[tommaso] [UIMA-2566] - replaced deprecated CommonsHttpSolrServer with HttpSolrServer plus
minor improvements

------------------------------------------
[...truncated 152 lines...]
[INFO] Copying 10 resources
[INFO] Copying 3 resources
mojoSucceeded org.apache.maven.plugins:maven-resources-plugin:2.5(default-testResources)
mojoStarted org.apache.maven.plugins:maven-compiler-plugin:2.3.2(default-testCompile)
[INFO] 
[INFO] --- maven-compiler-plugin:2.3.2:testCompile (default-testCompile) @ AlchemyAPIAnnotator
---
[INFO] Compiling 22 source files to <https://builds.apache.org/job/UIMA%20Addons/ws/AlchemyAPIAnnotator/target/test-classes>
mojoSucceeded org.apache.maven.plugins:maven-compiler-plugin:2.3.2(default-testCompile)
mojoStarted org.apache.maven.plugins:maven-surefire-plugin:2.9(default-test)
[INFO] 
[INFO] --- maven-surefire-plugin:2.9:test (default-test) @ AlchemyAPIAnnotator ---
[INFO] Surefire report directory: <https://builds.apache.org/job/UIMA%20Addons/ws/AlchemyAPIAnnotator/target/surefire-reports>

-------------------------------------------------------
 T E S T S
-------------------------------------------------------
Running org.apache.uima.alchemy.digester.RankedEntityXMLDigesterTest
Tests run: 1, Failures: 0, Errors: 0, Skipped: 0, Time elapsed: 2.802 sec
Running org.apache.uima.alchemy.digester.CategorizationJsonDigesterTest
Tests run: 1, Failures: 0, Errors: 0, Skipped: 0, Time elapsed: 2.588 sec
Running org.apache.uima.alchemy.digester.KeywordXMLDigesterTest
Tests run: 1, Failures: 0, Errors: 0, Skipped: 0, Time elapsed: 0.282 sec
Running org.apache.uima.alchemy.digester.RankedEntityJsonDigesterTest
Tests run: 1, Failures: 0, Errors: 0, Skipped: 0, Time elapsed: 0.296 sec
Running org.apache.uima.alchemy.annotator.TextCategorizationAnnotatorTest
Tests run: 1, Failures: 0, Errors: 0, Skipped: 0, Time elapsed: 8.468 sec
Running org.apache.uima.alchemy.annotator.TextKeywordExtractionAnnotatorTest
Tests run: 1, Failures: 0, Errors: 0, Skipped: 0, Time elapsed: 0.966 sec
Running org.apache.uima.alchemy.annotator.TextLanguageDetectionAnnotatorTest
Tests run: 1, Failures: 0, Errors: 0, Skipped: 0, Time elapsed: 0.3 sec
Running org.apache.uima.alchemy.annotator.HtmlMicroformatsAnnotatorTest
Tests run: 1, Failures: 0, Errors: 0, Skipped: 0, Time elapsed: 0.091 sec
Running org.apache.uima.alchemy.annotator.TextRankedEntityExtractionAnnotatorTest
Jan 11, 2013 9:13:07 AM org.apache.uima.alchemy.mapper.processor.RankedEntitiesProcessor buildAnnotations(116)
INFO: added AlchemyAnnotation for Afghanistan of type org.apache.uima.alchemy.ts.entity.Country
Tests run: 2, Failures: 0, Errors: 0, Skipped: 0, Time elapsed: 4.891 sec
Running org.apache.uima.alchemy.annotator.URLMicroformatsAnnotatorTest
Tests run: 1, Failures: 0, Errors: 0, Skipped: 0, Time elapsed: 0.155 sec
Running org.apache.uima.alchemy.annotator.SimpleTest
Jan 11, 2013 9:13:12 AM org.apache.uima.analysis_engine.impl.PrimitiveAnalysisEngine_impl
callAnalysisComponentProcess(405)
SEVERE: Exception occurred
org.apache.uima.analysis_engine.AnalysisEngineProcessException
	at org.apache.uima.alchemy.annotator.AbstractAlchemyAnnotator.process(AbstractAlchemyAnnotator.java:142)
	at org.apache.uima.analysis_component.JCasAnnotator_ImplBase.process(JCasAnnotator_ImplBase.java:48)
	at org.apache.uima.analysis_engine.impl.PrimitiveAnalysisEngine_impl.callAnalysisComponentProcess(PrimitiveAnalysisEngine_impl.java:377)
	at org.apache.uima.analysis_engine.impl.PrimitiveAnalysisEngine_impl.processAndOutputNewCASes(PrimitiveAnalysisEngine_impl.java:295)
	at org.apache.uima.analysis_engine.impl.AnalysisEngineImplBase.process(AnalysisEngineImplBase.java:267)
	at org.apache.uima.analysis_engine.impl.AnalysisEngineImplBase.process(AnalysisEngineImplBase.java:280)
	at org.apache.uima.alchemy.utils.TestUtils.executeAE(TestUtils.java:137)
	at org.apache.uima.alchemy.annotator.SimpleTest.testAnalysisEngineError(SimpleTest.java:53)
	at sun.reflect.NativeMethodAccessorImpl.invoke0(Native Method)
	at sun.reflect.NativeMethodAccessorImpl.invoke(NativeMethodAccessorImpl.java:39)
	at sun.reflect.DelegatingMethodAccessorImpl.invoke(DelegatingMethodAccessorImpl.java:25)
	at java.lang.reflect.Method.invoke(Method.java:592)
	at org.junit.runners.model.FrameworkMethod$1.runReflectiveCall(FrameworkMethod.java:44)
	at org.junit.internal.runners.model.ReflectiveCallable.run(ReflectiveCallable.java:15)
	at org.junit.runners.model.FrameworkMethod.invokeExplosively(FrameworkMethod.java:41)
	at org.junit.internal.runners.statements.InvokeMethod.evaluate(InvokeMethod.java:20)
	at org.junit.runners.BlockJUnit4ClassRunner.runNotIgnored(BlockJUnit4ClassRunner.java:79)
	at org.junit.runners.BlockJUnit4ClassRunner.runChild(BlockJUnit4ClassRunner.java:71)
	at org.junit.runners.BlockJUnit4ClassRunner.runChild(BlockJUnit4ClassRunner.java:49)
	at org.junit.runners.ParentRunner$3.run(ParentRunner.java:193)
	at org.junit.runners.ParentRunner$1.schedule(ParentRunner.java:52)
	at org.junit.runners.ParentRunner.runChildren(ParentRunner.java:191)
	at org.junit.runners.ParentRunner.access$000(ParentRunner.java:42)
	at org.junit.runners.ParentRunner$2.evaluate(ParentRunner.java:184)
	at org.junit.runners.ParentRunner.run(ParentRunner.java:236)
	at org.apache.maven.surefire.junit4.JUnit4TestSet.execute(JUnit4TestSet.java:53)
	at org.apache.maven.surefire.junit4.JUnit4Provider.executeTestSet(JUnit4Provider.java:123)
	at org.apache.maven.surefire.junit4.JUnit4Provider.invoke(JUnit4Provider.java:104)
	at sun.reflect.NativeMethodAccessorImpl.invoke0(Native Method)
	at sun.reflect.NativeMethodAccessorImpl.invoke(NativeMethodAccessorImpl.java:39)
	at sun.reflect.DelegatingMethodAccessorImpl.invoke(DelegatingMethodAccessorImpl.java:25)
	at java.lang.reflect.Method.invoke(Method.java:592)
	at org.apache.maven.surefire.util.ReflectionUtils.invokeMethodWithArray(ReflectionUtils.java:164)
	at org.apache.maven.surefire.booter.ProviderFactory$ProviderProxy.invoke(ProviderFactory.java:110)
	at org.apache.maven.surefire.booter.SurefireStarter.invokeProvider(SurefireStarter.java:172)
	at org.apache.maven.surefire.booter.SurefireStarter.runSuitesInProcessWhenForked(SurefireStarter.java:104)
	at org.apache.maven.surefire.booter.ForkedBooter.main(ForkedBooter.java:70)
Caused by: org.apache.uima.alchemy.digester.exception.ResultDigestingException: org.apache.uima.alchemy.annotator.exception.AlchemyCallFailedException:
ERROR - invalid-api-key
	at org.apache.uima.alchemy.annotator.AbstractAlchemyAnnotator.process(AbstractAlchemyAnnotator.java:137)
	... 36 more
Caused by: org.apache.uima.alchemy.annotator.exception.AlchemyCallFailedException: ERROR -
invalid-api-key
	at org.apache.uima.alchemy.annotator.AbstractAlchemyAnnotator.process(AbstractAlchemyAnnotator.java:132)
	... 36 more
Tests run: 2, Failures: 0, Errors: 0, Skipped: 0, Time elapsed: 0.733 sec
Running org.apache.uima.alchemy.annotator.TextConceptTaggingAnnotatorTest
Tests run: 1, Failures: 0, Errors: 0, Skipped: 0, Time elapsed: 0.993 sec

Results :

Tests run: 14, Failures: 0, Errors: 0, Skipped: 0

mojoSucceeded org.apache.maven.plugins:maven-surefire-plugin:2.9(default-test)
[JENKINS] Recording test results
mojoStarted org.apache.maven.plugins:maven-dependency-plugin:2.3(copyDocbookInfo)
[INFO] Configured Artifact: org.apache.uima:uima-build-resources:2:jar
[INFO] 
[INFO] Unpacking /export/home/hudson/hudson-slave/maven-repositories/0/org/apache/uima/uima-build-resources/2/uima-build-resources-2.jar
to <https://builds.apache.org/job/UIMA%20Addons/ws/AlchemyAPIAnnotator/target> with
includes "docbook-shared/**" and excludes ""
[INFO] --- maven-dependency-plugin:2.3:unpack (copyDocbookInfo) @ AlchemyAPIAnnotator ---
mojoSucceeded org.apache.maven.plugins:maven-dependency-plugin:2.3(copyDocbookInfo)
mojoStarted org.apache.maven.plugins:maven-dependency-plugin:2.3(copyDocbookInfoNextToOlink)[INFO]
Configured Artifact: org.apache.uima:uima-build-resources:1:jar

[INFO] 
[INFO] --- maven-dependency-plugin:2.3:unpack (copyDocbookInfoNextToOlink) @ AlchemyAPIAnnotator
---
> isMarkerOlder:
  artifact1 = /export/home/hudson/hudson-slave/maven-repositories/0/org/apache/uima/uima-build-resources/1/uima-build-resources-1.jar
  marker    = /export/home/hudson/hudson-slave/maven-repositories/0/org/apache/uima/uima-docbook-olink/1-SNAPSHOT/dependency-maven-plugin-markers/org.apache.uima-uima-build-resources-jar-1376161406
    artifact1 lastModified: 1340422754000
    marker lastModified: 1340422754000
< false = marker older than artifact?
[INFO] uima-build-resources-1.jar already unpacked.
mojoSucceeded org.apache.maven.plugins:maven-dependency-plugin:2.3(copyDocbookInfoNextToOlink)
mojoStarted org.apache.maven.plugins:maven-dependency-plugin:2.3(getOlink)
[INFO] 
[INFO] Configured Artifact: org.apache.uima:uima-docbook-olink:olink:1-SNAPSHOT:zip
[INFO] --- maven-dependency-plugin:2.3:unpack (getOlink) @ AlchemyAPIAnnotator ---
Downloading: http://repository.apache.org/snapshots/org/apache/uima/uima-docbook-olink/1-SNAPSHOT/maven-metadata.xml
Downloaded: http://repository.apache.org/snapshots/org/apache/uima/uima-docbook-olink/1-SNAPSHOT/maven-metadata.xml
(810 B at 0.8 KB/sec)
> isMarkerOlder:
  artifact1 = /export/home/hudson/hudson-slave/maven-repositories/0/org/apache/uima/uima-docbook-olink/1-SNAPSHOT/uima-docbook-olink-1-SNAPSHOT-olink.zip
  marker    = /export/home/hudson/hudson-slave/maven-repositories/0/org/apache/uima/uima-docbook-olink/1-SNAPSHOT/dependency-maven-plugin-markers/org.apache.uima-uima-docbook-olink-zip-olink-1-SNAPSHOT.marker
    artifact1 lastModified: 1341996653000
    marker lastModified: 1341996653000
< false = marker older than artifact?
mojoSucceeded org.apache.maven.plugins:maven-dependency-plugin:2.3(getOlink)[INFO] uima-docbook-olink-1-SNAPSHOT-olink.zip
already unpacked.

mojoStarted org.apache.maven.plugins:maven-jar-plugin:2.3.1(default-jar)
[INFO] 
[INFO] --- maven-jar-plugin:2.3.1:jar (default-jar) @ AlchemyAPIAnnotator ---
mojoFailed org.apache.maven.plugins:maven-jar-plugin:2.3.1(default-jar)
projectFailed org.apache.uima:AlchemyAPIAnnotator:2.3.2-SNAPSHOT
sessionEnded
[INFO] ------------------------------------------------------------------------
[INFO] Reactor Summary:
[INFO] 
[INFO] Apache UIMA-AddOns: uima-addons-parent ............ SUCCESS [2:28.366s]
[INFO] Apache UIMA Annotator: AlchemyAPIAnnotator ........ FAILURE [3:10.293s]
[INFO] Apache UIMA Annotator: BSFAnnotator ............... SKIPPED
[INFO] Apache UIMA Annotator: ConceptMapper .............. SKIPPED
[INFO] Apache UIMA Annotator: ConfigurableFeatureExtractor  SKIPPED
[INFO] Apache UIMA Annotator: DictionaryAnnotator ........ SKIPPED
[INFO] Apache UIMA Addon: FsVariables .................... SKIPPED
[INFO] Apache UIMA Annotator: Lucas ...................... SKIPPED
[INFO] Apache UIMA Annotator: OpenCalaisAnnotator ........ SKIPPED
[INFO] Apache UIMA Addon: PearPackagingAntTask ........... SKIPPED
[INFO] Apache UIMA Annotator: RegularExpressionAnnotator . SKIPPED
[INFO] Apache UIMA Addon: SimpleServer ................... SKIPPED
[INFO] Apache UIMA Annotator: SnowballAnnotator .......... SKIPPED
[INFO] Apache UIMA Annotator: Solrcas .................... SKIPPED
[INFO] Apache UIMA Annotator: Tagger ..................... SKIPPED
[INFO] Apache UIMA Annotator: TikaAnnotator .............. SKIPPED
[INFO] Apache UIMA Annotator: WhitespaceTokenizer ........ SKIPPED
[INFO] Apache UIMA Aggregate: uima-addons ................ SKIPPED
[INFO] ------------------------------------------------------------------------
[INFO] BUILD FAILURE
[INFO] ------------------------------------------------------------------------
[INFO] Total time: 6:28.109s
[INFO] Finished at: Fri Jan 11 09:14:29 GMT+00:00 2013
[INFO] Final Memory: 24M/66M
[INFO] ------------------------------------------------------------------------
Projects to build: [MavenProject: org.apache.uima:uima-addons-parent:2.3.2-SNAPSHOT @ <https://builds.apache.org/job/UIMA%20Addons/ws/uima-addons-parent/pom.xml,>
MavenProject: org.apache.uima:AlchemyAPIAnnotator:2.3.2-SNAPSHOT @ <https://builds.apache.org/job/UIMA%20Addons/ws/AlchemyAPIAnnotator/pom.xml,>
MavenProject: org.apache.uima:BSFAnnotator:2.3.2-SNAPSHOT @ <https://builds.apache.org/job/UIMA%20Addons/ws/BSFAnnotator/pom.xml,>
MavenProject: org.apache.uima:ConceptMapper:2.3.2-SNAPSHOT @ <https://builds.apache.org/job/UIMA%20Addons/ws/ConceptMapper/pom.xml,>
MavenProject: org.apache.uima:ConfigurableFeatureExtractor:2.3.2-SNAPSHOT @ <https://builds.apache.org/job/UIMA%20Addons/ws/ConfigurableFeatureExtractor/pom.xml,>
MavenProject: org.apache.uima:DictionaryAnnotator:2.3.2-SNAPSHOT @ <https://builds.apache.org/job/UIMA%20Addons/ws/DictionaryAnnotator/pom.xml,>
MavenProject: org.apache.uima:FsVariables:2.3.2-SNAPSHOT @ <https://builds.apache.org/job/UIMA%20Addons/ws/FsVariables/pom.xml,>
MavenProject: org.apache.uima:Lucas:2.3.2-SNAPSHOT @ <https://builds.apache.org/job/UIMA%20Addons/ws/Lucas/pom.xml,>
MavenProject: org.apache.uima:OpenCalaisAnnotator:2.3.2-SNAPSHOT @ <https://builds.apache.org/job/UIMA%20Addons/ws/OpenCalaisAnnotator/pom.xml,>
MavenProject: org.apache.uima:PearPackagingAntTask:2.3.2-SNAPSHOT @ <https://builds.apache.org/job/UIMA%20Addons/ws/PearPackagingAntTask/pom.xml,>
MavenProject: org.apache.uima:RegularExpressionAnnotator:2.3.2-SNAPSHOT @ <https://builds.apache.org/job/UIMA%20Addons/ws/RegularExpressionAnnotator/pom.xml,>
MavenProject: org.apache.uima:SimpleServer:2.3.2-SNAPSHOT @ <https://builds.apache.org/job/UIMA%20Addons/ws/SimpleServer/pom.xml,>
MavenProject: org.apache.uima:SnowballAnnotator:2.3.2-SNAPSHOT @ <https://builds.apache.org/job/UIMA%20Addons/ws/SnowballAnnotator/pom.xml,>
MavenProject: org.apache.uima:Solrcas:2.3.2-SNAPSHOT @ <https://builds.apache.org/job/UIMA%20Addons/ws/Solrcas/pom.xml,>
MavenProject: org.apache.uima:Tagger:2.3.2-SNAPSHOT @ <https://builds.apache.org/job/UIMA%20Addons/ws/Tagger/pom.xml,>
MavenProject: org.apache.uima:TikaAnnotator:2.3.2-SNAPSHOT @ <https://builds.apache.org/job/UIMA%20Addons/ws/TikaAnnotator/pom.xml,>
MavenProject: org.apache.uima:WhitespaceTokenizer:2.3.2-SNAPSHOT @ <https://builds.apache.org/job/UIMA%20Addons/ws/WhitespaceTokenizer/pom.xml,>
MavenProject: org.apache.uima:uima-addons:2.3.2-SNAPSHOT @ <https://builds.apache.org/job/UIMA%20Addons/ws/pom.xml]>
[JENKINS] Archiving <https://builds.apache.org/job/UIMA%20Addons/ws/SimpleServer/pom.xml>
to /home/hudson/hudson/jobs/UIMA Addons/modules/org.apache.uima$SimpleServer/builds/2013-01-11_09-05-08/archive/org.apache.uima/SimpleServer/2.3.2-SNAPSHOT/SimpleServer-2.3.2-SNAPSHOT.pom
[JENKINS] Archiving <https://builds.apache.org/job/UIMA%20Addons/ws/ConfigurableFeatureExtractor/pom.xml>
to /home/hudson/hudson/jobs/UIMA Addons/modules/org.apache.uima$ConfigurableFeatureExtractor/builds/2013-01-11_09-05-05/archive/org.apache.uima/ConfigurableFeatureExtractor/2.3.2-SNAPSHOT/ConfigurableFeatureExtractor-2.3.2-SNAPSHOT.pom
[JENKINS] Archiving <https://builds.apache.org/job/UIMA%20Addons/ws/DictionaryAnnotator/pom.xml>
to /home/hudson/hudson/jobs/UIMA Addons/modules/org.apache.uima$DictionaryAnnotator/builds/2013-01-11_09-05-06/archive/org.apache.uima/DictionaryAnnotator/2.3.2-SNAPSHOT/DictionaryAnnotator-2.3.2-SNAPSHOT.pom
[JENKINS] Archiving <https://builds.apache.org/job/UIMA%20Addons/ws/TikaAnnotator/pom.xml>
to /home/hudson/hudson/jobs/UIMA Addons/modules/org.apache.uima$TikaAnnotator/builds/2013-01-11_09-05-09/archive/org.apache.uima/TikaAnnotator/2.3.2-SNAPSHOT/TikaAnnotator-2.3.2-SNAPSHOT.pom
[JENKINS] Archiving <https://builds.apache.org/job/UIMA%20Addons/ws/FsVariables/pom.xml>
to /home/hudson/hudson/jobs/UIMA Addons/modules/org.apache.uima$FsVariables/builds/2013-01-11_09-05-06/archive/org.apache.uima/FsVariables/2.3.2-SNAPSHOT/FsVariables-2.3.2-SNAPSHOT.pom
[JENKINS] Archiving <https://builds.apache.org/job/UIMA%20Addons/ws/Tagger/pom.xml>
to /home/hudson/hudson/jobs/UIMA Addons/modules/org.apache.uima$Tagger/builds/2013-01-11_09-05-09/archive/org.apache.uima/Tagger/2.3.2-SNAPSHOT/Tagger-2.3.2-SNAPSHOT.pom
[JENKINS] Archiving <https://builds.apache.org/job/UIMA%20Addons/ws/PearPackagingAntTask/pom.xml>
to /home/hudson/hudson/jobs/UIMA Addons/modules/org.apache.uima$PearPackagingAntTask/builds/2013-01-11_09-05-07/archive/org.apache.uima/PearPackagingAntTask/2.3.2-SNAPSHOT/PearPackagingAntTask-2.3.2-SNAPSHOT.pom
[JENKINS] Archiving <https://builds.apache.org/job/UIMA%20Addons/ws/Solrcas/pom.xml>
to /home/hudson/hudson/jobs/UIMA Addons/modules/org.apache.uima$Solrcas/builds/2013-01-11_09-05-08/archive/org.apache.uima/Solrcas/2.3.2-SNAPSHOT/Solrcas-2.3.2-SNAPSHOT.pom
[JENKINS] Archiving <https://builds.apache.org/job/UIMA%20Addons/ws/AlchemyAPIAnnotator/pom.xml>
to /home/hudson/hudson/jobs/UIMA Addons/modules/org.apache.uima$AlchemyAPIAnnotator/builds/2013-01-11_09-05-04/archive/org.apache.uima/AlchemyAPIAnnotator/2.3.2-SNAPSHOT/AlchemyAPIAnnotator-2.3.2-SNAPSHOT.pom
[JENKINS] Archiving <https://builds.apache.org/job/UIMA%20Addons/ws/OpenCalaisAnnotator/pom.xml>
to /home/hudson/hudson/jobs/UIMA Addons/modules/org.apache.uima$OpenCalaisAnnotator/builds/2013-01-11_09-05-07/archive/org.apache.uima/OpenCalaisAnnotator/2.3.2-SNAPSHOT/OpenCalaisAnnotator-2.3.2-SNAPSHOT.pom
[JENKINS] Archiving <https://builds.apache.org/job/UIMA%20Addons/ws/pom.xml> to /home/hudson/hudson/jobs/UIMA
Addons/modules/org.apache.uima$uima-addons/builds/2013-01-11_09-05-04/archive/org.apache.uima/uima-addons/2.3.2-SNAPSHOT/uima-addons-2.3.2-SNAPSHOT.pom
[JENKINS] Archiving <https://builds.apache.org/job/UIMA%20Addons/ws/WhitespaceTokenizer/pom.xml>
to /home/hudson/hudson/jobs/UIMA Addons/modules/org.apache.uima$WhitespaceTokenizer/builds/2013-01-11_09-05-09/archive/org.apache.uima/WhitespaceTokenizer/2.3.2-SNAPSHOT/WhitespaceTokenizer-2.3.2-SNAPSHOT.pom
[JENKINS] Archiving <https://builds.apache.org/job/UIMA%20Addons/ws/ConceptMapper/pom.xml>
to /home/hudson/hudson/jobs/UIMA Addons/modules/org.apache.uima$ConceptMapper/builds/2013-01-11_09-05-05/archive/org.apache.uima/ConceptMapper/2.3.2-SNAPSHOT/ConceptMapper-2.3.2-SNAPSHOT.pom
[JENKINS] Archiving <https://builds.apache.org/job/UIMA%20Addons/ws/RegularExpressionAnnotator/pom.xml>
to /home/hudson/hudson/jobs/UIMA Addons/modules/org.apache.uima$RegularExpressionAnnotator/builds/2013-01-11_09-05-07/archive/org.apache.uima/RegularExpressionAnnotator/2.3.2-SNAPSHOT/RegularExpressionAnnotator-2.3.2-SNAPSHOT.pom
[JENKINS] Archiving <https://builds.apache.org/job/UIMA%20Addons/ws/BSFAnnotator/pom.xml>
to /home/hudson/hudson/jobs/UIMA Addons/modules/org.apache.uima$BSFAnnotator/builds/2013-01-11_09-05-05/archive/org.apache.uima/BSFAnnotator/2.3.2-SNAPSHOT/BSFAnnotator-2.3.2-SNAPSHOT.pom
[JENKINS] Archiving <https://builds.apache.org/job/UIMA%20Addons/ws/uima-addons-parent/pom.xml>
to /home/hudson/hudson/jobs/UIMA Addons/modules/org.apache.uima$uima-addons-parent/builds/2013-01-11_09-05-04/archive/org.apache.uima/uima-addons-parent/2.3.2-SNAPSHOT/uima-addons-parent-2.3.2-SNAPSHOT.pom
[JENKINS] Archiving <https://builds.apache.org/job/UIMA%20Addons/ws/SnowballAnnotator/pom.xml>
to /home/hudson/hudson/jobs/UIMA Addons/modules/org.apache.uima$SnowballAnnotator/builds/2013-01-11_09-05-08/archive/org.apache.uima/SnowballAnnotator/2.3.2-SNAPSHOT/SnowballAnnotator-2.3.2-SNAPSHOT.pom
[JENKINS] Archiving <https://builds.apache.org/job/UIMA%20Addons/ws/Lucas/pom.xml> to
/home/hudson/hudson/jobs/UIMA Addons/modules/org.apache.uima$Lucas/builds/2013-01-11_09-05-06/archive/org.apache.uima/Lucas/2.3.2-SNAPSHOT/Lucas-2.3.2-SNAPSHOT.pom
Waiting for Jenkins to finish collecting data
mavenExecutionResult exceptions not empty
message : Failed to execute goal org.apache.maven.plugins:maven-jar-plugin:2.3.1:jar (default-jar)
on project AlchemyAPIAnnotator: Error assembling JAR
cause : Error assembling JAR
Stack trace : 
org.apache.maven.lifecycle.LifecycleExecutionException: Failed to execute goal org.apache.maven.plugins:maven-jar-plugin:2.3.1:jar
(default-jar) on project AlchemyAPIAnnotator: Error assembling JAR
	at org.apache.maven.lifecycle.internal.MojoExecutor.execute(MojoExecutor.java:217)
	at org.apache.maven.lifecycle.internal.MojoExecutor.execute(MojoExecutor.java:153)
	at org.apache.maven.lifecycle.internal.MojoExecutor.execute(MojoExecutor.java:145)
	at org.apache.maven.lifecycle.internal.LifecycleModuleBuilder.buildProject(LifecycleModuleBuilder.java:84)
	at org.apache.maven.lifecycle.internal.LifecycleModuleBuilder.buildProject(LifecycleModuleBuilder.java:59)
	at org.apache.maven.lifecycle.internal.LifecycleStarter.singleThreadedBuild(LifecycleStarter.java:183)
	at org.apache.maven.lifecycle.internal.LifecycleStarter.execute(LifecycleStarter.java:161)
	at org.apache.maven.DefaultMaven.doExecute(DefaultMaven.java:319)
	at org.apache.maven.DefaultMaven.execute(DefaultMaven.java:156)
	at org.jvnet.hudson.maven3.launcher.Maven3Launcher.main(Maven3Launcher.java:79)
	at sun.reflect.NativeMethodAccessorImpl.invoke0(Native Method)
	at sun.reflect.NativeMethodAccessorImpl.invoke(NativeMethodAccessorImpl.java:39)
	at sun.reflect.DelegatingMethodAccessorImpl.invoke(DelegatingMethodAccessorImpl.java:25)
	at java.lang.reflect.Method.invoke(Method.java:592)
	at org.codehaus.plexus.classworlds.launcher.Launcher.launchStandard(Launcher.java:329)
	at org.codehaus.plexus.classworlds.launcher.Launcher.launch(Launcher.java:239)
	at org.jvnet.hudson.maven3.agent.Maven3Main.launch(Maven3Main.java:158)
	at hudson.maven.Maven3Builder.call(Maven3Builder.java:100)
	at hudson.maven.Maven3Builder.call(Maven3Builder.java:66)
	at hudson.remoting.UserRequest.perform(UserRequest.java:118)
	at hudson.remoting.UserRequest.perform(UserRequest.java:48)
	at hudson.remoting.Request$2.run(Request.java:326)
	at hudson.remoting.InterceptingExecutorService$1.call(InterceptingExecutorService.java:72)
	at java.util.concurrent.FutureTask$Sync.innerRun(FutureTask.java:269)
	at java.util.concurrent.FutureTask.run(FutureTask.java:123)
	at java.util.concurrent.ThreadPoolExecutor$Worker.runTask(ThreadPoolExecutor.java:651)
	at java.util.concurrent.ThreadPoolExecutor$Worker.run(ThreadPoolExecutor.java:676)
	at java.lang.Thread.run(Thread.java:595)
Caused by: org.apache.maven.plugin.MojoExecutionException: Error assembling JAR
	at org.apache.maven.plugin.jar.AbstractJarMojo.createArchive(AbstractJarMojo.java:223)
	at org.apache.maven.plugin.jar.AbstractJarMojo.execute(AbstractJarMojo.java:235)
	at org.apache.maven.plugin.DefaultBuildPluginManager.executeMojo(DefaultBuildPluginManager.java:101)
	at org.apache.maven.lifecycle.internal.MojoExecutor.execute(MojoExecutor.java:209)
	... 27 more
Caused by: org.codehaus.plexus.archiver.ArchiverException: Failed to read filesystem attributes
for: <https://builds.apache.org/job/UIMA%20Addons/ws/AlchemyAPIAnnotator/pom.xml>
	at org.codehaus.plexus.archiver.ArchiveEntry.createFileEntry(ArchiveEntry.java:161)
	at org.codehaus.plexus.archiver.AbstractArchiver.addFile(AbstractArchiver.java:374)
	at org.codehaus.plexus.archiver.AbstractArchiver.addFile(AbstractArchiver.java:290)
	at org.apache.maven.archiver.MavenArchiver.createArchive(MavenArchiver.java:487)
	at org.apache.maven.plugin.jar.AbstractJarMojo.createArchive(AbstractJarMojo.java:216)
	... 30 more
Caused by: java.io.IOException: Failed to retrieve numeric file attributes using: '/bin/sh
-c ls -1nlad '<https://builds.apache.org/job/UIMA%20Addons/ws/AlchemyAPIAnnotator/pom.xml''>
	at org.codehaus.plexus.components.io.attributes.PlexusIoResourceAttributeUtils.executeLs(PlexusIoResourceAttributeUtils.java:287)
	at org.codehaus.plexus.components.io.attributes.PlexusIoResourceAttributeUtils.getFileAttributesByPath(PlexusIoResourceAttributeUtils.java:223)
	at org.codehaus.plexus.components.io.attributes.PlexusIoResourceAttributeUtils.getFileAttributes(PlexusIoResourceAttributeUtils.java:168)
	at org.codehaus.plexus.archiver.ArchiveEntry.createFileEntry(ArchiveEntry.java:157)
	... 34 more
Caused by: org.codehaus.plexus.util.cli.CommandLineException: Error while executing process.
	at org.codehaus.plexus.util.cli.Commandline.execute(Commandline.java:656)
	at org.codehaus.plexus.util.cli.CommandLineUtils.executeCommandLine(CommandLineUtils.java:144)
	at org.codehaus.plexus.util.cli.CommandLineUtils.executeCommandLine(CommandLineUtils.java:107)
	at org.codehaus.plexus.components.io.attributes.PlexusIoResourceAttributeUtils.executeLs(PlexusIoResourceAttributeUtils.java:277)
	... 37 more
Caused by: java.io.IOException: Not enough space
	at java.lang.UNIXProcess.forkAndExec(Native Method)
	at java.lang.UNIXProcess.<init>(UNIXProcess.java:53)
	at java.lang.ProcessImpl.start(ProcessImpl.java:65)
	at java.lang.ProcessBuilder.start(ProcessBuilder.java:451)
	at java.lang.Runtime.exec(Runtime.java:591)
	at java.lang.Runtime.exec(Runtime.java:507)
	at org.codehaus.plexus.util.cli.Commandline.execute(Commandline.java:636)
	... 40 more
channel stopped

Mime
View raw message