uima-dev mailing list archives

Site index · List index
Message view « Date » · « Thread »
Top « Date » · « Thread »
From Apache Jenkins Server <jenk...@builds.apache.org>
Subject Build failed in Jenkins: UIMA-AS #169
Date Sat, 12 Jan 2013 21:46:40 GMT
See <https://builds.apache.org/job/UIMA-AS/169/changes>

Changes:

[schor] [UIMA-2568] Add update site pom project for uima-as eclipse update site.

[schor] Initial import.

------------------------------------------
[...truncated 131480 lines...]
Downloading: http://repo1.maven.org/maven2/commons-collections/commons-collections/3.0/commons-collections-3.0.pom
Downloaded: http://repo1.maven.org/maven2/commons-collections/commons-collections/3.0/commons-collections-3.0.pom
(6 KB at 41.2 KB/sec)
Downloading: http://repo1.maven.org/maven2/commons-httpclient/commons-httpclient/3.0.1/commons-httpclient-3.0.1.pom
Downloaded: http://repo1.maven.org/maven2/commons-httpclient/commons-httpclient/3.0.1/commons-httpclient-3.0.1.pom
(8 KB at 1319.8 KB/sec)
Downloading: http://repo1.maven.org/maven2/org/apache/velocity/velocity/1.7/velocity-1.7.pom
Downloaded: http://repo1.maven.org/maven2/org/apache/velocity/velocity/1.7/velocity-1.7.pom
(11 KB at 1767.1 KB/sec)
Downloading: http://repo1.maven.org/maven2/org/apache/velocity/velocity-tools/2.0/velocity-tools-2.0.pom
Downloaded: http://repo1.maven.org/maven2/org/apache/velocity/velocity-tools/2.0/velocity-tools-2.0.pom
(18 KB at 2962.2 KB/sec)
Downloading: http://repo1.maven.org/maven2/commons-digester/commons-digester/1.8/commons-digester-1.8.pom
Downloaded: http://repo1.maven.org/maven2/commons-digester/commons-digester/1.8/commons-digester-1.8.pom
(7 KB at 1140.0 KB/sec)
Downloading: http://repo1.maven.org/maven2/commons-chain/commons-chain/1.1/commons-chain-1.1.pom
Downloaded: http://repo1.maven.org/maven2/commons-chain/commons-chain/1.1/commons-chain-1.1.pom
(6 KB at 838.9 KB/sec)
Downloading: http://repo1.maven.org/maven2/commons-validator/commons-validator/1.3.1/commons-validator-1.3.1.pom
Downloaded: http://repo1.maven.org/maven2/commons-validator/commons-validator/1.3.1/commons-validator-1.3.1.pom
(9 KB at 1469.1 KB/sec)
Downloading: http://repo1.maven.org/maven2/dom4j/dom4j/1.1/dom4j-1.1.pom
Downloaded: http://repo1.maven.org/maven2/dom4j/dom4j/1.1/dom4j-1.1.pom (142 B at 17.3 KB/sec)
Downloading: http://repo1.maven.org/maven2/sslext/sslext/1.2-0/sslext-1.2-0.pom
Downloaded: http://repo1.maven.org/maven2/sslext/sslext/1.2-0/sslext-1.2-0.pom (653 B at 106.3
KB/sec)
Downloading: http://repo1.maven.org/maven2/org/apache/struts/struts-core/1.3.8/struts-core-1.3.8.pom
Downloaded: http://repo1.maven.org/maven2/org/apache/struts/struts-core/1.3.8/struts-core-1.3.8.pom
(5 KB at 601.6 KB/sec)
Downloading: http://repo1.maven.org/maven2/org/apache/struts/struts-parent/1.3.8/struts-parent-1.3.8.pom
Downloaded: http://repo1.maven.org/maven2/org/apache/struts/struts-parent/1.3.8/struts-parent-1.3.8.pom
(10 KB at 1601.4 KB/sec)
Downloading: http://repo1.maven.org/maven2/org/apache/struts/struts-master/4/struts-master-4.pom
Downloaded: http://repo1.maven.org/maven2/org/apache/struts/struts-master/4/struts-master-4.pom
(12 KB at 1925.6 KB/sec)
Downloading: http://repo1.maven.org/maven2/org/apache/apache/2/apache-2.pom
Downloaded: http://repo1.maven.org/maven2/org/apache/apache/2/apache-2.pom (4 KB at 665.8
KB/sec)
Downloading: http://repo1.maven.org/maven2/org/apache/struts/struts-taglib/1.3.8/struts-taglib-1.3.8.pom
Downloaded: http://repo1.maven.org/maven2/org/apache/struts/struts-taglib/1.3.8/struts-taglib-1.3.8.pom
(4 KB at 500.7 KB/sec)
Downloading: http://repo1.maven.org/maven2/org/apache/struts/struts-tiles/1.3.8/struts-tiles-1.3.8.pom
Downloaded: http://repo1.maven.org/maven2/org/apache/struts/struts-tiles/1.3.8/struts-tiles-1.3.8.pom
(3 KB at 177.3 KB/sec)
Downloading: http://repo1.maven.org/maven2/org/apache/xmlrpc/xmlrpc-client/3.0/xmlrpc-client-3.0.pom
Downloaded: http://repo1.maven.org/maven2/org/apache/xmlrpc/xmlrpc-client/3.0/xmlrpc-client-3.0.pom
(808 B at 2.3 KB/sec)
Downloading: http://repo1.maven.org/maven2/org/apache/xmlrpc/xmlrpc/3.0/xmlrpc-3.0.pom
Downloaded: http://repo1.maven.org/maven2/org/apache/xmlrpc/xmlrpc/3.0/xmlrpc-3.0.pom (12
KB at 123.1 KB/sec)
Downloading: http://repo1.maven.org/maven2/org/apache/xmlrpc/xmlrpc-common/3.0/xmlrpc-common-3.0.pom
Downloaded: http://repo1.maven.org/maven2/org/apache/xmlrpc/xmlrpc-common/3.0/xmlrpc-common-3.0.pom
(854 B at 11.9 KB/sec)
Downloading: http://repo1.maven.org/maven2/org/apache/ws/commons/ws-commons-util/1.0.1/ws-commons-util-1.0.1.pom
Downloaded: http://repo1.maven.org/maven2/org/apache/ws/commons/ws-commons-util/1.0.1/ws-commons-util-1.0.1.pom
(6 KB at 70.3 KB/sec)
Downloading: http://repo1.maven.org/maven2/org/eclipse/mylyn/github/org.eclipse.egit.github.core/1.2.0/org.eclipse.egit.github.core-1.2.0.pom
Downloaded: http://repo1.maven.org/maven2/org/eclipse/mylyn/github/org.eclipse.egit.github.core/1.2.0/org.eclipse.egit.github.core-1.2.0.pom
(6 KB at 13.2 KB/sec)
Downloading: http://repo1.maven.org/maven2/org/sonatype/oss/oss-parent/7/oss-parent-7.pom
Downloaded: http://repo1.maven.org/maven2/org/sonatype/oss/oss-parent/7/oss-parent-7.pom (5
KB at 785.2 KB/sec)
Downloading: http://repo1.maven.org/maven2/org/apache/httpcomponents/httpclient/4.1.2/httpclient-4.1.2.pom
Downloaded: http://repo1.maven.org/maven2/org/apache/httpcomponents/httpclient/4.1.2/httpclient-4.1.2.pom
(6 KB at 95.9 KB/sec)
Downloading: http://repo1.maven.org/maven2/org/apache/httpcomponents/httpcomponents-client/4.1.2/httpcomponents-client-4.1.2.pom
Downloaded: http://repo1.maven.org/maven2/org/apache/httpcomponents/httpcomponents-client/4.1.2/httpcomponents-client-4.1.2.pom
(12 KB at 156.6 KB/sec)
Downloading: http://repo1.maven.org/maven2/org/apache/httpcomponents/project/4.1.1/project-4.1.1.pom
Downloaded: http://repo1.maven.org/maven2/org/apache/httpcomponents/project/4.1.1/project-4.1.1.pom
(17 KB at 105.6 KB/sec)
Downloading: http://repo1.maven.org/maven2/org/apache/httpcomponents/httpcore/4.1.2/httpcore-4.1.2.pom
Downloaded: http://repo1.maven.org/maven2/org/apache/httpcomponents/httpcore/4.1.2/httpcore-4.1.2.pom
(8 KB at 85.9 KB/sec)
Downloading: http://repo1.maven.org/maven2/org/apache/httpcomponents/httpcomponents-core/4.1.2/httpcomponents-core-4.1.2.pom
Downloaded: http://repo1.maven.org/maven2/org/apache/httpcomponents/httpcomponents-core/4.1.2/httpcomponents-core-4.1.2.pom
(10 KB at 147.2 KB/sec)
Downloading: http://repo1.maven.org/maven2/commons-codec/commons-codec/1.4/commons-codec-1.4.pom
Downloaded: http://repo1.maven.org/maven2/commons-codec/commons-codec/1.4/commons-codec-1.4.pom
(11 KB at 1281.0 KB/sec)
Downloading: http://repo1.maven.org/maven2/org/apache/httpcomponents/httpcore/4.1.3/httpcore-4.1.3.pom
Downloaded: http://repo1.maven.org/maven2/org/apache/httpcomponents/httpcore/4.1.3/httpcore-4.1.3.pom
(8 KB at 160.4 KB/sec)
Downloading: http://repo1.maven.org/maven2/org/apache/httpcomponents/httpcomponents-core/4.1.3/httpcomponents-core-4.1.3.pom
Downloaded: http://repo1.maven.org/maven2/org/apache/httpcomponents/httpcomponents-core/4.1.3/httpcomponents-core-4.1.3.pom
(10 KB at 273.4 KB/sec)
Downloading: http://repo1.maven.org/maven2/org/apache/httpcomponents/httpmime/4.1.2/httpmime-4.1.2.pom
Downloaded: http://repo1.maven.org/maven2/org/apache/httpcomponents/httpmime/4.1.2/httpmime-4.1.2.pom
(6 KB at 83.2 KB/sec)
Downloading: http://repo1.maven.org/maven2/com/google/code/gson/gson/1.7.2/gson-1.7.2.pom
Downloaded: http://repo1.maven.org/maven2/com/google/code/gson/gson/1.7.2/gson-1.7.2.pom (10
KB at 54.2 KB/sec)
Downloading: http://repo1.maven.org/maven2/org/sonatype/oss/oss-parent/5/oss-parent-5.pom
Downloaded: http://repo1.maven.org/maven2/org/sonatype/oss/oss-parent/5/oss-parent-5.pom (4
KB at 664.4 KB/sec)
Downloading: http://repo1.maven.org/maven2/org/slf4j/slf4j-jdk14/1.5.6/slf4j-jdk14-1.5.6.jar
Downloading: http://repo1.maven.org/maven2/org/slf4j/slf4j-api/1.5.6/slf4j-api-1.5.6.jar
Downloading: http://repo1.maven.org/maven2/org/slf4j/jcl-over-slf4j/1.5.6/jcl-over-slf4j-1.5.6.jar
Downloading: http://repo1.maven.org/maven2/commons-cli/commons-cli/1.2/commons-cli-1.2.jar
Downloading: http://repo1.maven.org/maven2/backport-util-concurrent/backport-util-concurrent/3.1/backport-util-concurrent-3.1.jar
Downloaded: http://repo1.maven.org/maven2/org/slf4j/slf4j-jdk14/1.5.6/slf4j-jdk14-1.5.6.jar
(9 KB at 1229.8 KB/sec)
Downloading: http://repo1.maven.org/maven2/org/apache/maven/reporting/maven-reporting-impl/2.1/maven-reporting-impl-2.1.jar
Downloaded: http://repo1.maven.org/maven2/org/slf4j/jcl-over-slf4j/1.5.6/jcl-over-slf4j-1.5.6.jar
(17 KB at 1633.0 KB/sec)
Downloading: http://repo1.maven.org/maven2/org/codehaus/plexus/plexus-mail-sender-api/1.0-alpha-7/plexus-mail-sender-api-1.0-alpha-7.jar
Downloaded: http://repo1.maven.org/maven2/org/slf4j/slf4j-api/1.5.6/slf4j-api-1.5.6.jar (22
KB at 2181.4 KB/sec)
Downloading: http://repo1.maven.org/maven2/org/apache/geronimo/javamail/geronimo-javamail_1.4_provider/1.7/geronimo-javamail_1.4_provider-1.7.jar
Downloaded: http://repo1.maven.org/maven2/commons-cli/commons-cli/1.2/commons-cli-1.2.jar
(41 KB at 4015.9 KB/sec)
Downloading: http://repo1.maven.org/maven2/org/apache/geronimo/specs/geronimo-javamail_1.4_spec/1.7/geronimo-javamail_1.4_spec-1.7.jar
Downloaded: http://repo1.maven.org/maven2/org/apache/maven/reporting/maven-reporting-impl/2.1/maven-reporting-impl-2.1.jar
(17 KB at 3238.3 KB/sec)
Downloading: http://repo1.maven.org/maven2/org/apache/geronimo/javamail/geronimo-javamail_1.4_mail/1.7/geronimo-javamail_1.4_mail-1.7.jar
Downloaded: http://repo1.maven.org/maven2/backport-util-concurrent/backport-util-concurrent/3.1/backport-util-concurrent-3.1.jar
(324 KB at 17049.5 KB/sec)
Downloading: http://repo1.maven.org/maven2/org/codehaus/plexus/plexus-mail-sender-javamail/1.0-alpha-7/plexus-mail-sender-javamail-1.0-alpha-7.jar
Downloaded: http://repo1.maven.org/maven2/org/apache/geronimo/javamail/geronimo-javamail_1.4_provider/1.7/geronimo-javamail_1.4_provider-1.7.jar
(227 KB at 3334.3 KB/sec)
Downloading: http://repo1.maven.org/maven2/org/codehaus/plexus/plexus-mail-sender-simple/1.0-alpha-7/plexus-mail-sender-simple-1.0-alpha-7.jar
Downloaded: http://repo1.maven.org/maven2/org/codehaus/plexus/plexus-mail-sender-javamail/1.0-alpha-7/plexus-mail-sender-javamail-1.0-alpha-7.jar
(12 KB at 45.8 KB/sec)
Downloading: http://repo1.maven.org/maven2/commons-collections/commons-collections/3.0/commons-collections-3.0.jar
Downloaded: http://repo1.maven.org/maven2/org/codehaus/plexus/plexus-mail-sender-api/1.0-alpha-7/plexus-mail-sender-api-1.0-alpha-7.jar
(10 KB at 29.3 KB/sec)
Downloading: http://repo1.maven.org/maven2/commons-httpclient/commons-httpclient/3.0.1/commons-httpclient-3.0.1.jar
Downloaded: http://repo1.maven.org/maven2/org/codehaus/plexus/plexus-mail-sender-simple/1.0-alpha-7/plexus-mail-sender-simple-1.0-alpha-7.jar
(12 KB at 42.1 KB/sec)
Downloading: http://repo1.maven.org/maven2/org/apache/velocity/velocity/1.7/velocity-1.7.jar
Downloaded: http://repo1.maven.org/maven2/commons-httpclient/commons-httpclient/3.0.1/commons-httpclient-3.0.1.jar
(274 KB at 14380.2 KB/sec)
Downloading: http://repo1.maven.org/maven2/org/apache/velocity/velocity-tools/2.0/velocity-tools-2.0.jar
Downloaded: http://repo1.maven.org/maven2/org/apache/velocity/velocity-tools/2.0/velocity-tools-2.0.jar
(339 KB at 26035.2 KB/sec)
Downloading: http://repo1.maven.org/maven2/commons-digester/commons-digester/1.8/commons-digester-1.8.jar
Downloaded: http://repo1.maven.org/maven2/org/apache/geronimo/javamail/geronimo-javamail_1.4_mail/1.7/geronimo-javamail_1.4_mail-1.7.jar
(425 KB at 1235.0 KB/sec)
Downloading: http://repo1.maven.org/maven2/commons-chain/commons-chain/1.1/commons-chain-1.1.jar
Downloaded: http://repo1.maven.org/maven2/org/apache/velocity/velocity/1.7/velocity-1.7.jar
(439 KB at 25821.7 KB/sec)
Downloading: http://repo1.maven.org/maven2/dom4j/dom4j/1.1/dom4j-1.1.jar
Downloaded: http://repo1.maven.org/maven2/commons-chain/commons-chain/1.1/commons-chain-1.1.jar
(88 KB at 10986.5 KB/sec)
Downloading: http://repo1.maven.org/maven2/sslext/sslext/1.2-0/sslext-1.2-0.jar
Downloaded: http://repo1.maven.org/maven2/commons-digester/commons-digester/1.8/commons-digester-1.8.jar
(141 KB at 11686.4 KB/sec)
Downloading: http://repo1.maven.org/maven2/org/apache/struts/struts-core/1.3.8/struts-core-1.3.8.jar
Downloaded: http://repo1.maven.org/maven2/sslext/sslext/1.2-0/sslext-1.2-0.jar (26 KB at 4266.8
KB/sec)
Downloading: http://repo1.maven.org/maven2/org/apache/struts/struts-taglib/1.3.8/struts-taglib-1.3.8.jar
Downloaded: http://repo1.maven.org/maven2/dom4j/dom4j/1.1/dom4j-1.1.jar (447 KB at 26247.3
KB/sec)
Downloading: http://repo1.maven.org/maven2/org/apache/struts/struts-tiles/1.3.8/struts-tiles-1.3.8.jar
Downloaded: http://repo1.maven.org/maven2/org/apache/struts/struts-core/1.3.8/struts-core-1.3.8.jar
(322 KB at 21412.5 KB/sec)
Downloading: http://repo1.maven.org/maven2/org/apache/xmlrpc/xmlrpc-client/3.0/xmlrpc-client-3.0.jar
Downloaded: http://repo1.maven.org/maven2/org/apache/struts/struts-taglib/1.3.8/struts-taglib-1.3.8.jar
(246 KB at 17544.7 KB/sec)
Downloading: http://repo1.maven.org/maven2/org/apache/xmlrpc/xmlrpc-common/3.0/xmlrpc-common-3.0.jar
Downloaded: http://repo1.maven.org/maven2/org/apache/struts/struts-tiles/1.3.8/struts-tiles-1.3.8.jar
(117 KB at 12983.2 KB/sec)
Downloading: http://repo1.maven.org/maven2/org/apache/ws/commons/ws-commons-util/1.0.1/ws-commons-util-1.0.1.jar
Downloaded: http://repo1.maven.org/maven2/org/apache/geronimo/specs/geronimo-javamail_1.4_spec/1.7/geronimo-javamail_1.4_spec-1.7.jar
(219 KB at 569.2 KB/sec)
Downloading: http://repo1.maven.org/maven2/org/eclipse/mylyn/github/org.eclipse.egit.github.core/1.2.0/org.eclipse.egit.github.core-1.2.0.jar
Downloaded: http://repo1.maven.org/maven2/org/apache/ws/commons/ws-commons-util/1.0.1/ws-commons-util-1.0.1.jar
(35 KB at 285.9 KB/sec)
Downloading: http://repo1.maven.org/maven2/org/apache/httpcomponents/httpmime/4.1.2/httpmime-4.1.2.jar
Downloaded: http://repo1.maven.org/maven2/org/apache/httpcomponents/httpmime/4.1.2/httpmime-4.1.2.jar
(27 KB at 4376.6 KB/sec)
Downloading: http://repo1.maven.org/maven2/com/google/code/gson/gson/1.7.2/gson-1.7.2.jar
Downloaded: http://repo1.maven.org/maven2/org/apache/xmlrpc/xmlrpc-client/3.0/xmlrpc-client-3.0.jar
(43 KB at 216.9 KB/sec)
Downloading: http://repo1.maven.org/maven2/org/apache/httpcomponents/httpcore/4.1.2/httpcore-4.1.2.jar
Downloaded: http://repo1.maven.org/maven2/com/google/code/gson/gson/1.7.2/gson-1.7.2.jar (170
KB at 1599.4 KB/sec)
Downloading: http://repo1.maven.org/maven2/org/apache/httpcomponents/httpclient/4.1.2/httpclient-4.1.2.jar
Downloaded: http://repo1.maven.org/maven2/org/apache/httpcomponents/httpcore/4.1.2/httpcore-4.1.2.jar
(177 KB at 2184.6 KB/sec)
Downloaded: http://repo1.maven.org/maven2/org/apache/httpcomponents/httpclient/4.1.2/httpclient-4.1.2.jar
(344 KB at 3155.9 KB/sec)
Downloaded: http://repo1.maven.org/maven2/org/eclipse/mylyn/github/org.eclipse.egit.github.core/1.2.0/org.eclipse.egit.github.core-1.2.0.jar
(158 KB at 381.9 KB/sec)
Downloaded: http://repo1.maven.org/maven2/org/apache/xmlrpc/xmlrpc-common/3.0/xmlrpc-common-3.0.jar
(96 KB at 72.4 KB/sec)
Downloaded: http://repo1.maven.org/maven2/commons-collections/commons-collections/3.0/commons-collections-3.0.jar
(507 KB at 289.9 KB/sec)
Downloading: http://repo1.maven.org/eclipse/org/apache/maven/skins/maven-default-skin/1.0/maven-default-skin-1.0.jar
Downloading: http://repo1.maven.org/maven2/org/apache/maven/skins/maven-default-skin/1.0/maven-default-skin-1.0.jar
Downloaded: http://repo1.maven.org/maven2/org/apache/maven/skins/maven-default-skin/1.0/maven-default-skin-1.0.jar
(8 KB at 797.7 KB/sec)
[WARNING] Deprecated API called - not org.apache.maven.doxia.sink.Sink instance and no SinkFactory
available. Please update this plugin.
[INFO] Downloading from JIRA at: https://issues.apache.org/jira/sr/jira.issueviews:searchrequest-xml/temp/SearchRequest.xml?tempMax=1000&reset=true&jqlQuery=project+%3D+UIMA+AND+fixVersion+in+%2812316312%29+AND+status+in+%28Closed%2C+Resolved%29+AND+resolution+in+%28Fixed%29+AND+component+in+%28%22Async+Scaleout%22%29+ORDER+BY+type+ASC%2C+status+ASC%2C+key+ASC
[INFO] The JIRA version is '5.2.1'
mojoSucceeded org.apache.maven.plugins:maven-changes-plugin:2.8(default-cli)
[debug] execute contextualize
mojoStarted org.apache.maven.plugins:maven-resources-plugin:2.5(copy-resources)[INFO] Using
'UTF-8' encoding to copy filtered resources.
[INFO] Copying 2 resources

[INFO] 
[INFO] --- maven-resources-plugin:2.5:copy-resources (copy-resources) @ uima-as ---
mojoSucceeded org.apache.maven.plugins:maven-resources-plugin:2.5(copy-resources)
mojoStarted org.apache.uima:uima-build-helper-maven-plugin:4(default)
[INFO] 
[INFO] --- uima-build-helper-maven-plugin:4:copy-from-apache-dist (default) @ uima-as ---
mojoFailed org.apache.uima:uima-build-helper-maven-plugin:4(default)
projectFailed org.apache.uima:uima-as:2.4.1-SNAPSHOT
sessionEnded
[INFO] ------------------------------------------------------------------------
[INFO] Reactor Summary:
[INFO] 
[INFO] Apache UIMA-AS: uima-as-parent .................... SUCCESS [18.591s]
[INFO] Apache UIMA-AS: uimaj-as-core ..................... SUCCESS [12.695s]
[INFO] Apache UIMA-AS: uimaj-as-jms ...................... SUCCESS [3.760s]
[INFO] Apache UIMA-AS: uimaj-as-activemq ................. SUCCESS [28:56.532s]
[INFO] Apache UIMA-AS Eclipse Plugin: uimaj-ep-runtime-deployeditor  SUCCESS [21.065s]
[INFO] Apache UIMA-AS Eclipse Plugin: uimaj-ep-deployeditor  SUCCESS [1:32.780s]
[INFO] Apache UIMA AS: uimaj-as-osgi-runtime ............. SUCCESS [9.904s]
[INFO] Apache UIMA-AS: uimaj-as-camel .................... SUCCESS [7.721s]
[INFO] Apache UIMA Eclipse: uimaj-eclipse-feature-deployeditor  SUCCESS [2.336s]
[INFO] Apache UIMA-AS Aggregate: aggregate-uima-as-eclipse-plugins  SUCCESS [0.765s]
[INFO] Apache UIMA-AS: uima-as-docbooks .................. SUCCESS [24.355s]
[INFO] Apache UIMA-AS Aggregate: aggregate-uima-as ....... SUCCESS [0.866s]
[INFO] Apache UIMA-AS: uima-as ........................... FAILURE [17.700s]
[INFO] ------------------------------------------------------------------------
[INFO] BUILD FAILURE
[INFO] ------------------------------------------------------------------------
[INFO] Total time: 32:37.687s
[INFO] Finished at: Sat Jan 12 21:46:20 UTC 2013
[INFO] Final Memory: 55M/262M
[INFO] ------------------------------------------------------------------------
Projects to build: [MavenProject: org.apache.uima:uima-as-parent:2.4.1-SNAPSHOT @ <https://builds.apache.org/job/UIMA-AS/ws/trunk/uima-as-parent/pom.xml,>
MavenProject: org.apache.uima:uimaj-as-core:2.4.1-SNAPSHOT @ <https://builds.apache.org/job/UIMA-AS/ws/trunk/uimaj-as-core/pom.xml,>
MavenProject: org.apache.uima:uimaj-as-jms:2.4.1-SNAPSHOT @ <https://builds.apache.org/job/UIMA-AS/ws/trunk/uimaj-as-jms/pom.xml,>
MavenProject: org.apache.uima:uimaj-as-activemq:2.4.1-SNAPSHOT @ <https://builds.apache.org/job/UIMA-AS/ws/trunk/uimaj-as-activemq/pom.xml,>
MavenProject: org.apache.uima:uimaj-ep-runtime-deployeditor:2.4.1-SNAPSHOT @ <https://builds.apache.org/job/UIMA-AS/ws/trunk/uimaj-ep-runtime-deployeditor/pom.xml,>
MavenProject: org.apache.uima:uimaj-ep-deployeditor:2.4.1-SNAPSHOT @ <https://builds.apache.org/job/UIMA-AS/ws/trunk/uimaj-ep-deployeditor/pom.xml,>
MavenProject: org.apache.uima:uimaj-as-osgi-runtime:2.4.1-SNAPSHOT @ <https://builds.apache.org/job/UIMA-AS/ws/trunk/uimaj-as-osgi-runtime/pom.xml,>
MavenProject: org.apache.uima:uimaj-as-camel:2.4.1-SNAPSHOT @ <https://builds.apache.org/job/UIMA-AS/ws/trunk/uimaj-as-camel/pom.xml,>
MavenProject: org.apache.uima:uimaj-eclipse-feature-deployeditor:2.4.0 @ <https://builds.apache.org/job/UIMA-AS/ws/trunk/uimaj-eclipse-feature-deployeditor/pom.xml,>
MavenProject: org.apache.uima:aggregate-uima-as-eclipse-plugins:2.4.1-SNAPSHOT @ <https://builds.apache.org/job/UIMA-AS/ws/trunk/aggregate-uima-as-eclipse-plugins/pom.xml,>
MavenProject: org.apache.uima:uima-as-docbooks:2.4.1-SNAPSHOT @ <https://builds.apache.org/job/UIMA-AS/ws/trunk/uima-as-docbooks/pom.xml,>
MavenProject: org.apache.uima:aggregate-uima-as:2.4.1-SNAPSHOT @ <https://builds.apache.org/job/UIMA-AS/ws/trunk/aggregate-uima-as/pom.xml,>
MavenProject: org.apache.uima:uima-as:2.4.1-SNAPSHOT @ <https://builds.apache.org/job/UIMA-AS/ws/trunk/pom.xml]>
[JENKINS] Archiving <https://builds.apache.org/job/UIMA-AS/ws/trunk/uima-as-docbooks/pom.xml>
to /home/hudson/hudson/jobs/UIMA-AS/modules/org.apache.uima$uima-as-docbooks/builds/2013-01-12_21-13-27/archive/org.apache.uima/uima-as-docbooks/2.4.1-SNAPSHOT/uima-as-docbooks-2.4.1-SNAPSHOT.pom
[JENKINS] Archiving <https://builds.apache.org/job/UIMA-AS/ws/trunk/uimaj-ep-runtime-deployeditor/pom.xml>
to /home/hudson/hudson/jobs/UIMA-AS/modules/org.apache.uima$uimaj-ep-runtime-deployeditor/builds/2013-01-12_21-13-25/archive/org.apache.uima/uimaj-ep-runtime-deployeditor/2.4.1-SNAPSHOT/uimaj-ep-runtime-deployeditor-2.4.1-SNAPSHOT.pom
[JENKINS] Archiving <https://builds.apache.org/job/UIMA-AS/ws/trunk/uimaj-ep-runtime-deployeditor/target/org.apache.uima.runtime.fragments.deployeditor_2.4.1.SNAPSHOT.jar>
to /home/hudson/hudson/jobs/UIMA-AS/modules/org.apache.uima$uimaj-ep-runtime-deployeditor/builds/2013-01-12_21-13-25/archive/org.apache.uima/uimaj-ep-runtime-deployeditor/2.4.1-SNAPSHOT/uimaj-ep-runtime-deployeditor-2.4.1-SNAPSHOT.jar
[JENKINS] Archiving <https://builds.apache.org/job/UIMA-AS/ws/trunk/aggregate-uima-as-eclipse-plugins/pom.xml>
to /home/hudson/hudson/jobs/UIMA-AS/modules/org.apache.uima$aggregate-uima-as-eclipse-plugins/builds/2013-01-12_21-13-25/archive/org.apache.uima/aggregate-uima-as-eclipse-plugins/2.4.1-SNAPSHOT/aggregate-uima-as-eclipse-plugins-2.4.1-SNAPSHOT.pom
[JENKINS] Archiving <https://builds.apache.org/job/UIMA-AS/ws/trunk/uimaj-as-jms/pom.xml>
to /home/hudson/hudson/jobs/UIMA-AS/modules/org.apache.uima$uimaj-as-jms/builds/2013-01-12_21-13-25/archive/org.apache.uima/uimaj-as-jms/2.4.1-SNAPSHOT/uimaj-as-jms-2.4.1-SNAPSHOT.pom
[JENKINS] Archiving <https://builds.apache.org/job/UIMA-AS/ws/trunk/uimaj-as-jms/target/uimaj-as-jms.jar>
to /home/hudson/hudson/jobs/UIMA-AS/modules/org.apache.uima$uimaj-as-jms/builds/2013-01-12_21-13-25/archive/org.apache.uima/uimaj-as-jms/2.4.1-SNAPSHOT/uimaj-as-jms-2.4.1-SNAPSHOT.jar
[JENKINS] Archiving <https://builds.apache.org/job/UIMA-AS/ws/trunk/uimaj-as-osgi-runtime/pom.xml>
to /home/hudson/hudson/jobs/UIMA-AS/modules/org.apache.uima$uimaj-as-osgi-runtime/builds/2013-01-12_21-13-25/archive/org.apache.uima/uimaj-as-osgi-runtime/2.4.1-SNAPSHOT/uimaj-as-osgi-runtime-2.4.1-SNAPSHOT.pom
[JENKINS] Archiving <https://builds.apache.org/job/UIMA-AS/ws/trunk/uimaj-as-osgi-runtime/target/org.apache.uima.runtime.uimaas_2.4.1.SNAPSHOT.jar>
to /home/hudson/hudson/jobs/UIMA-AS/modules/org.apache.uima$uimaj-as-osgi-runtime/builds/2013-01-12_21-13-25/archive/org.apache.uima/uimaj-as-osgi-runtime/2.4.1-SNAPSHOT/uimaj-as-osgi-runtime-2.4.1-SNAPSHOT.jar
[JENKINS] Archiving <https://builds.apache.org/job/UIMA-AS/ws/trunk/aggregate-uima-as/pom.xml>
to /home/hudson/hudson/jobs/UIMA-AS/modules/org.apache.uima$aggregate-uima-as/builds/2013-01-12_21-13-23/archive/org.apache.uima/aggregate-uima-as/2.4.1-SNAPSHOT/aggregate-uima-as-2.4.1-SNAPSHOT.pom
[JENKINS] Archiving <https://builds.apache.org/job/UIMA-AS/ws/trunk/uimaj-as-activemq/pom.xml>
to /home/hudson/hudson/jobs/UIMA-AS/modules/org.apache.uima$uimaj-as-activemq/builds/2013-01-12_21-13-23/archive/org.apache.uima/uimaj-as-activemq/2.4.1-SNAPSHOT/uimaj-as-activemq-2.4.1-SNAPSHOT.pom
[JENKINS] Archiving <https://builds.apache.org/job/UIMA-AS/ws/trunk/uimaj-as-activemq/target/uimaj-as-activemq.jar>
to /home/hudson/hudson/jobs/UIMA-AS/modules/org.apache.uima$uimaj-as-activemq/builds/2013-01-12_21-13-23/archive/org.apache.uima/uimaj-as-activemq/2.4.1-SNAPSHOT/uimaj-as-activemq-2.4.1-SNAPSHOT.jar
[JENKINS] Archiving <https://builds.apache.org/job/UIMA-AS/ws/trunk/uima-as-parent/pom.xml>
to /home/hudson/hudson/jobs/UIMA-AS/modules/org.apache.uima$uima-as-parent/builds/2013-01-12_21-13-23/archive/org.apache.uima/uima-as-parent/2.4.1-SNAPSHOT/uima-as-parent-2.4.1-SNAPSHOT.pom
[JENKINS] Archiving <https://builds.apache.org/job/UIMA-AS/ws/trunk/uimaj-as-core/pom.xml>
to /home/hudson/hudson/jobs/UIMA-AS/modules/org.apache.uima$uimaj-as-core/builds/2013-01-12_21-13-23/archive/org.apache.uima/uimaj-as-core/2.4.1-SNAPSHOT/uimaj-as-core-2.4.1-SNAPSHOT.pom
[JENKINS] Archiving <https://builds.apache.org/job/UIMA-AS/ws/trunk/uimaj-as-core/target/uimaj-as-core.jar>
to /home/hudson/hudson/jobs/UIMA-AS/modules/org.apache.uima$uimaj-as-core/builds/2013-01-12_21-13-23/archive/org.apache.uima/uimaj-as-core/2.4.1-SNAPSHOT/uimaj-as-core-2.4.1-SNAPSHOT.jar
[JENKINS] Archiving <https://builds.apache.org/job/UIMA-AS/ws/trunk/uimaj-eclipse-feature-deployeditor/pom.xml>
to /home/hudson/hudson/jobs/UIMA-AS/modules/org.apache.uima$uimaj-eclipse-feature-deployeditor/builds/2013-01-12_21-13-27/archive/org.apache.uima/uimaj-eclipse-feature-deployeditor/2.4.0/uimaj-eclipse-feature-deployeditor-2.4.0.pom
[JENKINS] Archiving <https://builds.apache.org/job/UIMA-AS/ws/trunk/uimaj-eclipse-feature-deployeditor/target/uimaj-eclipse-feature-deployeditor_2.4.0.jar>
to /home/hudson/hudson/jobs/UIMA-AS/modules/org.apache.uima$uimaj-eclipse-feature-deployeditor/builds/2013-01-12_21-13-27/archive/org.apache.uima/uimaj-eclipse-feature-deployeditor/2.4.0/uimaj-eclipse-feature-deployeditor-2.4.0.jar
[JENKINS] Archiving <https://builds.apache.org/job/UIMA-AS/ws/trunk/uimaj-ep-deployeditor/pom.xml>
to /home/hudson/hudson/jobs/UIMA-AS/modules/org.apache.uima$uimaj-ep-deployeditor/builds/2013-01-12_21-13-25/archive/org.apache.uima/uimaj-ep-deployeditor/2.4.1-SNAPSHOT/uimaj-ep-deployeditor-2.4.1-SNAPSHOT.pom
[JENKINS] Archiving <https://builds.apache.org/job/UIMA-AS/ws/trunk/uimaj-ep-deployeditor/target/org.apache.uima.deployeditor_2.4.1.SNAPSHOT.jar>
to /home/hudson/hudson/jobs/UIMA-AS/modules/org.apache.uima$uimaj-ep-deployeditor/builds/2013-01-12_21-13-25/archive/org.apache.uima/uimaj-ep-deployeditor/2.4.1-SNAPSHOT/uimaj-ep-deployeditor-2.4.1-SNAPSHOT.jar
[JENKINS] Archiving <https://builds.apache.org/job/UIMA-AS/ws/trunk/uimaj-as-camel/pom.xml>
to /home/hudson/hudson/jobs/UIMA-AS/modules/org.apache.uima$uimaj-as-camel/builds/2013-01-12_21-13-25/archive/org.apache.uima/uimaj-as-camel/2.4.1-SNAPSHOT/uimaj-as-camel-2.4.1-SNAPSHOT.pom
[JENKINS] Archiving <https://builds.apache.org/job/UIMA-AS/ws/trunk/uimaj-as-camel/target/org.apache.uima.camel_2.4.1.SNAPSHOT.jar>
to /home/hudson/hudson/jobs/UIMA-AS/modules/org.apache.uima$uimaj-as-camel/builds/2013-01-12_21-13-25/archive/org.apache.uima/uimaj-as-camel/2.4.1-SNAPSHOT/uimaj-as-camel-2.4.1-SNAPSHOT.jar
[JENKINS] Archiving <https://builds.apache.org/job/UIMA-AS/ws/trunk/pom.xml> to /home/hudson/hudson/jobs/UIMA-AS/modules/org.apache.uima$uima-as/builds/2013-01-12_21-13-23/archive/org.apache.uima/uima-as/2.4.1-SNAPSHOT/uima-as-2.4.1-SNAPSHOT.pom
Waiting for Jenkins to finish collecting data
mavenExecutionResult exceptions not empty
message : Failed to execute goal org.apache.uima:uima-build-helper-maven-plugin:4:copy-from-apache-dist
(default) on project uima-as: While reading remote location http://archive.apache.org/dist/uima/uimaj-2.4.1-SNAPSHOT/uimaj-2.4.1-SNAPSHOT-bin.zip
cause : While reading remote location http://archive.apache.org/dist/uima/uimaj-2.4.1-SNAPSHOT/uimaj-2.4.1-SNAPSHOT-bin.zip
Stack trace : 
org.apache.maven.lifecycle.LifecycleExecutionException: Failed to execute goal org.apache.uima:uima-build-helper-maven-plugin:4:copy-from-apache-dist
(default) on project uima-as: While reading remote location http://archive.apache.org/dist/uima/uimaj-2.4.1-SNAPSHOT/uimaj-2.4.1-SNAPSHOT-bin.zip
	at org.apache.maven.lifecycle.internal.MojoExecutor.execute(MojoExecutor.java:217)
	at org.apache.maven.lifecycle.internal.MojoExecutor.execute(MojoExecutor.java:153)
	at org.apache.maven.lifecycle.internal.MojoExecutor.execute(MojoExecutor.java:145)
	at org.apache.maven.lifecycle.internal.LifecycleModuleBuilder.buildProject(LifecycleModuleBuilder.java:84)
	at org.apache.maven.lifecycle.internal.LifecycleModuleBuilder.buildProject(LifecycleModuleBuilder.java:59)
	at org.apache.maven.lifecycle.internal.LifecycleStarter.singleThreadedBuild(LifecycleStarter.java:183)
	at org.apache.maven.lifecycle.internal.LifecycleStarter.execute(LifecycleStarter.java:161)
	at org.apache.maven.DefaultMaven.doExecute(DefaultMaven.java:319)
	at org.apache.maven.DefaultMaven.execute(DefaultMaven.java:156)
	at org.jvnet.hudson.maven3.launcher.Maven3Launcher.main(Maven3Launcher.java:79)
	at sun.reflect.NativeMethodAccessorImpl.invoke0(Native Method)
	at sun.reflect.NativeMethodAccessorImpl.invoke(NativeMethodAccessorImpl.java:39)
	at sun.reflect.DelegatingMethodAccessorImpl.invoke(DelegatingMethodAccessorImpl.java:25)
	at java.lang.reflect.Method.invoke(Method.java:592)
	at org.codehaus.plexus.classworlds.launcher.Launcher.launchStandard(Launcher.java:329)
	at org.codehaus.plexus.classworlds.launcher.Launcher.launch(Launcher.java:239)
	at org.jvnet.hudson.maven3.agent.Maven3Main.launch(Maven3Main.java:158)
	at hudson.maven.Maven3Builder.call(Maven3Builder.java:100)
	at hudson.maven.Maven3Builder.call(Maven3Builder.java:66)
	at hudson.remoting.UserRequest.perform(UserRequest.java:118)
	at hudson.remoting.UserRequest.perform(UserRequest.java:48)
	at hudson.remoting.Request$2.run(Request.java:326)
	at hudson.remoting.InterceptingExecutorService$1.call(InterceptingExecutorService.java:72)
	at java.util.concurrent.FutureTask$Sync.innerRun(FutureTask.java:269)
	at java.util.concurrent.FutureTask.run(FutureTask.java:123)
	at java.util.concurrent.ThreadPoolExecutor$Worker.runTask(ThreadPoolExecutor.java:651)
	at java.util.concurrent.ThreadPoolExecutor$Worker.run(ThreadPoolExecutor.java:676)
	at java.lang.Thread.run(Thread.java:595)
Caused by: org.apache.maven.plugin.MojoExecutionException: While reading remote location http://archive.apache.org/dist/uima/uimaj-2.4.1-SNAPSHOT/uimaj-2.4.1-SNAPSHOT-bin.zip
	at org.apache.uima.buildhelper.CopyFromApacheDist.execute(CopyFromApacheDist.java:166)
	at org.apache.maven.plugin.DefaultBuildPluginManager.executeMojo(DefaultBuildPluginManager.java:101)
	at org.apache.maven.lifecycle.internal.MojoExecutor.execute(MojoExecutor.java:209)
	... 27 more
Caused by: java.io.FileNotFoundException: http://archive.apache.org/dist/uima/uimaj-2.4.1-SNAPSHOT/uimaj-2.4.1-SNAPSHOT-bin.zip
	at sun.reflect.GeneratedConstructorAccessor16.newInstance(Unknown Source)
	at sun.reflect.DelegatingConstructorAccessorImpl.newInstance(DelegatingConstructorAccessorImpl.java:27)
	at java.lang.reflect.Constructor.newInstance(Constructor.java:501)
	at sun.net.www.protocol.http.HttpURLConnection$6.run(HttpURLConnection.java:1250)
	at java.security.AccessController.doPrivileged(Native Method)
	at sun.net.www.protocol.http.HttpURLConnection.getChainedException(HttpURLConnection.java:1244)
	at sun.net.www.protocol.http.HttpURLConnection.getInputStream(HttpURLConnection.java:932)
	at org.apache.uima.buildhelper.CopyFromApacheDist.execute(CopyFromApacheDist.java:156)
	... 29 more
Caused by: java.io.FileNotFoundException: http://archive.apache.org/dist/uima/uimaj-2.4.1-SNAPSHOT/uimaj-2.4.1-SNAPSHOT-bin.zip
	at sun.net.www.protocol.http.HttpURLConnection.getInputStream(HttpURLConnection.java:1194)
	at sun.net.www.protocol.http.HttpURLConnection.getHeaderField(HttpURLConnection.java:1993)
	at java.net.URLConnection.getHeaderFieldInt(URLConnection.java:573)
	at java.net.URLConnection.getContentLength(URLConnection.java:468)
	at org.apache.uima.buildhelper.CopyFromApacheDist.execute(CopyFromApacheDist.java:150)
	... 29 more
Sending e-mails to: dev@uima.apache.org
channel stopped

Mime
View raw message