uima-dev mailing list archives

Site index · List index
Message view « Date » · « Thread »
Top « Date » · « Thread »
From Apache Jenkins Server <jenk...@builds.apache.org>
Subject Build failed in Jenkins: UIMA-uimaFIT #14
Date Sun, 27 Jan 2013 13:05:15 GMT
See <https://builds.apache.org/job/UIMA-uimaFIT/14/changes>

Changes:

[rec] [UIMA-2599] Fill description of component and parameters from JavaDoc 
- uimafit-maven-plugin: Workaround for MNG-5346 to fix build
- uimafit-maven-plugin: Added "enhance" mojo
- uimafit-maven-plugin: Refactoring to extract common code from "generate" and "enhance" mojo
- uimafit: moved some default values to Defaults.java. The Maven plugin can use this to check
if a field has a default value or a customized value.

------------------------------------------
[...truncated 2613 lines...]
[INFO] Cobertura 1.9.4.1 - GNU GPL License (NO WARRANTY) - See COPYRIGHT file
Cobertura: Loaded information on 7 classes.
Report time: 170ms

[INFO] Cobertura Report generation was successful.
mojoSucceeded org.codehaus.mojo:cobertura-maven-plugin:2.5.1(default-cli)
projectSucceeded org.apache.uima:uimafit-spring:2.0.0-SNAPSHOT
projectStarted org.apache.uima:uimafit-maven-plugin:2.0.0-SNAPSHOT
[INFO]                                                                         
[INFO] ------------------------------------------------------------------------
[INFO] Building uimaFIT - Maven Plugin 2.0.0-SNAPSHOT
[INFO] ------------------------------------------------------------------------
Downloading: http://download.java.net/maven/2/org/javassist/javassist/3.17.1-GA/javassist-3.17.1-GA.pom
Downloading: http://repo1.maven.org/eclipse/org/javassist/javassist/3.17.1-GA/javassist-3.17.1-GA.pom
Downloading: http://repo1.maven.org/maven2/org/javassist/javassist/3.17.1-GA/javassist-3.17.1-GA.pom
Downloaded: http://repo1.maven.org/maven2/org/javassist/javassist/3.17.1-GA/javassist-3.17.1-GA.pom
(9 KB at 194.5 KB/sec)
Downloading: http://download.java.net/maven/2/org/eclipse/jdt/core/3.2.0.666/core-3.2.0.666.pom
Downloading: http://repo1.maven.org/eclipse/org/eclipse/jdt/core/3.2.0.666/core-3.2.0.666.pom
Downloading: http://repo1.maven.org/maven2/org/eclipse/jdt/core/3.2.0.666/core-3.2.0.666.pom
Downloaded: http://repo1.maven.org/maven2/org/eclipse/jdt/core/3.2.0.666/core-3.2.0.666.pom
(681 B at 2.1 KB/sec)
Downloading: http://repository.apache.org/snapshots/org/eclipse/core/expressions/maven-metadata.xml
Downloading: http://download.java.net/maven/2/org/eclipse/core/expressions/maven-metadata.xml
Downloading: http://download.java.net/maven/2/org/eclipse/core/runtime/maven-metadata.xml
Downloading: http://repository.apache.org/snapshots/org/eclipse/core/runtime/maven-metadata.xml
Downloading: http://download.java.net/maven/2/org/eclipse/osgi/maven-metadata.xml
Downloading: http://repository.apache.org/snapshots/org/eclipse/osgi/maven-metadata.xml
Downloading: http://download.java.net/maven/2/org/eclipse/equinox/common/maven-metadata.xml
Downloading: http://repository.apache.org/snapshots/org/eclipse/equinox/common/maven-metadata.xml
Downloading: http://download.java.net/maven/2/org/eclipse/core/jobs/maven-metadata.xml
Downloading: http://repository.apache.org/snapshots/org/eclipse/core/jobs/maven-metadata.xml
Downloading: http://download.java.net/maven/2/org/eclipse/equinox/registry/maven-metadata.xml
Downloading: http://repository.apache.org/snapshots/org/eclipse/equinox/registry/maven-metadata.xml
Downloading: http://download.java.net/maven/2/org/eclipse/equinox/preferences/maven-metadata.xml
Downloading: http://repository.apache.org/snapshots/org/eclipse/equinox/preferences/maven-metadata.xml
Downloading: http://download.java.net/maven/2/org/eclipse/core/contenttype/maven-metadata.xml
Downloading: http://repository.apache.org/snapshots/org/eclipse/core/contenttype/maven-metadata.xml
Downloading: http://download.java.net/maven/2/org/eclipse/core/filesystem/maven-metadata.xml
Downloading: http://repository.apache.org/snapshots/org/eclipse/core/filesystem/maven-metadata.xml
Downloading: http://download.java.net/maven/2/org/javassist/javassist/3.17.1-GA/javassist-3.17.1-GA.jar
Downloading: http://download.java.net/maven/2/org/eclipse/equinox/app/1.0.0-v20070423/app-1.0.0-v20070423.jar
Downloading: http://download.java.net/maven/2/org/eclipse/jdt/core/3.2.0.666/core-3.2.0.666.jar
Downloading: http://download.java.net/maven/2/org/eclipse/core/resources/3.3.0-v20070604/resources-3.3.0-v20070604.jar
Downloading: http://repo1.maven.org/eclipse/org/javassist/javassist/3.17.1-GA/javassist-3.17.1-GA.jar
Downloading: http://repo1.maven.org/eclipse/org/eclipse/jdt/core/3.2.0.666/core-3.2.0.666.jar
Downloading: http://repo1.maven.org/eclipse/org/eclipse/core/jobs/3.3.0-v20070423/jobs-3.3.0-v20070423.jar
Downloading: http://repo1.maven.org/eclipse/org/eclipse/osgi/3.3.0-v20070530/osgi-3.3.0-v20070530.jar
Downloading: http://repo1.maven.org/eclipse/org/eclipse/core/runtime/3.3.100-v20070530/runtime-3.3.100-v20070530.jar
Downloading: http://repo1.maven.org/eclipse/org/eclipse/equinox/registry/3.3.0-v20070522/registry-3.3.0-v20070522.jar
Downloading: http://repo1.maven.org/eclipse/org/eclipse/equinox/preferences/3.2.100-v20070522/preferences-3.2.100-v20070522.jar
Downloaded: http://repo1.maven.org/eclipse/org/eclipse/core/runtime/3.3.100-v20070530/runtime-3.3.100-v20070530.jar
(72 KB at 137.4 KB/sec)
Downloading: http://repo1.maven.org/eclipse/org/eclipse/core/contenttype/3.2.100-v20070319/contenttype-3.2.100-v20070319.jar
Downloaded: http://repo1.maven.org/eclipse/org/eclipse/core/jobs/3.3.0-v20070423/jobs-3.3.0-v20070423.jar
(80 KB at 114.0 KB/sec)
Downloading: http://repo1.maven.org/eclipse/org/eclipse/equinox/app/1.0.0-v20070423/app-1.0.0-v20070423.jar
Downloaded: http://repo1.maven.org/eclipse/org/eclipse/osgi/3.3.0-v20070530/osgi-3.3.0-v20070530.jar
(906 KB at 1242.5 KB/sec)
Downloading: http://repo1.maven.org/eclipse/org/eclipse/core/resources/3.3.0-v20070604/resources-3.3.0-v20070604.jar
Downloaded: http://repo1.maven.org/eclipse/org/eclipse/equinox/registry/3.3.0-v20070522/registry-3.3.0-v20070522.jar
(158 KB at 179.4 KB/sec)
Downloading: http://repo1.maven.org/eclipse/org/eclipse/core/filesystem/1.1.0-v20070606/filesystem-1.1.0-v20070606.jar
Downloaded: http://repo1.maven.org/eclipse/org/eclipse/equinox/app/1.0.0-v20070423/app-1.0.0-v20070423.jar
(72 KB at 189.9 KB/sec)
Downloading: http://repo1.maven.org/eclipse/org/eclipse/equinox/common/3.3.0-v20070426/common-3.3.0-v20070426.jar
Downloaded: http://repo1.maven.org/eclipse/org/eclipse/equinox/preferences/3.2.100-v20070522/preferences-3.2.100-v20070522.jar
(102 KB at 98.8 KB/sec)
Downloaded: http://repo1.maven.org/eclipse/org/eclipse/equinox/common/3.3.0-v20070426/common-3.3.0-v20070426.jar
(0 B at 0.0 KB/sec)
Downloaded: http://repo1.maven.org/eclipse/org/eclipse/core/filesystem/1.1.0-v20070606/filesystem-1.1.0-v20070606.jar
(43 KB at 107.7 KB/sec)
Downloaded: http://repo1.maven.org/eclipse/org/eclipse/core/contenttype/3.2.100-v20070319/contenttype-3.2.100-v20070319.jar
(81 KB at 87.7 KB/sec)
Downloaded: http://repo1.maven.org/eclipse/org/eclipse/core/resources/3.3.0-v20070604/resources-3.3.0-v20070604.jar
(663 KB at 638.5 KB/sec)
Downloading: http://repo1.maven.org/maven2/org/javassist/javassist/3.17.1-GA/javassist-3.17.1-GA.jar
Downloading: http://repo1.maven.org/maven2/org/eclipse/jdt/core/3.2.0.666/core-3.2.0.666.jar
Downloading: http://repo1.maven.org/maven2/org/eclipse/core/expressions/3.3.0-v20070606-0010/expressions-3.3.0-v20070606-0010.jar
Downloaded: http://repo1.maven.org/maven2/org/javassist/javassist/3.17.1-GA/javassist-3.17.1-GA.jar
(696 KB at 7023.1 KB/sec)
Downloaded: http://repo1.maven.org/maven2/org/eclipse/core/expressions/3.3.0-v20070606-0010/expressions-3.3.0-v20070606-0010.jar
(80 KB at 570.6 KB/sec)
Downloaded: http://repo1.maven.org/maven2/org/eclipse/jdt/core/3.2.0.666/core-3.2.0.666.jar
(3812 KB at 5256.9 KB/sec)
mojoStarted org.apache.maven.plugins:maven-clean-plugin:2.4.1(default-clean)
[INFO] 
[INFO] --- maven-clean-plugin:2.4.1:clean (default-clean) @ uimafit-maven-plugin ---
mojoSucceeded org.apache.maven.plugins:maven-clean-plugin:2.4.1(default-clean)
[TASKS] Scanning folder 'F:\hudson\hudson-slave\workspace\UIMA-uimaFIT\trunk\uimafit-maven-plugin'
for files matching the pattern '**/*.java' - excludes: 
[TASKS] Found 11 files to scan for tasks
Found 0 open tasks.
[TASKS] Computing warning deltas based on reference build #12
mojoStarted org.codehaus.mojo:build-helper-maven-plugin:1.7(parse-project-version)
[INFO] 
[INFO] --- build-helper-maven-plugin:1.7:parse-version (parse-project-version) @ uimafit-maven-plugin
---
mojoSucceeded org.codehaus.mojo:build-helper-maven-plugin:1.7(parse-project-version)
mojoStarted org.apache.uima:uima-build-helper-maven-plugin:4(set buildYear and buildMonth)
[INFO] 
[INFO] --- uima-build-helper-maven-plugin:4:parse-date-time (set buildYear and buildMonth)
@ uimafit-maven-plugin ---
mojoSucceeded org.apache.uima:uima-build-helper-maven-plugin:4(set buildYear and buildMonth)
mojoStarted org.apache.maven.plugins:maven-plugin-plugin:3.2(generated-helpmojo)
[INFO] 
[INFO] --- maven-plugin-plugin:3.2:helpmojo (generated-helpmojo) @ uimafit-maven-plugin ---
[INFO] Using 'UTF-8' encoding to read mojo metadata.
[INFO] Applying mojo extractor for language: java
[INFO] Mojo extractor for language: java found 0 mojo descriptors.
[INFO] Applying mojo extractor for language: bsh
[INFO] Mojo extractor for language: bsh found 0 mojo descriptors.
[INFO] Applying mojo extractor for language: java-annotations
[INFO] Mojo extractor for language: java-annotations found 0 mojo descriptors.
mojoSucceeded org.apache.maven.plugins:maven-plugin-plugin:3.2(generated-helpmojo)
mojoStarted org.apache.maven.plugins:maven-plugin-plugin:3.2(default-descriptor)
[INFO] 
[INFO] --- maven-plugin-plugin:3.2:descriptor (default-descriptor) @ uimafit-maven-plugin
---
[INFO] Using 'UTF-8' encoding to read mojo metadata.
[INFO] Applying mojo extractor for language: java
[INFO] Mojo extractor for language: java found 0 mojo descriptors.
[INFO] Applying mojo extractor for language: bsh
[INFO] Mojo extractor for language: bsh found 0 mojo descriptors.
[INFO] Applying mojo extractor for language: java-annotations
[INFO] Mojo extractor for language: java-annotations found 0 mojo descriptors.
mojoSucceeded org.apache.maven.plugins:maven-plugin-plugin:3.2(default-descriptor)
mojoStarted org.apache.maven.plugins:maven-remote-resources-plugin:1.2.1(default)
[INFO] 
[INFO] --- maven-remote-resources-plugin:1.2.1:process (default) @ uimafit-maven-plugin ---
[INFO] artifact org.eclipse.core:expressions: checking for updates from maven2-repository.dev.java.net
[INFO] artifact org.eclipse.core:runtime: checking for updates from maven2-repository.dev.java.net
[INFO] artifact org.eclipse.core:filesystem: checking for updates from maven2-repository.dev.java.net
mojoSucceeded org.apache.maven.plugins:maven-remote-resources-plugin:1.2.1(default)
mojoStarted org.apache.maven.plugins:maven-resources-plugin:2.5(default-resources)[debug]
execute contextualize

[INFO] 
[INFO] --- maven-resources-plugin:2.5:resources (default-resources) @ uimafit-maven-plugin
---
[INFO] Using 'UTF-8' encoding to copy filtered resources.
[INFO] Copying 1 resource
[INFO] Copying 3 resources
mojoSucceeded org.apache.maven.plugins:maven-resources-plugin:2.5(default-resources)
mojoStarted org.apache.maven.plugins:maven-compiler-plugin:2.3.2(default-compile)
[INFO] 
[INFO] --- maven-compiler-plugin:2.3.2:compile (default-compile) @ uimafit-maven-plugin ---
[INFO] Compiling 9 source files to F:\hudson\hudson-slave\workspace\UIMA-uimaFIT\trunk\uimafit-maven-plugin\target\classes
[INFO] -------------------------------------------------------------
[ERROR] COMPILATION ERROR : 
[INFO] -------------------------------------------------------------
[ERROR] \hudson\hudson-slave\workspace\UIMA-uimaFIT\trunk\uimafit-maven-plugin\src\main\java\org\apache\uima\fit\maven\EnhanceMojo.java:[28,-1]
cannot access javassist.CannotCompileException
bad class file: f:\hudson\hudson-slave\maven-repositories\0\org\javassist\javassist\3.17.1-GA\javassist-3.17.1-GA.jar(javassist/CannotCompileException.class)
class file has wrong version 50.0, should be 49.0
[INFO] 1 error
[INFO] -------------------------------------------------------------
mojoFailed org.apache.maven.plugins:maven-compiler-plugin:2.3.2(default-compile)
projectFailed org.apache.uima:uimafit-maven-plugin:2.0.0-SNAPSHOT
projectSkipped org.apache.uima:uimafit-parent:2.0.0-SNAPSHOT
[INFO]                                                                         
[INFO] ------------------------------------------------------------------------
[INFO] Skipping uimaFIT - Parent
[INFO] This project has been banned from the build due to previous failures.
[INFO] ------------------------------------------------------------------------
sessionEnded
[INFO] ------------------------------------------------------------------------
[INFO] Reactor Summary:
[INFO] 
[INFO] uimaFIT - Parent .................................. SUCCESS [16.271s]
[INFO] uimaFIT ........................................... SUCCESS [2:05.877s]
[INFO] uimaFIT - Examples ................................ SUCCESS [25.873s]
[INFO] uimaFIT - Spring integration ...................... SUCCESS [16.243s]
[INFO] uimaFIT - Maven Plugin ............................ FAILURE [12.227s]
[INFO] uimaFIT - Legacy uimaFIT support .................. SKIPPED
[INFO] ------------------------------------------------------------------------
[INFO] BUILD FAILURE
[INFO] ------------------------------------------------------------------------
[INFO] Total time: 3:20.877s
[INFO] Finished at: Sun Jan 27 13:05:10 GMT 2013
[INFO] Final Memory: 66M/280M
[INFO] ------------------------------------------------------------------------
Projects to build: [MavenProject: org.apache.uima:uimafit-parent:2.0.0-SNAPSHOT @ <https://builds.apache.org/job/UIMA-uimaFIT/ws/trunk\pom.xml,>
MavenProject: org.apache.uima:uimafit:2.0.0-SNAPSHOT @ F:\hudson\hudson-slave\workspace\UIMA-uimaFIT\trunk\uimafit\pom.xml,
MavenProject: org.apache.uima:uimafit-examples:2.0.0-SNAPSHOT @ F:\hudson\hudson-slave\workspace\UIMA-uimaFIT\trunk\uimafit-examples\pom.xml,
MavenProject: org.apache.uima:uimafit-spring:2.0.0-SNAPSHOT @ F:\hudson\hudson-slave\workspace\UIMA-uimaFIT\trunk\uimafit-spring\pom.xml,
MavenProject: org.apache.uima:uimafit-maven-plugin:2.0.0-SNAPSHOT @ F:\hudson\hudson-slave\workspace\UIMA-uimaFIT\trunk\uimafit-maven-plugin\pom.xml,
MavenProject: org.apache.uima:uimafit-legacy-support:2.0.0-SNAPSHOT @ F:\hudson\hudson-slave\workspace\UIMA-uimaFIT\trunk\uimafit-legacy-support\pom.xml]
[JENKINS] Archiving F:\hudson\hudson-slave\workspace\UIMA-uimaFIT\trunk\uimafit\pom.xml to
/home/hudson/hudson/jobs/UIMA-uimaFIT/modules/org.apache.uima$uimafit/builds/2013-01-27_13-01-47/archive/org.apache.uima/uimafit/2.0.0-SNAPSHOT/uimafit-2.0.0-SNAPSHOT.pom
[JENKINS] Archiving F:\hudson\hudson-slave\workspace\UIMA-uimaFIT\trunk\uimafit\target\uimafit-2.0.0-SNAPSHOT.jar
to /home/hudson/hudson/jobs/UIMA-uimaFIT/modules/org.apache.uima$uimafit/builds/2013-01-27_13-01-47/archive/org.apache.uima/uimafit/2.0.0-SNAPSHOT/uimafit-2.0.0-SNAPSHOT.jar
[JENKINS] Archiving F:\hudson\hudson-slave\workspace\UIMA-uimaFIT\trunk\uimafit\target\uimafit-2.0.0-SNAPSHOT-tests.jar
to /home/hudson/hudson/jobs/UIMA-uimaFIT/modules/org.apache.uima$uimafit/builds/2013-01-27_13-01-47/archive/org.apache.uima/uimafit/2.0.0-SNAPSHOT/uimafit-2.0.0-SNAPSHOT-tests.jar
[JENKINS] Archiving F:\hudson\hudson-slave\workspace\UIMA-uimaFIT\trunk\uimafit\target\uimafit-2.0.0-SNAPSHOT-sources.jar
to /home/hudson/hudson/jobs/UIMA-uimaFIT/modules/org.apache.uima$uimafit/builds/2013-01-27_13-01-47/archive/org.apache.uima/uimafit/2.0.0-SNAPSHOT/uimafit-2.0.0-SNAPSHOT-sources.jar
[JENKINS] Archiving F:\hudson\hudson-slave\workspace\UIMA-uimaFIT\trunk\uimafit\target\uimafit-2.0.0-SNAPSHOT-test-sources.jar
to /home/hudson/hudson/jobs/UIMA-uimaFIT/modules/org.apache.uima$uimafit/builds/2013-01-27_13-01-47/archive/org.apache.uima/uimafit/2.0.0-SNAPSHOT/uimafit-2.0.0-SNAPSHOT-test-sources.jar
[JENKINS] Archiving F:\hudson\hudson-slave\workspace\UIMA-uimaFIT\trunk\uimafit-maven-plugin\pom.xml
to /home/hudson/hudson/jobs/UIMA-uimaFIT/modules/org.apache.uima$uimafit-maven-plugin/builds/2013-01-27_13-01-47/archive/org.apache.uima/uimafit-maven-plugin/2.0.0-SNAPSHOT/uimafit-maven-plugin-2.0.0-SNAPSHOT.pom
[JENKINS] Archiving F:\hudson\hudson-slave\workspace\UIMA-uimaFIT\trunk\uimafit-spring\pom.xml
to /home/hudson/hudson/jobs/UIMA-uimaFIT/modules/org.apache.uima$uimafit-spring/builds/2013-01-27_13-01-47/archive/org.apache.uima/uimafit-spring/2.0.0-SNAPSHOT/uimafit-spring-2.0.0-SNAPSHOT.pom
[JENKINS] Archiving F:\hudson\hudson-slave\workspace\UIMA-uimaFIT\trunk\uimafit-spring\target\uimafit-spring-2.0.0-SNAPSHOT.jar
to /home/hudson/hudson/jobs/UIMA-uimaFIT/modules/org.apache.uima$uimafit-spring/builds/2013-01-27_13-01-47/archive/org.apache.uima/uimafit-spring/2.0.0-SNAPSHOT/uimafit-spring-2.0.0-SNAPSHOT.jar
[JENKINS] Archiving F:\hudson\hudson-slave\workspace\UIMA-uimaFIT\trunk\uimafit-spring\target\uimafit-spring-2.0.0-SNAPSHOT-tests.jar
to /home/hudson/hudson/jobs/UIMA-uimaFIT/modules/org.apache.uima$uimafit-spring/builds/2013-01-27_13-01-47/archive/org.apache.uima/uimafit-spring/2.0.0-SNAPSHOT/uimafit-spring-2.0.0-SNAPSHOT-tests.jar
[JENKINS] Archiving F:\hudson\hudson-slave\workspace\UIMA-uimaFIT\trunk\uimafit-spring\target\uimafit-spring-2.0.0-SNAPSHOT-sources.jar
to /home/hudson/hudson/jobs/UIMA-uimaFIT/modules/org.apache.uima$uimafit-spring/builds/2013-01-27_13-01-47/archive/org.apache.uima/uimafit-spring/2.0.0-SNAPSHOT/uimafit-spring-2.0.0-SNAPSHOT-sources.jar
[JENKINS] Archiving F:\hudson\hudson-slave\workspace\UIMA-uimaFIT\trunk\uimafit-spring\target\uimafit-spring-2.0.0-SNAPSHOT-test-sources.jar
to /home/hudson/hudson/jobs/UIMA-uimaFIT/modules/org.apache.uima$uimafit-spring/builds/2013-01-27_13-01-47/archive/org.apache.uima/uimafit-spring/2.0.0-SNAPSHOT/uimafit-spring-2.0.0-SNAPSHOT-test-sources.jar
[JENKINS] Archiving F:\hudson\hudson-slave\workspace\UIMA-uimaFIT\trunk\uimafit-examples\pom.xml
to /home/hudson/hudson/jobs/UIMA-uimaFIT/modules/org.apache.uima$uimafit-examples/builds/2013-01-27_13-01-47/archive/org.apache.uima/uimafit-examples/2.0.0-SNAPSHOT/uimafit-examples-2.0.0-SNAPSHOT.pom
[JENKINS] Archiving F:\hudson\hudson-slave\workspace\UIMA-uimaFIT\trunk\uimafit-examples\target\uimafit-examples-2.0.0-SNAPSHOT.jar
to /home/hudson/hudson/jobs/UIMA-uimaFIT/modules/org.apache.uima$uimafit-examples/builds/2013-01-27_13-01-47/archive/org.apache.uima/uimafit-examples/2.0.0-SNAPSHOT/uimafit-examples-2.0.0-SNAPSHOT.jar
[JENKINS] Archiving F:\hudson\hudson-slave\workspace\UIMA-uimaFIT\trunk\uimafit-examples\target\uimafit-examples-2.0.0-SNAPSHOT-tests.jar
to /home/hudson/hudson/jobs/UIMA-uimaFIT/modules/org.apache.uima$uimafit-examples/builds/2013-01-27_13-01-47/archive/org.apache.uima/uimafit-examples/2.0.0-SNAPSHOT/uimafit-examples-2.0.0-SNAPSHOT-tests.jar
[JENKINS] Archiving F:\hudson\hudson-slave\workspace\UIMA-uimaFIT\trunk\uimafit-examples\target\uimafit-examples-2.0.0-SNAPSHOT-sources.jar
to /home/hudson/hudson/jobs/UIMA-uimaFIT/modules/org.apache.uima$uimafit-examples/builds/2013-01-27_13-01-47/archive/org.apache.uima/uimafit-examples/2.0.0-SNAPSHOT/uimafit-examples-2.0.0-SNAPSHOT-sources.jar
[JENKINS] Archiving F:\hudson\hudson-slave\workspace\UIMA-uimaFIT\trunk\uimafit-examples\target\uimafit-examples-2.0.0-SNAPSHOT-test-sources.jar
to /home/hudson/hudson/jobs/UIMA-uimaFIT/modules/org.apache.uima$uimafit-examples/builds/2013-01-27_13-01-47/archive/org.apache.uima/uimafit-examples/2.0.0-SNAPSHOT/uimafit-examples-2.0.0-SNAPSHOT-test-sources.jar
[JENKINS] Archiving <https://builds.apache.org/job/UIMA-uimaFIT/ws/trunk\pom.xml> to
/home/hudson/hudson/jobs/UIMA-uimaFIT/modules/org.apache.uima$uimafit-parent/builds/2013-01-27_13-01-47/archive/org.apache.uima/uimafit-parent/2.0.0-SNAPSHOT/uimafit-parent-2.0.0-SNAPSHOT.pom
[JENKINS] Archiving <https://builds.apache.org/job/UIMA-uimaFIT/ws/trunk\target\uimafit-parent-2.0.0-SNAPSHOT-tests.jar>
to /home/hudson/hudson/jobs/UIMA-uimaFIT/modules/org.apache.uima$uimafit-parent/builds/2013-01-27_13-01-47/archive/org.apache.uima/uimafit-parent/2.0.0-SNAPSHOT/uimafit-parent-2.0.0-SNAPSHOT-tests.jar
[JENKINS] Archiving F:\hudson\hudson-slave\workspace\UIMA-uimaFIT\trunk\uimafit-legacy-support\pom.xml
to /home/hudson/hudson/jobs/UIMA-uimaFIT/modules/org.apache.uima$uimafit-legacy-support/builds/2013-01-27_13-01-47/archive/org.apache.uima/uimafit-legacy-support/2.0.0-SNAPSHOT/uimafit-legacy-support-2.0.0-SNAPSHOT.pom
[WARNING] The requested profile "javancss" could not be activated because it does not exist.
[WARNING] The requested profile "cobertura-aggregate" could not be activated because it does
not exist.
[WARNING] The requested profile "attach-source" could not be activated because it does not
exist.
[WARNING] The requested profile "attach-javadoc" could not be activated because it does not
exist.
[WARNING] The requested profile "attach-test" could not be activated because it does not exist.
Waiting for Jenkins to finish collecting data
mavenExecutionResult exceptions not empty
message : Failed to execute goal org.apache.maven.plugins:maven-compiler-plugin:2.3.2:compile
(default-compile) on project uimafit-maven-plugin: Compilation failure
\hudson\hudson-slave\workspace\UIMA-uimaFIT\trunk\uimafit-maven-plugin\src\main\java\org\apache\uima\fit\maven\EnhanceMojo.java:[28,-1]
cannot access javassist.CannotCompileException
bad class file: f:\hudson\hudson-slave\maven-repositories\0\org\javassist\javassist\3.17.1-GA\javassist-3.17.1-GA.jar(javassist/CannotCompileException.class)
class file has wrong version 50.0, should be 49.0

cause : Compilation failure
\hudson\hudson-slave\workspace\UIMA-uimaFIT\trunk\uimafit-maven-plugin\src\main\java\org\apache\uima\fit\maven\EnhanceMojo.java:[28,-1]
cannot access javassist.CannotCompileException
bad class file: f:\hudson\hudson-slave\maven-repositories\0\org\javassist\javassist\3.17.1-GA\javassist-3.17.1-GA.jar(javassist/CannotCompileException.class)
class file has wrong version 50.0, should be 49.0

Stack trace : 
org.apache.maven.lifecycle.LifecycleExecutionException: Failed to execute goal org.apache.maven.plugins:maven-compiler-plugin:2.3.2:compile
(default-compile) on project uimafit-maven-plugin: Compilation failure
\hudson\hudson-slave\workspace\UIMA-uimaFIT\trunk\uimafit-maven-plugin\src\main\java\org\apache\uima\fit\maven\EnhanceMojo.java:[28,-1]
cannot access javassist.CannotCompileException
bad class file: f:\hudson\hudson-slave\maven-repositories\0\org\javassist\javassist\3.17.1-GA\javassist-3.17.1-GA.jar(javassist/CannotCompileException.class)
class file has wrong version 50.0, should be 49.0

	at org.apache.maven.lifecycle.internal.MojoExecutor.execute(MojoExecutor.java:213)
	at org.apache.maven.lifecycle.internal.MojoExecutor.execute(MojoExecutor.java:153)
	at org.apache.maven.lifecycle.internal.MojoExecutor.execute(MojoExecutor.java:145)
	at org.apache.maven.lifecycle.internal.LifecycleModuleBuilder.buildProject(LifecycleModuleBuilder.java:84)
	at org.apache.maven.lifecycle.internal.LifecycleModuleBuilder.buildProject(LifecycleModuleBuilder.java:59)
	at org.apache.maven.lifecycle.internal.LifecycleStarter.singleThreadedBuild(LifecycleStarter.java:183)
	at org.apache.maven.lifecycle.internal.LifecycleStarter.execute(LifecycleStarter.java:161)
	at org.apache.maven.DefaultMaven.doExecute(DefaultMaven.java:319)
	at org.apache.maven.DefaultMaven.execute(DefaultMaven.java:156)
	at org.jvnet.hudson.maven3.launcher.Maven3Launcher.main(Maven3Launcher.java:79)
	at sun.reflect.NativeMethodAccessorImpl.invoke0(Native Method)
	at sun.reflect.NativeMethodAccessorImpl.invoke(NativeMethodAccessorImpl.java:39)
	at sun.reflect.DelegatingMethodAccessorImpl.invoke(DelegatingMethodAccessorImpl.java:25)
	at java.lang.reflect.Method.invoke(Method.java:592)
	at org.codehaus.plexus.classworlds.launcher.Launcher.launchStandard(Launcher.java:329)
	at org.codehaus.plexus.classworlds.launcher.Launcher.launch(Launcher.java:239)
	at org.jvnet.hudson.maven3.agent.Maven3Main.launch(Maven3Main.java:158)
	at hudson.maven.Maven3Builder.call(Maven3Builder.java:100)
	at hudson.maven.Maven3Builder.call(Maven3Builder.java:66)
	at hudson.remoting.UserRequest.perform(UserRequest.java:118)
	at hudson.remoting.UserRequest.perform(UserRequest.java:48)
	at hudson.remoting.Request$2.run(Request.java:326)
	at hudson.remoting.InterceptingExecutorService$1.call(InterceptingExecutorService.java:72)
	at java.util.concurrent.FutureTask$Sync.innerRun(FutureTask.java:269)
	at java.util.concurrent.FutureTask.run(FutureTask.java:123)
	at java.util.concurrent.ThreadPoolExecutor$Worker.runTask(ThreadPoolExecutor.java:651)
	at java.util.concurrent.ThreadPoolExecutor$Worker.run(ThreadPoolExecutor.java:676)
	at java.lang.Thread.run(Thread.java:595)
Caused by: org.apache.maven.plugin.CompilationFailureException: Compilation failure
\hudson\hudson-slave\workspace\UIMA-uimaFIT\trunk\uimafit-maven-plugin\src\main\java\org\apache\uima\fit\maven\EnhanceMojo.java:[28,-1]
cannot access javassist.CannotCompileException
bad class file: f:\hudson\hudson-slave\maven-repositories\0\org\javassist\javassist\3.17.1-GA\javassist-3.17.1-GA.jar(javassist/CannotCompileException.class)
class file has wrong version 50.0, should be 49.0

	at org.apache.maven.plugin.AbstractCompilerMojo.execute(AbstractCompilerMojo.java:656)
	at org.apache.maven.plugin.CompilerMojo.execute(CompilerMojo.java:128)
	at org.apache.maven.plugin.DefaultBuildPluginManager.executeMojo(DefaultBuildPluginManager.java:107)
	at org.apache.maven.lifecycle.internal.MojoExecutor.execute(MojoExecutor.java:209)
	... 27 more
Sending e-mails to: dev@uima.apache.org
channel stopped
Flushing results...
Flushing results done
Cobertura: Loaded information on 7 classes.
Cobertura: Saved information on 9 classes.
[WARNINGS] Skipping publisher since build result is FAILURE
Skipping Cobertura coverage report as build was not UNSTABLE or better ...

Mime
View raw message