uima-dev mailing list archives

Site index · List index
Message view « Date » · « Thread »
Top « Date » · « Thread »
From Apache Jenkins Server <jenk...@builds.apache.org>
Subject Build failed in Jenkins: UIMA Addons #110
Date Fri, 11 Jan 2013 08:32:58 GMT
See <https://builds.apache.org/job/UIMA%20Addons/110/changes>

Changes:

[tommaso] [UIMA-2566] - upgraded Solr version to 3.6.2

------------------------------------------
[...truncated 251 lines...]
[INFO] Configured Artifact: org.apache.uima:uima-build-resources:1:jar
[INFO] --- maven-dependency-plugin:2.3:unpack (copyDocbookInfoNextToOlink) @ AlchemyAPIAnnotator
---
> isMarkerOlder:
  artifact1 = /export/home/hudson/hudson-slave/maven-repositories/1/org/apache/uima/uima-build-resources/1/uima-build-resources-1.jar
  marker    = /export/home/hudson/hudson-slave/maven-repositories/1/org/apache/uima/uima-docbook-olink/1-SNAPSHOT/dependency-maven-plugin-markers/org.apache.uima-uima-build-resources-jar-1376161406
    artifact1 lastModified: 1343335350000
    marker lastModified: 1343335350000
< false = marker older than artifact?
mojoSucceeded org.apache.maven.plugins:maven-dependency-plugin:2.3(copyDocbookInfoNextToOlink)[INFO]
uima-build-resources-1.jar already unpacked.

mojoStarted org.apache.maven.plugins:maven-dependency-plugin:2.3(getOlink)
[INFO] 
[INFO] Configured Artifact: org.apache.uima:uima-docbook-olink:olink:1-SNAPSHOT:zip
[INFO] --- maven-dependency-plugin:2.3:unpack (getOlink) @ AlchemyAPIAnnotator ---
Downloading: http://repository.apache.org/snapshots/org/apache/uima/uima-docbook-olink/1-SNAPSHOT/maven-metadata.xml
Downloaded: http://repository.apache.org/snapshots/org/apache/uima/uima-docbook-olink/1-SNAPSHOT/maven-metadata.xml
(810 B at 0.3 KB/sec)
> isMarkerOlder:
  artifact1 = /export/home/hudson/hudson-slave/maven-repositories/1/org/apache/uima/uima-docbook-olink/1-SNAPSHOT/uima-docbook-olink-1-SNAPSHOT-olink.zip
  marker    = /export/home/hudson/hudson-slave/maven-repositories/1/org/apache/uima/uima-docbook-olink/1-SNAPSHOT/dependency-maven-plugin-markers/org.apache.uima-uima-docbook-olink-zip-olink-1-SNAPSHOT.marker
    artifact1 lastModified: 1343335352000
    marker lastModified: 1343335352000
< false = marker older than artifact?
mojoSucceeded org.apache.maven.plugins:maven-dependency-plugin:2.3(getOlink)[INFO] uima-docbook-olink-1-SNAPSHOT-olink.zip
already unpacked.

mojoStarted org.apache.maven.plugins:maven-jar-plugin:2.3.1(default-jar)
[INFO] 
[INFO] --- maven-jar-plugin:2.3.1:jar (default-jar) @ AlchemyAPIAnnotator ---
[INFO] Building jar: <https://builds.apache.org/job/UIMA%20Addons/ws/AlchemyAPIAnnotator/target/uima-an-alchemy.jar>
mojoSucceeded org.apache.maven.plugins:maven-jar-plugin:2.3.1(default-jar)
mojoStarted org.apache.maven.plugins:maven-site-plugin:3.0(attach-descriptor)
[INFO] 
[INFO] --- maven-site-plugin:3.0:attach-descriptor (attach-descriptor) @ AlchemyAPIAnnotator
---
mojoSucceeded org.apache.maven.plugins:maven-site-plugin:3.0(attach-descriptor)
mojoStarted org.apache.maven.plugins:maven-javadoc-plugin:2.7(attach-javadocs)
[INFO] 
[INFO] --- maven-javadoc-plugin:2.7:jar (attach-javadocs) @ AlchemyAPIAnnotator ---
[INFO] Building jar: <https://builds.apache.org/job/UIMA%20Addons/ws/AlchemyAPIAnnotator/target/uima-an-alchemy-javadoc.jar>
mojoSucceeded org.apache.maven.plugins:maven-javadoc-plugin:2.7(attach-javadocs)
mojoStarted com.agilejava.docbkx:docbkx-maven-plugin:2.0.14(html)
[INFO] 
[INFO] --- docbkx-maven-plugin:2.0.14:generate-html (html) @ AlchemyAPIAnnotator ---
[INFO] Processing input file: AlchemyAPIAnnotatorUserGuide.xml
[INFO] Applying customization parameters
[INFO] <https://builds.apache.org/job/UIMA%20Addons/ws/AlchemyAPIAnnotator/target/site/d/AlchemyAPIAnnotatorUserGuide.html>
has been generated.
mojoSucceeded com.agilejava.docbkx:docbkx-maven-plugin:2.0.14(html)
mojoStarted com.agilejava.docbkx:docbkx-maven-plugin:2.0.14(pdf)
[INFO] 
[INFO] Processing input file: AlchemyAPIAnnotatorUserGuide.xml
[INFO] --- docbkx-maven-plugin:2.0.14:generate-pdf (pdf) @ AlchemyAPIAnnotator ---
[INFO] Applying customization parameters
[INFO] targetFileExtension pdf
[INFO] type fo
Jan 11, 2013 8:30:54 AM org.apache.fop.events.LoggingEventListener processEvent
WARNING: Font "Symbol,normal,700" not found. Substituting with "Symbol,normal,400".
Jan 11, 2013 8:30:54 AM org.apache.fop.events.LoggingEventListener processEvent
WARNING: Font "ZapfDingbats,normal,700" not found. Substituting with "ZapfDingbats,normal,400".
Jan 11, 2013 8:30:54 AM org.apache.fop.events.LoggingEventListener processEvent
WARNING: The following feature isn't implemented by Apache FOP, yet: table-layout="auto" (on
fo:table) (See position 95:1015)
[INFO] <https://builds.apache.org/job/UIMA%20Addons/ws/AlchemyAPIAnnotator/target/docbkx/pdf/AlchemyAPIAnnotatorUserGuide.pdf>
has been generated.
[INFO] <https://builds.apache.org/job/UIMA%20Addons/ws/AlchemyAPIAnnotator/target/docbkx/pdf/AlchemyAPIAnnotatorUserGuide.fo>
has been generated.
mojoSucceeded com.agilejava.docbkx:docbkx-maven-plugin:2.0.14(pdf)
mojoStarted org.apache.maven.plugins:maven-resources-plugin:2.5(docbook-copy-images)
[INFO] 
[debug] execute contextualize
[INFO] Using 'UTF-8' encoding to copy filtered resources.
[INFO] Copying 0 resource
[INFO] --- maven-resources-plugin:2.5:copy-resources (docbook-copy-images) @ AlchemyAPIAnnotator
---
mojoSucceeded org.apache.maven.plugins:maven-resources-plugin:2.5(docbook-copy-images)
mojoStarted org.apache.maven.plugins:maven-resources-plugin:2.5(docbook-copy-css)
[INFO] 
[debug] execute contextualize
[INFO] Using 'UTF-8' encoding to copy filtered resources.
[INFO] Copying 1 resource
[INFO] --- maven-resources-plugin:2.5:copy-resources (docbook-copy-css) @ AlchemyAPIAnnotator
---
mojoSucceeded org.apache.maven.plugins:maven-resources-plugin:2.5(docbook-copy-css)
mojoStarted org.apache.maven.plugins:maven-resources-plugin:2.5(docbook-move-pdf)
[INFO] 
[debug] execute contextualize
[INFO] Using 'UTF-8' encoding to copy filtered resources.
[INFO] Copying 1 resource
[INFO] --- maven-resources-plugin:2.5:copy-resources (docbook-move-pdf) @ AlchemyAPIAnnotator
---
mojoSucceeded org.apache.maven.plugins:maven-resources-plugin:2.5(docbook-move-pdf)
mojoStarted org.apache.maven.plugins:maven-resources-plugin:2.5(copy standard target jar to
base-bin/lib)
[INFO] 
[debug] execute contextualize
[INFO] Using 'UTF-8' encoding to copy filtered resources.
[INFO] Copying 2 resources
[INFO] --- maven-resources-plugin:2.5:copy-resources (copy standard target jar to base-bin/lib)
@ AlchemyAPIAnnotator ---
mojoSucceeded org.apache.maven.plugins:maven-resources-plugin:2.5(copy standard target jar
to base-bin/lib)
mojoStarted org.apache.maven.plugins:maven-resources-plugin:2.5(copy generated docbook artifacts
to base-bin/doc folder)
[INFO] 
[debug] execute contextualize
[INFO] Using 'UTF-8' encoding to copy filtered resources.
[INFO] Copying 3 resources
[INFO] --- maven-resources-plugin:2.5:copy-resources (copy generated docbook artifacts to
base-bin/doc folder) @ AlchemyAPIAnnotator ---
mojoSucceeded org.apache.maven.plugins:maven-resources-plugin:2.5(copy generated docbook artifacts
to base-bin/doc folder)
mojoStarted org.apache.uima:PearPackagingMavenPlugin:2.3.1(build uima annnotator Pear)
[INFO] 
[INFO] --- PearPackagingMavenPlugin:2.3.1:package (build uima annnotator Pear) @ AlchemyAPIAnnotator
---
[INFO] Start building PEAR package for component AlchemyAPIAnnotator
[INFO] PEAR package for component AlchemyAPIAnnotator successfully created at: <https://builds.apache.org/job/UIMA%20Addons/ws/AlchemyAPIAnnotator/target/AlchemyAPIAnnotator.pear>
mojoSucceeded org.apache.uima:PearPackagingMavenPlugin:2.3.1(build uima annnotator Pear)
mojoStarted org.apache.maven.plugins:maven-resources-plugin:2.5(Copy base-bin to osgi)
[INFO] 
[debug] execute contextualize
[INFO] Using 'UTF-8' encoding to copy filtered resources.
[INFO] Copying 16 resources
[INFO] --- maven-resources-plugin:2.5:copy-resources (Copy base-bin to osgi) @ AlchemyAPIAnnotator
---
mojoSucceeded org.apache.maven.plugins:maven-resources-plugin:2.5(Copy base-bin to osgi)
mojoStarted org.apache.maven.plugins:maven-resources-plugin:2.5(Copy base-bin to pearPackaging)
[INFO] 
[debug] execute contextualize
[INFO] Using 'UTF-8' encoding to copy filtered resources.
[INFO] Copying 19 resources
[INFO] --- maven-resources-plugin:2.5:copy-resources (Copy base-bin to pearPackaging) @ AlchemyAPIAnnotator
---
mojoSucceeded org.apache.maven.plugins:maven-resources-plugin:2.5(Copy base-bin to pearPackaging)
mojoStarted org.apache.maven.plugins:maven-assembly-plugin:2.2.1(binary-release)
[INFO] 
[INFO] --- maven-assembly-plugin:2.2.1:single (binary-release) @ AlchemyAPIAnnotator ---
[INFO] Skipping the assembly in this project because it's not the Execution Root
mojoSucceeded org.apache.maven.plugins:maven-assembly-plugin:2.2.1(binary-release)
mojoStarted org.apache.felix:maven-bundle-plugin:2.3.4(uima-bundle)
[INFO] 
[INFO] --- maven-bundle-plugin:2.3.4:manifest (uima-bundle) @ AlchemyAPIAnnotator ---
mojoSucceeded org.apache.felix:maven-bundle-plugin:2.3.4(uima-bundle)
mojoStarted org.apache.maven.plugins:maven-jar-plugin:2.3.1(Create OSGi Jar)
[INFO] 
[INFO] --- maven-jar-plugin:2.3.1:jar (Create OSGi Jar) @ AlchemyAPIAnnotator ---
mojoFailed org.apache.maven.plugins:maven-jar-plugin:2.3.1(Create OSGi Jar)
projectFailed org.apache.uima:AlchemyAPIAnnotator:2.3.2-SNAPSHOT
sessionEnded
[INFO] ------------------------------------------------------------------------
[INFO] Reactor Summary:
[INFO] 
[INFO] Apache UIMA-AddOns: uima-addons-parent ............ SUCCESS [2:29.826s]
[INFO] Apache UIMA Annotator: AlchemyAPIAnnotator ........ FAILURE [4:00.917s]
[INFO] Apache UIMA Annotator: BSFAnnotator ............... SKIPPED
[INFO] Apache UIMA Annotator: ConceptMapper .............. SKIPPED
[INFO] Apache UIMA Annotator: ConfigurableFeatureExtractor  SKIPPED
[INFO] Apache UIMA Annotator: DictionaryAnnotator ........ SKIPPED
[INFO] Apache UIMA Addon: FsVariables .................... SKIPPED
[INFO] Apache UIMA Annotator: Lucas ...................... SKIPPED
[INFO] Apache UIMA Annotator: OpenCalaisAnnotator ........ SKIPPED
[INFO] Apache UIMA Addon: PearPackagingAntTask ........... SKIPPED
[INFO] Apache UIMA Annotator: RegularExpressionAnnotator . SKIPPED
[INFO] Apache UIMA Addon: SimpleServer ................... SKIPPED
[INFO] Apache UIMA Annotator: SnowballAnnotator .......... SKIPPED
[INFO] Apache UIMA Annotator: Solrcas .................... SKIPPED
[INFO] Apache UIMA Annotator: Tagger ..................... SKIPPED
[INFO] Apache UIMA Annotator: TikaAnnotator .............. SKIPPED
[INFO] Apache UIMA Annotator: WhitespaceTokenizer ........ SKIPPED
[INFO] Apache UIMA Aggregate: uima-addons ................ SKIPPED
[INFO] ------------------------------------------------------------------------
[INFO] BUILD FAILURE
[INFO] ------------------------------------------------------------------------
[INFO] Total time: 7:00.997s
[INFO] Finished at: Fri Jan 11 08:31:55 GMT+00:00 2013
[INFO] Final Memory: 33M/133M
[INFO] ------------------------------------------------------------------------
Projects to build: [MavenProject: org.apache.uima:uima-addons-parent:2.3.2-SNAPSHOT @ <https://builds.apache.org/job/UIMA%20Addons/ws/uima-addons-parent/pom.xml,>
MavenProject: org.apache.uima:AlchemyAPIAnnotator:2.3.2-SNAPSHOT @ <https://builds.apache.org/job/UIMA%20Addons/ws/AlchemyAPIAnnotator/pom.xml,>
MavenProject: org.apache.uima:BSFAnnotator:2.3.2-SNAPSHOT @ <https://builds.apache.org/job/UIMA%20Addons/ws/BSFAnnotator/pom.xml,>
MavenProject: org.apache.uima:ConceptMapper:2.3.2-SNAPSHOT @ <https://builds.apache.org/job/UIMA%20Addons/ws/ConceptMapper/pom.xml,>
MavenProject: org.apache.uima:ConfigurableFeatureExtractor:2.3.2-SNAPSHOT @ <https://builds.apache.org/job/UIMA%20Addons/ws/ConfigurableFeatureExtractor/pom.xml,>
MavenProject: org.apache.uima:DictionaryAnnotator:2.3.2-SNAPSHOT @ <https://builds.apache.org/job/UIMA%20Addons/ws/DictionaryAnnotator/pom.xml,>
MavenProject: org.apache.uima:FsVariables:2.3.2-SNAPSHOT @ <https://builds.apache.org/job/UIMA%20Addons/ws/FsVariables/pom.xml,>
MavenProject: org.apache.uima:Lucas:2.3.2-SNAPSHOT @ <https://builds.apache.org/job/UIMA%20Addons/ws/Lucas/pom.xml,>
MavenProject: org.apache.uima:OpenCalaisAnnotator:2.3.2-SNAPSHOT @ <https://builds.apache.org/job/UIMA%20Addons/ws/OpenCalaisAnnotator/pom.xml,>
MavenProject: org.apache.uima:PearPackagingAntTask:2.3.2-SNAPSHOT @ <https://builds.apache.org/job/UIMA%20Addons/ws/PearPackagingAntTask/pom.xml,>
MavenProject: org.apache.uima:RegularExpressionAnnotator:2.3.2-SNAPSHOT @ <https://builds.apache.org/job/UIMA%20Addons/ws/RegularExpressionAnnotator/pom.xml,>
MavenProject: org.apache.uima:SimpleServer:2.3.2-SNAPSHOT @ <https://builds.apache.org/job/UIMA%20Addons/ws/SimpleServer/pom.xml,>
MavenProject: org.apache.uima:SnowballAnnotator:2.3.2-SNAPSHOT @ <https://builds.apache.org/job/UIMA%20Addons/ws/SnowballAnnotator/pom.xml,>
MavenProject: org.apache.uima:Solrcas:2.3.2-SNAPSHOT @ <https://builds.apache.org/job/UIMA%20Addons/ws/Solrcas/pom.xml,>
MavenProject: org.apache.uima:Tagger:2.3.2-SNAPSHOT @ <https://builds.apache.org/job/UIMA%20Addons/ws/Tagger/pom.xml,>
MavenProject: org.apache.uima:TikaAnnotator:2.3.2-SNAPSHOT @ <https://builds.apache.org/job/UIMA%20Addons/ws/TikaAnnotator/pom.xml,>
MavenProject: org.apache.uima:WhitespaceTokenizer:2.3.2-SNAPSHOT @ <https://builds.apache.org/job/UIMA%20Addons/ws/WhitespaceTokenizer/pom.xml,>
MavenProject: org.apache.uima:uima-addons:2.3.2-SNAPSHOT @ <https://builds.apache.org/job/UIMA%20Addons/ws/pom.xml]>
[JENKINS] Archiving <https://builds.apache.org/job/UIMA%20Addons/ws/SimpleServer/pom.xml>
to /home/hudson/hudson/jobs/UIMA Addons/modules/org.apache.uima$SimpleServer/builds/2013-01-11_08-22-06/archive/org.apache.uima/SimpleServer/2.3.2-SNAPSHOT/SimpleServer-2.3.2-SNAPSHOT.pom
[JENKINS] Archiving <https://builds.apache.org/job/UIMA%20Addons/ws/ConfigurableFeatureExtractor/pom.xml>
to /home/hudson/hudson/jobs/UIMA Addons/modules/org.apache.uima$ConfigurableFeatureExtractor/builds/2013-01-11_08-22-03/archive/org.apache.uima/ConfigurableFeatureExtractor/2.3.2-SNAPSHOT/ConfigurableFeatureExtractor-2.3.2-SNAPSHOT.pom
[JENKINS] Archiving <https://builds.apache.org/job/UIMA%20Addons/ws/DictionaryAnnotator/pom.xml>
to /home/hudson/hudson/jobs/UIMA Addons/modules/org.apache.uima$DictionaryAnnotator/builds/2013-01-11_08-22-03/archive/org.apache.uima/DictionaryAnnotator/2.3.2-SNAPSHOT/DictionaryAnnotator-2.3.2-SNAPSHOT.pom
[JENKINS] Archiving <https://builds.apache.org/job/UIMA%20Addons/ws/TikaAnnotator/pom.xml>
to /home/hudson/hudson/jobs/UIMA Addons/modules/org.apache.uima$TikaAnnotator/builds/2013-01-11_08-22-07/archive/org.apache.uima/TikaAnnotator/2.3.2-SNAPSHOT/TikaAnnotator-2.3.2-SNAPSHOT.pom
[JENKINS] Archiving <https://builds.apache.org/job/UIMA%20Addons/ws/FsVariables/pom.xml>
to /home/hudson/hudson/jobs/UIMA Addons/modules/org.apache.uima$FsVariables/builds/2013-01-11_08-22-04/archive/org.apache.uima/FsVariables/2.3.2-SNAPSHOT/FsVariables-2.3.2-SNAPSHOT.pom
[JENKINS] Archiving <https://builds.apache.org/job/UIMA%20Addons/ws/Tagger/pom.xml>
to /home/hudson/hudson/jobs/UIMA Addons/modules/org.apache.uima$Tagger/builds/2013-01-11_08-22-07/archive/org.apache.uima/Tagger/2.3.2-SNAPSHOT/Tagger-2.3.2-SNAPSHOT.pom
[JENKINS] Archiving <https://builds.apache.org/job/UIMA%20Addons/ws/PearPackagingAntTask/pom.xml>
to /home/hudson/hudson/jobs/UIMA Addons/modules/org.apache.uima$PearPackagingAntTask/builds/2013-01-11_08-22-05/archive/org.apache.uima/PearPackagingAntTask/2.3.2-SNAPSHOT/PearPackagingAntTask-2.3.2-SNAPSHOT.pom
[JENKINS] Archiving <https://builds.apache.org/job/UIMA%20Addons/ws/Solrcas/pom.xml>
to /home/hudson/hudson/jobs/UIMA Addons/modules/org.apache.uima$Solrcas/builds/2013-01-11_08-22-07/archive/org.apache.uima/Solrcas/2.3.2-SNAPSHOT/Solrcas-2.3.2-SNAPSHOT.pom
[JENKINS] Archiving <https://builds.apache.org/job/UIMA%20Addons/ws/AlchemyAPIAnnotator/pom.xml>
to /home/hudson/hudson/jobs/UIMA Addons/modules/org.apache.uima$AlchemyAPIAnnotator/builds/2013-01-11_08-22-01/archive/org.apache.uima/AlchemyAPIAnnotator/2.3.2-SNAPSHOT/AlchemyAPIAnnotator-2.3.2-SNAPSHOT.pom
[JENKINS] Archiving <https://builds.apache.org/job/UIMA%20Addons/ws/AlchemyAPIAnnotator/target/uima-an-alchemy.jar>
to /home/hudson/hudson/jobs/UIMA Addons/modules/org.apache.uima$AlchemyAPIAnnotator/builds/2013-01-11_08-22-01/archive/org.apache.uima/AlchemyAPIAnnotator/2.3.2-SNAPSHOT/AlchemyAPIAnnotator-2.3.2-SNAPSHOT.jar
[JENKINS] Archiving <https://builds.apache.org/job/UIMA%20Addons/ws/AlchemyAPIAnnotator/target/uima-an-alchemy-javadoc.jar>
to /home/hudson/hudson/jobs/UIMA Addons/modules/org.apache.uima$AlchemyAPIAnnotator/builds/2013-01-11_08-22-01/archive/org.apache.uima/AlchemyAPIAnnotator/2.3.2-SNAPSHOT/AlchemyAPIAnnotator-2.3.2-SNAPSHOT-javadoc.jar
[JENKINS] Archiving <https://builds.apache.org/job/UIMA%20Addons/ws/OpenCalaisAnnotator/pom.xml>
to /home/hudson/hudson/jobs/UIMA Addons/modules/org.apache.uima$OpenCalaisAnnotator/builds/2013-01-11_08-22-05/archive/org.apache.uima/OpenCalaisAnnotator/2.3.2-SNAPSHOT/OpenCalaisAnnotator-2.3.2-SNAPSHOT.pom
[JENKINS] Archiving <https://builds.apache.org/job/UIMA%20Addons/ws/pom.xml> to /home/hudson/hudson/jobs/UIMA
Addons/modules/org.apache.uima$uima-addons/builds/2013-01-11_08-22-00/archive/org.apache.uima/uima-addons/2.3.2-SNAPSHOT/uima-addons-2.3.2-SNAPSHOT.pom
[JENKINS] Archiving <https://builds.apache.org/job/UIMA%20Addons/ws/WhitespaceTokenizer/pom.xml>
to /home/hudson/hudson/jobs/UIMA Addons/modules/org.apache.uima$WhitespaceTokenizer/builds/2013-01-11_08-22-07/archive/org.apache.uima/WhitespaceTokenizer/2.3.2-SNAPSHOT/WhitespaceTokenizer-2.3.2-SNAPSHOT.pom
[JENKINS] Archiving <https://builds.apache.org/job/UIMA%20Addons/ws/ConceptMapper/pom.xml>
to /home/hudson/hudson/jobs/UIMA Addons/modules/org.apache.uima$ConceptMapper/builds/2013-01-11_08-22-02/archive/org.apache.uima/ConceptMapper/2.3.2-SNAPSHOT/ConceptMapper-2.3.2-SNAPSHOT.pom
[JENKINS] Archiving <https://builds.apache.org/job/UIMA%20Addons/ws/RegularExpressionAnnotator/pom.xml>
to /home/hudson/hudson/jobs/UIMA Addons/modules/org.apache.uima$RegularExpressionAnnotator/builds/2013-01-11_08-22-05/archive/org.apache.uima/RegularExpressionAnnotator/2.3.2-SNAPSHOT/RegularExpressionAnnotator-2.3.2-SNAPSHOT.pom
[JENKINS] Archiving <https://builds.apache.org/job/UIMA%20Addons/ws/BSFAnnotator/pom.xml>
to /home/hudson/hudson/jobs/UIMA Addons/modules/org.apache.uima$BSFAnnotator/builds/2013-01-11_08-22-02/archive/org.apache.uima/BSFAnnotator/2.3.2-SNAPSHOT/BSFAnnotator-2.3.2-SNAPSHOT.pom
[JENKINS] Archiving <https://builds.apache.org/job/UIMA%20Addons/ws/uima-addons-parent/pom.xml>
to /home/hudson/hudson/jobs/UIMA Addons/modules/org.apache.uima$uima-addons-parent/builds/2013-01-11_08-22-01/archive/org.apache.uima/uima-addons-parent/2.3.2-SNAPSHOT/uima-addons-parent-2.3.2-SNAPSHOT.pom
[JENKINS] Archiving <https://builds.apache.org/job/UIMA%20Addons/ws/SnowballAnnotator/pom.xml>
to /home/hudson/hudson/jobs/UIMA Addons/modules/org.apache.uima$SnowballAnnotator/builds/2013-01-11_08-22-06/archive/org.apache.uima/SnowballAnnotator/2.3.2-SNAPSHOT/SnowballAnnotator-2.3.2-SNAPSHOT.pom
[JENKINS] Archiving <https://builds.apache.org/job/UIMA%20Addons/ws/Lucas/pom.xml> to
/home/hudson/hudson/jobs/UIMA Addons/modules/org.apache.uima$Lucas/builds/2013-01-11_08-22-04/archive/org.apache.uima/Lucas/2.3.2-SNAPSHOT/Lucas-2.3.2-SNAPSHOT.pom
Waiting for Jenkins to finish collecting data
mavenExecutionResult exceptions not empty
message : Failed to execute goal org.apache.maven.plugins:maven-jar-plugin:2.3.1:jar (Create
OSGi Jar) on project AlchemyAPIAnnotator: Error assembling JAR
cause : Error assembling JAR
Stack trace : 
org.apache.maven.lifecycle.LifecycleExecutionException: Failed to execute goal org.apache.maven.plugins:maven-jar-plugin:2.3.1:jar
(Create OSGi Jar) on project AlchemyAPIAnnotator: Error assembling JAR
	at org.apache.maven.lifecycle.internal.MojoExecutor.execute(MojoExecutor.java:217)
	at org.apache.maven.lifecycle.internal.MojoExecutor.execute(MojoExecutor.java:153)
	at org.apache.maven.lifecycle.internal.MojoExecutor.execute(MojoExecutor.java:145)
	at org.apache.maven.lifecycle.internal.LifecycleModuleBuilder.buildProject(LifecycleModuleBuilder.java:84)
	at org.apache.maven.lifecycle.internal.LifecycleModuleBuilder.buildProject(LifecycleModuleBuilder.java:59)
	at org.apache.maven.lifecycle.internal.LifecycleStarter.singleThreadedBuild(LifecycleStarter.java:183)
	at org.apache.maven.lifecycle.internal.LifecycleStarter.execute(LifecycleStarter.java:161)
	at org.apache.maven.DefaultMaven.doExecute(DefaultMaven.java:319)
	at org.apache.maven.DefaultMaven.execute(DefaultMaven.java:156)
	at org.jvnet.hudson.maven3.launcher.Maven3Launcher.main(Maven3Launcher.java:79)
	at sun.reflect.NativeMethodAccessorImpl.invoke0(Native Method)
	at sun.reflect.NativeMethodAccessorImpl.invoke(NativeMethodAccessorImpl.java:39)
	at sun.reflect.DelegatingMethodAccessorImpl.invoke(DelegatingMethodAccessorImpl.java:25)
	at java.lang.reflect.Method.invoke(Method.java:592)
	at org.codehaus.plexus.classworlds.launcher.Launcher.launchStandard(Launcher.java:329)
	at org.codehaus.plexus.classworlds.launcher.Launcher.launch(Launcher.java:239)
	at org.jvnet.hudson.maven3.agent.Maven3Main.launch(Maven3Main.java:158)
	at hudson.maven.Maven3Builder.call(Maven3Builder.java:100)
	at hudson.maven.Maven3Builder.call(Maven3Builder.java:66)
	at hudson.remoting.UserRequest.perform(UserRequest.java:118)
	at hudson.remoting.UserRequest.perform(UserRequest.java:48)
	at hudson.remoting.Request$2.run(Request.java:326)
	at hudson.remoting.InterceptingExecutorService$1.call(InterceptingExecutorService.java:72)
	at java.util.concurrent.FutureTask$Sync.innerRun(FutureTask.java:269)
	at java.util.concurrent.FutureTask.run(FutureTask.java:123)
	at java.util.concurrent.ThreadPoolExecutor$Worker.runTask(ThreadPoolExecutor.java:651)
	at java.util.concurrent.ThreadPoolExecutor$Worker.run(ThreadPoolExecutor.java:676)
	at java.lang.Thread.run(Thread.java:595)
Caused by: org.apache.maven.plugin.MojoExecutionException: Error assembling JAR
	at org.apache.maven.plugin.jar.AbstractJarMojo.createArchive(AbstractJarMojo.java:223)
	at org.apache.maven.plugin.jar.AbstractJarMojo.execute(AbstractJarMojo.java:235)
	at org.apache.maven.plugin.DefaultBuildPluginManager.executeMojo(DefaultBuildPluginManager.java:101)
	at org.apache.maven.lifecycle.internal.MojoExecutor.execute(MojoExecutor.java:209)
	... 27 more
Caused by: org.codehaus.plexus.archiver.ArchiverException: Failed to read filesystem attributes
for: <https://builds.apache.org/job/UIMA%20Addons/ws/AlchemyAPIAnnotator/pom.xml>
	at org.codehaus.plexus.archiver.ArchiveEntry.createFileEntry(ArchiveEntry.java:161)
	at org.codehaus.plexus.archiver.AbstractArchiver.addFile(AbstractArchiver.java:374)
	at org.codehaus.plexus.archiver.AbstractArchiver.addFile(AbstractArchiver.java:290)
	at org.apache.maven.archiver.MavenArchiver.createArchive(MavenArchiver.java:487)
	at org.apache.maven.plugin.jar.AbstractJarMojo.createArchive(AbstractJarMojo.java:216)
	... 30 more
Caused by: java.io.IOException: Failed to retrieve numeric file attributes using: '/bin/sh
-c ls -1nlad '<https://builds.apache.org/job/UIMA%20Addons/ws/AlchemyAPIAnnotator/pom.xml''>
	at org.codehaus.plexus.components.io.attributes.PlexusIoResourceAttributeUtils.executeLs(PlexusIoResourceAttributeUtils.java:287)
	at org.codehaus.plexus.components.io.attributes.PlexusIoResourceAttributeUtils.getFileAttributesByPath(PlexusIoResourceAttributeUtils.java:223)
	at org.codehaus.plexus.components.io.attributes.PlexusIoResourceAttributeUtils.getFileAttributes(PlexusIoResourceAttributeUtils.java:168)
	at org.codehaus.plexus.archiver.ArchiveEntry.createFileEntry(ArchiveEntry.java:157)
	... 34 more
Caused by: org.codehaus.plexus.util.cli.CommandLineException: Error while executing process.
	at org.codehaus.plexus.util.cli.Commandline.execute(Commandline.java:656)
	at org.codehaus.plexus.util.cli.CommandLineUtils.executeCommandLine(CommandLineUtils.java:144)
	at org.codehaus.plexus.util.cli.CommandLineUtils.executeCommandLine(CommandLineUtils.java:107)
	at org.codehaus.plexus.components.io.attributes.PlexusIoResourceAttributeUtils.executeLs(PlexusIoResourceAttributeUtils.java:277)
	... 37 more
Caused by: java.io.IOException: Not enough space
	at java.lang.UNIXProcess.forkAndExec(Native Method)
	at java.lang.UNIXProcess.<init>(UNIXProcess.java:53)
	at java.lang.ProcessImpl.start(ProcessImpl.java:65)
	at java.lang.ProcessBuilder.start(ProcessBuilder.java:451)
	at java.lang.Runtime.exec(Runtime.java:591)
	at java.lang.Runtime.exec(Runtime.java:507)
	at org.codehaus.plexus.util.cli.Commandline.execute(Commandline.java:636)
	... 40 more
channel stopped

Mime
View raw message