uima-dev mailing list archives

Site index · List index
Message view « Date » · « Thread »
Top « Date » · « Thread »
From Apache Jenkins Server <jenk...@builds.apache.org>
Subject Build failed in Jenkins: UIMA Addons #112
Date Thu, 17 Jan 2013 23:02:49 GMT
See <https://builds.apache.org/job/UIMA%20Addons/112/>

------------------------------------------
[...truncated 2293 lines...]
[INFO] Applying customization parameters
[INFO] <https://builds.apache.org/job/UIMA%20Addons/ws/PearPackagingAntTask/target/site/d/PearPackagingAntTaskUserGuide.html>
has been generated.
mojoSucceeded com.agilejava.docbkx:docbkx-maven-plugin:2.0.14(html)
mojoStarted com.agilejava.docbkx:docbkx-maven-plugin:2.0.14(pdf)
[INFO] 
[INFO] Processing input file: PearPackagingAntTaskUserGuide.xml
[INFO] --- docbkx-maven-plugin:2.0.14:generate-pdf (pdf) @ PearPackagingAntTask ---
[INFO] Applying customization parameters
[INFO] targetFileExtension pdf
[INFO] type fo
Jan 17, 2013 11:02:19 PM org.apache.fop.events.LoggingEventListener processEvent
WARNING: Font "Symbol,normal,700" not found. Substituting with "Symbol,normal,400".
Jan 17, 2013 11:02:19 PM org.apache.fop.events.LoggingEventListener processEvent
WARNING: Font "ZapfDingbats,normal,700" not found. Substituting with "ZapfDingbats,normal,400".
Jan 17, 2013 11:02:19 PM org.apache.fop.events.LoggingEventListener processEvent
WARNING: Line 1 of a paragraph overflows the available area by 3200 millipoints. (See position
79:599)
Jan 17, 2013 11:02:19 PM org.apache.fop.events.LoggingEventListener processEvent
WARNING: Line 1 of a paragraph overflows the available area by 41000 millipoints. (See position
106:599)
[INFO] <https://builds.apache.org/job/UIMA%20Addons/ws/PearPackagingAntTask/target/docbkx/pdf/PearPackagingAntTaskUserGuide.pdf>
has been generated.
[INFO] <https://builds.apache.org/job/UIMA%20Addons/ws/PearPackagingAntTask/target/docbkx/pdf/PearPackagingAntTaskUserGuide.fo>
has been generated.
mojoSucceeded com.agilejava.docbkx:docbkx-maven-plugin:2.0.14(pdf)
mojoStarted org.apache.maven.plugins:maven-resources-plugin:2.5(docbook-copy-images)
[INFO] 
[debug] execute contextualize
[INFO] Using 'UTF-8' encoding to copy filtered resources.
[INFO] Copying 0 resource
[INFO] --- maven-resources-plugin:2.5:copy-resources (docbook-copy-images) @ PearPackagingAntTask
---
mojoSucceeded org.apache.maven.plugins:maven-resources-plugin:2.5(docbook-copy-images)
mojoStarted org.apache.maven.plugins:maven-resources-plugin:2.5(docbook-copy-css)
[INFO] 
[debug] execute contextualize
[INFO] Using 'UTF-8' encoding to copy filtered resources.
[INFO] Copying 1 resource
[INFO] --- maven-resources-plugin:2.5:copy-resources (docbook-copy-css) @ PearPackagingAntTask
---
mojoSucceeded org.apache.maven.plugins:maven-resources-plugin:2.5(docbook-copy-css)
mojoStarted org.apache.maven.plugins:maven-resources-plugin:2.5(docbook-move-pdf)
[INFO] 
[debug] execute contextualize
[INFO] Using 'UTF-8' encoding to copy filtered resources.
[INFO] Copying 1 resource
[INFO] --- maven-resources-plugin:2.5:copy-resources (docbook-move-pdf) @ PearPackagingAntTask
---
mojoSucceeded org.apache.maven.plugins:maven-resources-plugin:2.5(docbook-move-pdf)
mojoStarted org.apache.maven.plugins:maven-resources-plugin:2.5(copy standard target jar to
base-bin/lib)
[INFO] 
[debug] execute contextualize
[INFO] Using 'UTF-8' encoding to copy filtered resources.
[INFO] Copying 2 resources
[INFO] --- maven-resources-plugin:2.5:copy-resources (copy standard target jar to base-bin/lib)
@ PearPackagingAntTask ---
mojoSucceeded org.apache.maven.plugins:maven-resources-plugin:2.5(copy standard target jar
to base-bin/lib)
mojoStarted org.apache.maven.plugins:maven-resources-plugin:2.5(copy generated docbook artifacts
to base-bin/doc folder)
[INFO] 
[debug] execute contextualize
[INFO] Using 'UTF-8' encoding to copy filtered resources.
[INFO] Copying 3 resources
[INFO] --- maven-resources-plugin:2.5:copy-resources (copy generated docbook artifacts to
base-bin/doc folder) @ PearPackagingAntTask ---
mojoSucceeded org.apache.maven.plugins:maven-resources-plugin:2.5(copy generated docbook artifacts
to base-bin/doc folder)
mojoStarted org.apache.maven.plugins:maven-assembly-plugin:2.2.1(binary-release)
[INFO] 
[INFO] Skipping the assembly in this project because it's not the Execution Root
[INFO] --- maven-assembly-plugin:2.2.1:single (binary-release) @ PearPackagingAntTask ---
mojoSucceeded org.apache.maven.plugins:maven-assembly-plugin:2.2.1(binary-release)
mojoStarted org.apache.maven.plugins:maven-install-plugin:2.3.1(default-install)
[INFO] 
[INFO] Installing <https://builds.apache.org/job/UIMA%20Addons/ws/PearPackagingAntTask/target/uima-pear-ant-task.jar>
to /export/home/hudson/hudson-slave/maven-repositories/0/org/apache/uima/PearPackagingAntTask/2.3.2-SNAPSHOT/PearPackagingAntTask-2.3.2-SNAPSHOT.jar
[INFO] Installing <https://builds.apache.org/job/UIMA%20Addons/ws/PearPackagingAntTask/pom.xml>
to /export/home/hudson/hudson-slave/maven-repositories/0/org/apache/uima/PearPackagingAntTask/2.3.2-SNAPSHOT/PearPackagingAntTask-2.3.2-SNAPSHOT.pom
[INFO] Installing <https://builds.apache.org/job/UIMA%20Addons/ws/PearPackagingAntTask/target/uima-pear-ant-task-javadoc.jar>
to /export/home/hudson/hudson-slave/maven-repositories/0/org/apache/uima/PearPackagingAntTask/2.3.2-SNAPSHOT/PearPackagingAntTask-2.3.2-SNAPSHOT-javadoc.jar
[INFO] --- maven-install-plugin:2.3.1:install (default-install) @ PearPackagingAntTask ---
mojoSucceeded org.apache.maven.plugins:maven-install-plugin:2.3.1(default-install)
projectSucceeded org.apache.uima:PearPackagingAntTask:2.3.2-SNAPSHOT
projectStarted org.apache.uima:RegularExpressionAnnotator:2.3.2-SNAPSHOT
[INFO]                                                                         
[INFO] ------------------------------------------------------------------------
[INFO] Building Apache UIMA Annotator: RegularExpressionAnnotator 2.3.2-SNAPSHOT
[INFO] ------------------------------------------------------------------------
mojoStarted org.apache.maven.plugins:maven-clean-plugin:2.4.1(default-clean)
[INFO] 
[INFO] --- maven-clean-plugin:2.4.1:clean (default-clean) @ RegularExpressionAnnotator ---[INFO]
Deleting <https://builds.apache.org/job/UIMA%20Addons/ws/RegularExpressionAnnotator/target>

mojoSucceeded org.apache.maven.plugins:maven-clean-plugin:2.4.1(default-clean)
mojoStarted org.codehaus.mojo:build-helper-maven-plugin:1.7(parse-project-version)
[INFO] 
[INFO] --- build-helper-maven-plugin:1.7:parse-version (parse-project-version) @ RegularExpressionAnnotator
---
mojoSucceeded org.codehaus.mojo:build-helper-maven-plugin:1.7(parse-project-version)
mojoStarted org.apache.uima:uima-build-helper-maven-plugin:4(set buildYear and buildMonth)
[INFO] 
[INFO] --- uima-build-helper-maven-plugin:4:parse-date-time (set buildYear and buildMonth)
@ RegularExpressionAnnotator ---
mojoSucceeded org.apache.uima:uima-build-helper-maven-plugin:4(set buildYear and buildMonth)
mojoStarted org.codehaus.mojo:xmlbeans-maven-plugin:2.3.3(default)
[INFO] 
[INFO] --- xmlbeans-maven-plugin:2.3.3:xmlbeans (default) @ RegularExpressionAnnotator ---
mojoSucceeded org.codehaus.mojo:xmlbeans-maven-plugin:2.3.3(default)
mojoStarted org.apache.maven.plugins:maven-remote-resources-plugin:1.2.1(default)
[INFO] 
[INFO] --- maven-remote-resources-plugin:1.2.1:process (default) @ RegularExpressionAnnotator
---
mojoSucceeded org.apache.maven.plugins:maven-remote-resources-plugin:1.2.1(default)
mojoStarted org.apache.maven.plugins:maven-resources-plugin:2.5(default-resources)
[INFO] 
[debug] execute contextualize
[INFO] Using 'UTF-8' encoding to copy filtered resources.
[INFO] Copying 1 resource
[INFO] Copying 242 resources
[INFO] Copying 3 resources
[INFO] --- maven-resources-plugin:2.5:resources (default-resources) @ RegularExpressionAnnotator
---
mojoSucceeded org.apache.maven.plugins:maven-resources-plugin:2.5(default-resources)
mojoStarted org.apache.maven.plugins:maven-dependency-plugin:2.3(copy dependencies to base-bin/lib)
[INFO] 
[INFO] Copying geronimo-stax-api_1.0_spec-1.0.1.jar to <https://builds.apache.org/job/UIMA%20Addons/ws/RegularExpressionAnnotator/target/base-bin/lib/geronimo-stax-api_1.0_spec-1.0.1.jar>
[INFO] Copying xmlbeans-2.4.0.jar to <https://builds.apache.org/job/UIMA%20Addons/ws/RegularExpressionAnnotator/target/base-bin/lib/xmlbeans-2.4.0.jar>
[INFO] --- maven-dependency-plugin:2.3:copy-dependencies (copy dependencies to base-bin/lib)
@ RegularExpressionAnnotator ---
mojoSucceeded org.apache.maven.plugins:maven-dependency-plugin:2.3(copy dependencies to base-bin/lib)
mojoStarted org.apache.maven.plugins:maven-dependency-plugin:2.3(Copy uima dependencies to
osgi/lib)
[INFO] 
[INFO] Configured Artifact: org.apache.uima:uimaj-core:2.3.1:jar
[INFO] Copying uimaj-core-2.3.1.jar to <https://builds.apache.org/job/UIMA%20Addons/ws/RegularExpressionAnnotator/target/osgi/lib/uimaj-core-2.3.1.jar>
[INFO] --- maven-dependency-plugin:2.3:copy (Copy uima dependencies to osgi/lib) @ RegularExpressionAnnotator
---
mojoSucceeded org.apache.maven.plugins:maven-dependency-plugin:2.3(Copy uima dependencies
to osgi/lib)
mojoStarted org.apache.maven.plugins:maven-resources-plugin:2.5(copy standard dirs and files
to base-bin)
[INFO] 
[debug] execute contextualize
[INFO] Using 'UTF-8' encoding to copy filtered resources.
[INFO] Copying 5 resources
[INFO] --- maven-resources-plugin:2.5:copy-resources (copy standard dirs and files to base-bin)
@ RegularExpressionAnnotator ---
[INFO] skip non existing resourceDirectory <https://builds.apache.org/job/UIMA%20Addons/ws/RegularExpressionAnnotator/src/main/readme>
mojoSucceeded org.apache.maven.plugins:maven-resources-plugin:2.5(copy standard dirs and files
to base-bin)
mojoStarted org.apache.maven.plugins:maven-resources-plugin:2.5(copy desc so its contents
can be found in Jar)
[INFO] 
[debug] execute contextualize
[INFO] Using 'UTF-8' encoding to copy filtered resources.
[INFO] Copying 1 resource
[INFO] --- maven-resources-plugin:2.5:copy-resources (copy desc so its contents can be found
in Jar) @ RegularExpressionAnnotator ---
mojoSucceeded org.apache.maven.plugins:maven-resources-plugin:2.5(copy desc so its contents
can be found in Jar)
mojoStarted org.apache.maven.plugins:maven-compiler-plugin:2.3.2(default-compile)
[INFO] 
[INFO] --- maven-compiler-plugin:2.3.2:compile (default-compile) @ RegularExpressionAnnotator
---
[INFO] Compiling 29 source files to <https://builds.apache.org/job/UIMA%20Addons/ws/RegularExpressionAnnotator/target/classes>
mojoSucceeded org.apache.maven.plugins:maven-compiler-plugin:2.3.2(default-compile)
mojoStarted org.apache.maven.plugins:maven-resources-plugin:2.5(default-testResources)
[INFO] 
[debug] execute contextualize
[INFO] Using 'UTF-8' encoding to copy filtered resources.
[INFO] --- maven-resources-plugin:2.5:testResources (default-testResources) @ RegularExpressionAnnotator
---
[INFO] Copying 80 resources
[INFO] Copying 3 resources
mojoSucceeded org.apache.maven.plugins:maven-resources-plugin:2.5(default-testResources)
mojoStarted org.apache.maven.plugins:maven-compiler-plugin:2.3.2(default-testCompile)
[INFO] 
[INFO] Compiling 15 source files to <https://builds.apache.org/job/UIMA%20Addons/ws/RegularExpressionAnnotator/target/test-classes>
[INFO] --- maven-compiler-plugin:2.3.2:testCompile (default-testCompile) @ RegularExpressionAnnotator
---
mojoSucceeded org.apache.maven.plugins:maven-compiler-plugin:2.3.2(default-testCompile)
mojoStarted org.apache.maven.plugins:maven-surefire-plugin:2.9(default-test)
[INFO] 
[INFO] Surefire report directory: <https://builds.apache.org/job/UIMA%20Addons/ws/RegularExpressionAnnotator/target/surefire-reports>

-------------------------------------------------------
 T E S T S
-------------------------------------------------------
[INFO] --- maven-surefire-plugin:2.9:test (default-test) @ RegularExpressionAnnotator ---
Running org.apache.uima.annotator.regex.TestValidator
Tests run: 0, Failures: 0, Errors: 0, Skipped: 0, Time elapsed: 0.001 sec
Running org.apache.uima.annotator.regex.TestConceptFileSyntax
Jan 17, 2013 11:03:01 PM RegExAnnotator initialize
WARNING: "Duplicate concept name "simpleName" found."
Jan 17, 2013 11:03:01 PM RegExAnnotator initialize
WARNING: "Duplicate rule id "ID1" found for concept "simpleName"."
Tests run: 10, Failures: 0, Errors: 0, Skipped: 0, Time elapsed: 1.219 sec
Running org.apache.uima.annotator.regex.TestConceptFileLocking
Reading in concept file
Starting test runs
Tests run: 1, Failures: 0, Errors: 0, Skipped: 0, Time elapsed: 1.123 sec
Running org.apache.uima.annotator.regex.RegexAnnotatorPerfTest
Build timed out (after 30 minutes). Marking the build as failed.

Results :

Tests run: 11, Failures: 0, Errors: 0, Skipped: 0

mojoFailed org.apache.maven.plugins:maven-surefire-plugin:2.9(default-test)
projectFailed org.apache.uima:RegularExpressionAnnotator:2.3.2-SNAPSHOT
sessionEnded
[INFO] ------------------------------------------------------------------------
[INFO] Reactor Summary:
[INFO] 
[INFO] Apache UIMA-AddOns: uima-addons-parent ............ SUCCESS [2:51.526s]
[INFO] Apache UIMA Annotator: AlchemyAPIAnnotator ........ SUCCESS [4:16.375s]
[INFO] Apache UIMA Annotator: BSFAnnotator ............... SUCCESS [1:09.013s]
[INFO] Apache UIMA Annotator: ConceptMapper .............. SUCCESS [1:05.537s]
[INFO] Apache UIMA Annotator: ConfigurableFeatureExtractor  SUCCESS [1:40.757s]
[INFO] Apache UIMA Annotator: DictionaryAnnotator ........ SUCCESS [1:29.530s]
[INFO] Apache UIMA Addon: FsVariables .................... SUCCESS [1:25.588s]
[INFO] Apache UIMA Annotator: Lucas ...................... SUCCESS [1:16.937s]
[INFO] Apache UIMA Annotator: OpenCalaisAnnotator ........ SUCCESS [51.773s]
[INFO] Apache UIMA Addon: PearPackagingAntTask ........... SUCCESS [52.853s]
[INFO] Apache UIMA Annotator: RegularExpressionAnnotator . FAILURE [53.481s]
[INFO] Apache UIMA Addon: SimpleServer ................... SKIPPED
[INFO] Apache UIMA Annotator: SnowballAnnotator .......... SKIPPED
[INFO] Apache UIMA Annotator: Solrcas .................... SKIPPED
[INFO] Apache UIMA Annotator: Tagger ..................... SKIPPED
[INFO] Apache UIMA Annotator: TikaAnnotator .............. SKIPPED
[INFO] Apache UIMA Annotator: WhitespaceTokenizer ........ SKIPPED
[INFO] Apache UIMA Aggregate: uima-addons ................ SKIPPED
[INFO] ------------------------------------------------------------------------
[INFO] BUILD FAILURE
[INFO] ------------------------------------------------------------------------
[INFO] Total time: 18:36.776s
[INFO] Finished at: Thu Jan 17 23:03:32 GMT+00:00 2013
Sending e-mails to: dev@uima.apache.org
[INFO] Final Memory: 46M/151M
[INFO] ------------------------------------------------------------------------
Projects to build: [MavenProject: org.apache.uima:uima-addons-parent:2.3.2-SNAPSHOT @ <https://builds.apache.org/job/UIMA%20Addons/ws/uima-addons-parent/pom.xml,>
MavenProject: org.apache.uima:AlchemyAPIAnnotator:2.3.2-SNAPSHOT @ <https://builds.apache.org/job/UIMA%20Addons/ws/AlchemyAPIAnnotator/pom.xml,>
MavenProject: org.apache.uima:BSFAnnotator:2.3.2-SNAPSHOT @ <https://builds.apache.org/job/UIMA%20Addons/ws/BSFAnnotator/pom.xml,>
MavenProject: org.apache.uima:ConceptMapper:2.3.2-SNAPSHOT @ <https://builds.apache.org/job/UIMA%20Addons/ws/ConceptMapper/pom.xml,>
MavenProject: org.apache.uima:ConfigurableFeatureExtractor:2.3.2-SNAPSHOT @ <https://builds.apache.org/job/UIMA%20Addons/ws/ConfigurableFeatureExtractor/pom.xml,>
MavenProject: org.apache.uima:DictionaryAnnotator:2.3.2-SNAPSHOT @ <https://builds.apache.org/job/UIMA%20Addons/ws/DictionaryAnnotator/pom.xml,>
MavenProject: org.apache.uima:FsVariables:2.3.2-SNAPSHOT @ <https://builds.apache.org/job/UIMA%20Addons/ws/FsVariables/pom.xml,>
MavenProject: org.apache.uima:Lucas:2.3.2-SNAPSHOT @ <https://builds.apache.org/job/UIMA%20Addons/ws/Lucas/pom.xml,>
MavenProject: org.apache.uima:OpenCalaisAnnotator:2.3.2-SNAPSHOT @ <https://builds.apache.org/job/UIMA%20Addons/ws/OpenCalaisAnnotator/pom.xml,>
MavenProject: org.apache.uima:PearPackagingAntTask:2.3.2-SNAPSHOT @ <https://builds.apache.org/job/UIMA%20Addons/ws/PearPackagingAntTask/pom.xml,>
MavenProject: org.apache.uima:RegularExpressionAnnotator:2.3.2-SNAPSHOT @ <https://builds.apache.org/job/UIMA%20Addons/ws/RegularExpressionAnnotator/pom.xml,>
MavenProject: org.apache.uima:SimpleServer:2.3.2-SNAPSHOT @ <https://builds.apache.org/job/UIMA%20Addons/ws/SimpleServer/pom.xml,>
MavenProject: org.apache.uima:SnowballAnnotator:2.3.2-SNAPSHOT @ <https://builds.apache.org/job/UIMA%20Addons/ws/SnowballAnnotator/pom.xml,>
MavenProject: org.apache.uima:Solrcas:2.3.2-SNAPSHOT @ <https://builds.apache.org/job/UIMA%20Addons/ws/Solrcas/pom.xml,>
MavenProject: org.apache.uima:Tagger:2.3.2-SNAPSHOT @ <https://builds.apache.org/job/UIMA%20Addons/ws/Tagger/pom.xml,>
MavenProject: org.apache.uima:TikaAnnotator:2.3.2-SNAPSHOT @ <https://builds.apache.org/job/UIMA%20Addons/ws/TikaAnnotator/pom.xml,>
MavenProject: org.apache.uima:WhitespaceTokenizer:2.3.2-SNAPSHOT @ <https://builds.apache.org/job/UIMA%20Addons/ws/WhitespaceTokenizer/pom.xml,>
MavenProject: org.apache.uima:uima-addons:2.3.2-SNAPSHOT @ <https://builds.apache.org/job/UIMA%20Addons/ws/pom.xml]>
mavenExecutionResult exceptions not empty
message : Internal error: java.lang.IllegalStateException: Unable to call isArchivingDisabled.
Invalid object ID 18
cause : Unable to call isArchivingDisabled. Invalid object ID 18
Stack trace : 
org.apache.maven.InternalErrorException: Internal error: java.lang.IllegalStateException:
Unable to call isArchivingDisabled. Invalid object ID 18
	at org.apache.maven.DefaultMaven.execute(DefaultMaven.java:168)
	at org.jvnet.hudson.maven3.launcher.Maven3Launcher.main(Maven3Launcher.java:79)
	at sun.reflect.NativeMethodAccessorImpl.invoke0(Native Method)
	at sun.reflect.NativeMethodAccessorImpl.invoke(NativeMethodAccessorImpl.java:39)
	at sun.reflect.DelegatingMethodAccessorImpl.invoke(DelegatingMethodAccessorImpl.java:25)
	at java.lang.reflect.Method.invoke(Method.java:592)
	at org.codehaus.plexus.classworlds.launcher.Launcher.launchStandard(Launcher.java:329)
	at org.codehaus.plexus.classworlds.launcher.Launcher.launch(Launcher.java:239)
	at org.jvnet.hudson.maven3.agent.Maven3Main.launch(Maven3Main.java:158)
	at hudson.maven.Maven3Builder.call(Maven3Builder.java:100)
	at hudson.maven.Maven3Builder.call(Maven3Builder.java:66)
	at hudson.remoting.UserRequest.perform(UserRequest.java:118)
	at hudson.remoting.UserRequest.perform(UserRequest.java:48)
	at hudson.remoting.Request$2.run(Request.java:326)
	at hudson.remoting.InterceptingExecutorService$1.call(InterceptingExecutorService.java:72)
	at java.util.concurrent.FutureTask$Sync.innerRun(FutureTask.java:269)
	at java.util.concurrent.FutureTask.run(FutureTask.java:123)
	at java.util.concurrent.ThreadPoolExecutor$Worker.runTask(ThreadPoolExecutor.java:651)
	at java.util.concurrent.ThreadPoolExecutor$Worker.run(ThreadPoolExecutor.java:676)
	at java.lang.Thread.run(Thread.java:595)
Caused by: java.lang.IllegalStateException: Unable to call isArchivingDisabled. Invalid object
ID 18
	at hudson.remoting.RemoteInvocationHandler$RPCRequest.perform(RemoteInvocationHandler.java:269)
	at hudson.remoting.RemoteInvocationHandler$RPCRequest.call(RemoteInvocationHandler.java:256)
	at hudson.remoting.RemoteInvocationHandler$RPCRequest.call(RemoteInvocationHandler.java:215)
	at hudson.remoting.UserRequest.perform(UserRequest.java:118)
	at hudson.remoting.UserRequest.perform(UserRequest.java:48)
	at hudson.remoting.Request$2.run(Request.java:326)
	at hudson.remoting.InterceptingExecutorService$1.call(InterceptingExecutorService.java:72)Sending
e-mails to: dev@uima.apache.org

	at java.util.concurrent.FutureTask$Sync.innerRun(FutureTask.java:334)
	at java.util.concurrent.FutureTask.run(FutureTask.java:166)
	at java.util.concurrent.ThreadPoolExecutor.runWorker(ThreadPoolExecutor.java:1110)
	at java.util.concurrent.ThreadPoolExecutor$Worker.run(ThreadPoolExecutor.java:603)
	at java.lang.Thread.run(Thread.java:722)
channel stopped

Mime
View raw message