uima-dev mailing list archives

Site index · List index
Message view « Date » · « Thread »
Top « Date » · « Thread »
From Apache Jenkins Server <jenk...@builds.apache.org>
Subject Build failed in Jenkins: UIMA-uimaFIT Java 5 #1
Date Thu, 10 Jan 2013 19:31:50 GMT
See <https://builds.apache.org/job/UIMA-uimaFIT%20Java%205/1/>

------------------------------------------
[...truncated 615 lines...]
Downloading: http://repo1.maven.org/maven2/org/sonatype/gossip/gossip/1.0/gossip-1.0.pom
Downloaded: http://repo1.maven.org/maven2/org/sonatype/gossip/gossip/1.0/gossip-1.0.pom (0
B at 0.0 KB/sec)
Downloading: http://repo1.maven.org/maven2/org/codehaus/gmaven/gmaven-plugin/1.3/gmaven-plugin-1.3.pom
Downloaded: http://repo1.maven.org/maven2/org/codehaus/gmaven/gmaven-plugin/1.3/gmaven-plugin-1.3.pom
(11 KB at 37.5 KB/sec)
Downloading: http://repo1.maven.org/maven2/org/codehaus/gmaven/runtime/gmaven-runtime-loader/1.3/gmaven-runtime-loader-1.3.pom
Downloaded: http://repo1.maven.org/maven2/org/codehaus/gmaven/runtime/gmaven-runtime-loader/1.3/gmaven-runtime-loader-1.3.pom
(3 KB at 7.9 KB/sec)
Downloading: http://repo1.maven.org/maven2/com/google/code/findbugs/findbugs-ant/2.0.0/findbugs-ant-2.0.0.pom
Downloaded: http://repo1.maven.org/maven2/com/google/code/findbugs/findbugs-ant/2.0.0/findbugs-ant-2.0.0.pom
(2 KB at 3.2 KB/sec)
Downloading: http://repo1.maven.org/maven2/com/google/code/findbugs/findbugs/2.0.0/findbugs-2.0.0.pom
Downloaded: http://repo1.maven.org/maven2/com/google/code/findbugs/findbugs/2.0.0/findbugs-2.0.0.pom
(3 KB at 8.2 KB/sec)
Downloading: http://repo1.maven.org/maven2/com/google/code/findbugs/bcel/2.0.0/bcel-2.0.0.pom
Downloaded: http://repo1.maven.org/maven2/com/google/code/findbugs/bcel/2.0.0/bcel-2.0.0.pom
(956 B at 2.3 KB/sec)
Downloading: http://repo1.maven.org/maven2/com/google/code/findbugs/jsr305/2.0.0/jsr305-2.0.0.pom
Downloaded: http://repo1.maven.org/maven2/com/google/code/findbugs/jsr305/2.0.0/jsr305-2.0.0.pom
(965 B at 7.7 KB/sec)
Downloading: http://repo1.maven.org/maven2/com/google/code/findbugs/jFormatString/2.0.0/jFormatString-2.0.0.pom
Downloaded: http://repo1.maven.org/maven2/com/google/code/findbugs/jFormatString/2.0.0/jFormatString-2.0.0.pom
(950 B at 2.9 KB/sec)
Downloading: http://repo1.maven.org/maven2/com/google/code/findbugs/annotations/2.0.0/annotations-2.0.0.pom
Downloaded: http://repo1.maven.org/maven2/com/google/code/findbugs/annotations/2.0.0/annotations-2.0.0.pom
(764 B at 6.9 KB/sec)
Downloading: http://repo1.maven.org/maven2/org/codehaus/gmaven/gmaven-mojo/1.3/gmaven-mojo-1.3.jar
Downloading: http://repo1.maven.org/maven2/org/codehaus/gmaven/runtime/gmaven-runtime-api/1.3/gmaven-runtime-api-1.3.jar
Downloading: http://repo1.maven.org/maven2/org/codehaus/gmaven/feature/gmaven-feature-api/1.3/gmaven-feature-api-1.3.jar
Downloading: http://repo1.maven.org/maven2/org/codehaus/gmaven/runtime/gmaven-runtime-1.5/1.3/gmaven-runtime-1.5-1.3.jar
Downloading: http://repo1.maven.org/maven2/org/codehaus/gmaven/feature/gmaven-feature-support/1.3/gmaven-feature-support-1.3.jar
Downloaded: http://repo1.maven.org/maven2/org/codehaus/gmaven/gmaven-mojo/1.3/gmaven-mojo-1.3.jar
(0 B at 0.0 KB/sec)
Downloading: http://repo1.maven.org/maven2/org/codehaus/gmaven/gmaven-plugin/1.3/gmaven-plugin-1.3.jar
Downloaded: http://repo1.maven.org/maven2/org/codehaus/gmaven/feature/gmaven-feature-support/1.3/gmaven-feature-support-1.3.jar
(0 B at 0.0 KB/sec)
Downloading: http://repo1.maven.org/maven2/org/codehaus/gmaven/runtime/gmaven-runtime-loader/1.3/gmaven-runtime-loader-1.3.jar
Downloaded: http://repo1.maven.org/maven2/org/codehaus/gmaven/feature/gmaven-feature-api/1.3/gmaven-feature-api-1.3.jar
(0 B at 0.0 KB/sec)
Downloading: http://repo1.maven.org/maven2/org/codehaus/gmaven/runtime/gmaven-runtime-support/1.3/gmaven-runtime-support-1.3.jar
Downloaded: http://repo1.maven.org/maven2/org/codehaus/gmaven/runtime/gmaven-runtime-api/1.3/gmaven-runtime-api-1.3.jar
(0 B at 0.0 KB/sec)
Downloading: http://repo1.maven.org/maven2/com/google/code/findbugs/findbugs-ant/2.0.0/findbugs-ant-2.0.0.jar
Downloaded: http://repo1.maven.org/maven2/org/codehaus/gmaven/runtime/gmaven-runtime-support/1.3/gmaven-runtime-support-1.3.jar
(0 B at 0.0 KB/sec)
Downloading: http://repo1.maven.org/maven2/com/google/code/findbugs/findbugs/2.0.0/findbugs-2.0.0.jar
Downloaded: http://repo1.maven.org/maven2/org/codehaus/gmaven/runtime/gmaven-runtime-1.5/1.3/gmaven-runtime-1.5-1.3.jar
(0 B at 0.0 KB/sec)
Downloading: http://repo1.maven.org/maven2/com/google/code/findbugs/bcel/2.0.0/bcel-2.0.0.jar
Downloaded: http://repo1.maven.org/maven2/org/codehaus/gmaven/gmaven-plugin/1.3/gmaven-plugin-1.3.jar
(72 KB at 205.1 KB/sec)
Downloading: http://repo1.maven.org/maven2/com/google/code/findbugs/jsr305/2.0.0/jsr305-2.0.0.jar
Downloaded: http://repo1.maven.org/maven2/com/google/code/findbugs/findbugs-ant/2.0.0/findbugs-ant-2.0.0.jar
(29 KB at 98.1 KB/sec)
Downloading: http://repo1.maven.org/maven2/com/google/code/findbugs/jFormatString/2.0.0/jFormatString-2.0.0.jar
Downloaded: http://repo1.maven.org/maven2/org/codehaus/gmaven/runtime/gmaven-runtime-loader/1.3/gmaven-runtime-loader-1.3.jar
(25 KB at 79.7 KB/sec)
Downloading: http://repo1.maven.org/maven2/com/google/code/findbugs/annotations/2.0.0/annotations-2.0.0.jar
Downloaded: http://repo1.maven.org/maven2/com/google/code/findbugs/bcel/2.0.0/bcel-2.0.0.jar
(571 KB at 1919.5 KB/sec)
Downloaded: http://repo1.maven.org/maven2/com/google/code/findbugs/jFormatString/2.0.0/jFormatString-2.0.0.jar
(27 KB at 246.6 KB/sec)
Downloaded: http://repo1.maven.org/maven2/com/google/code/findbugs/jsr305/2.0.0/jsr305-2.0.0.jar
(32 KB at 137.7 KB/sec)
Downloaded: http://repo1.maven.org/maven2/com/google/code/findbugs/annotations/2.0.0/annotations-2.0.0.jar
(73 KB at 320.1 KB/sec)
Downloaded: http://repo1.maven.org/maven2/com/google/code/findbugs/findbugs/2.0.0/findbugs-2.0.0.jar
(3330 KB at 5691.4 KB/sec)
mojoSucceeded org.codehaus.mojo:findbugs-maven-plugin:2.4.0(default)
[FINDBUGS] No report found for mojo findbugs
mojoStarted org.apache.maven.plugins:maven-pmd-plugin:2.7.1(default)
[INFO] 
[INFO] --- maven-pmd-plugin:2.7.1:cpd (default) @ uimafit-parent ---
mojoSucceeded org.apache.maven.plugins:maven-pmd-plugin:2.7.1(default)
[DRY] No report found for mojo cpd
mojoStarted org.apache.maven.plugins:maven-pmd-plugin:2.7.1(default)
[INFO] 
[INFO] --- maven-pmd-plugin:2.7.1:pmd (default) @ uimafit-parent ---
mojoSucceeded org.apache.maven.plugins:maven-pmd-plugin:2.7.1(default)
[PMD] No report found for mojo pmd
mojoStarted org.apache.maven.plugins:maven-install-plugin:2.3.1(default-install)
[INFO] 
[INFO] --- maven-install-plugin:2.3.1:install (default-install) @ uimafit-parent ---
[INFO] Installing <https://builds.apache.org/job/UIMA-uimaFIT%20Java%205/ws/UIMA-2562\pom.xml>
to f:\hudson\hudson-slave\maven-repositories\1\org\apache\uima\uimafit-parent\2.0.0-SNAPSHOT\uimafit-parent-2.0.0-SNAPSHOT.pom
[INFO] Installing <https://builds.apache.org/job/UIMA-uimaFIT%20Java%205/ws/UIMA-2562\target\uimafit-parent-2.0.0-SNAPSHOT-tests.jar>
to f:\hudson\hudson-slave\maven-repositories\1\org\apache\uima\uimafit-parent\2.0.0-SNAPSHOT\uimafit-parent-2.0.0-SNAPSHOT-tests.jar
mojoSucceeded org.apache.maven.plugins:maven-install-plugin:2.3.1(default-install)
forkedProjectStarted org.apache.uima:uimafit-parent:2.0.0-SNAPSHOT
mojoStarted org.codehaus.mojo:build-helper-maven-plugin:1.7(parse-project-version)
[INFO] 
[INFO] --- build-helper-maven-plugin:1.7:parse-version (parse-project-version) @ uimafit-parent
---
mojoSucceeded org.codehaus.mojo:build-helper-maven-plugin:1.7(parse-project-version)
mojoStarted org.apache.uima:uima-build-helper-maven-plugin:4(set buildYear and buildMonth)
[INFO] 
[INFO] --- uima-build-helper-maven-plugin:4:parse-date-time (set buildYear and buildMonth)
@ uimafit-parent ---
mojoSucceeded org.apache.uima:uima-build-helper-maven-plugin:4(set buildYear and buildMonth)
mojoStarted org.apache.maven.plugins:maven-remote-resources-plugin:1.2.1(default)
[INFO] 
[INFO] --- maven-remote-resources-plugin:1.2.1:process (default) @ uimafit-parent ---
mojoSucceeded org.apache.maven.plugins:maven-remote-resources-plugin:1.2.1(default)
forkedProjectSucceeded org.apache.uima:uimafit-parent:2.0.0-SNAPSHOT
Jan 10, 2013 7:31:40 PM hudson.maven.ExecutedMojo <init>
WARNING: Failed to getClass for org.apache.maven.plugin.dependency.AnalyzeMojo
mojoStarted org.apache.maven.plugins:maven-dependency-plugin:2.3(default-cli)
[INFO] 
[INFO] --- maven-dependency-plugin:2.3:analyze (default-cli) @ uimafit-parent ---
[INFO] Skipping pom project
mojoSucceeded org.apache.maven.plugins:maven-dependency-plugin:2.3(default-cli)
forkedProjectStarted org.apache.uima:uimafit-parent:2.0.0-SNAPSHOT
mojoStarted org.codehaus.mojo:build-helper-maven-plugin:1.7(parse-project-version)
[INFO] 
[INFO] --- build-helper-maven-plugin:1.7:parse-version (parse-project-version) @ uimafit-parent
---
mojoSucceeded org.codehaus.mojo:build-helper-maven-plugin:1.7(parse-project-version)
mojoStarted org.apache.uima:uima-build-helper-maven-plugin:4(set buildYear and buildMonth)
[INFO] 
[INFO] --- uima-build-helper-maven-plugin:4:parse-date-time (set buildYear and buildMonth)
@ uimafit-parent ---
mojoSucceeded org.apache.uima:uima-build-helper-maven-plugin:4(set buildYear and buildMonth)
mojoStarted org.apache.maven.plugins:maven-remote-resources-plugin:1.2.1(default)
[INFO] 
[INFO] --- maven-remote-resources-plugin:1.2.1:process (default) @ uimafit-parent ---
mojoSucceeded org.apache.maven.plugins:maven-remote-resources-plugin:1.2.1(default)
mojoStarted org.codehaus.mojo:cobertura-maven-plugin:2.5.1(default-cli)
[INFO] 
[INFO] --- cobertura-maven-plugin:2.5.1:instrument (default-cli) @ uimafit-parent ---
[INFO] Skipping cobertura mojo for project with packaging type 'pom'
mojoSucceeded org.codehaus.mojo:cobertura-maven-plugin:2.5.1(default-cli)
forkedProjectSucceeded org.apache.uima:uimafit-parent:2.0.0-SNAPSHOT
mojoStarted org.codehaus.mojo:cobertura-maven-plugin:2.5.1(default-cli)
[INFO] 
[INFO] --- cobertura-maven-plugin:2.5.1:cobertura (default-cli) @ uimafit-parent ---
mojoSucceeded org.codehaus.mojo:cobertura-maven-plugin:2.5.1(default-cli)
projectSucceeded org.apache.uima:uimafit-parent:2.0.0-SNAPSHOT
projectStarted org.apache.uima:uimafit:2.0.0-SNAPSHOT
[INFO]                                                                         
[INFO] ------------------------------------------------------------------------
[INFO] Building uimaFIT 2.0.0-SNAPSHOT
[INFO] ------------------------------------------------------------------------
mojoStarted org.apache.maven.plugins:maven-clean-plugin:2.4.1(default-clean)
[INFO] 
[INFO] --- maven-clean-plugin:2.4.1:clean (default-clean) @ uimafit ---
mojoSucceeded org.apache.maven.plugins:maven-clean-plugin:2.4.1(default-clean)
[TASKS] Scanning folder 'F:\hudson\hudson-slave\workspace\UIMA-uimaFIT Java 5\UIMA-2562\uimafit'
for files matching the pattern '**/*.java' - excludes: 
[TASKS] Found 136 files to scan for tasks
Found 5 open tasks.
mojoStarted org.codehaus.mojo:build-helper-maven-plugin:1.7(parse-project-version)
[INFO] 
[INFO] --- build-helper-maven-plugin:1.7:parse-version (parse-project-version) @ uimafit ---
mojoSucceeded org.codehaus.mojo:build-helper-maven-plugin:1.7(parse-project-version)
mojoStarted org.apache.uima:uima-build-helper-maven-plugin:4(set buildYear and buildMonth)
[INFO] 
[INFO] --- uima-build-helper-maven-plugin:4:parse-date-time (set buildYear and buildMonth)
@ uimafit ---
mojoSucceeded org.apache.uima:uima-build-helper-maven-plugin:4(set buildYear and buildMonth)
mojoStarted org.apache.maven.plugins:maven-remote-resources-plugin:1.2.1(default)
[INFO] 
[INFO] --- maven-remote-resources-plugin:1.2.1:process (default) @ uimafit ---
mojoSucceeded org.apache.maven.plugins:maven-remote-resources-plugin:1.2.1(default)
mojoStarted org.apache.maven.plugins:maven-resources-plugin:2.5(default-resources)
[INFO] 
[INFO] --- maven-resources-plugin:2.5:resources (default-resources) @ uimafit ---
[debug] execute contextualize
[INFO] Using 'UTF-8' encoding to copy filtered resources.
[INFO] Copying 1 resource
[INFO] Copying 3 resources
mojoSucceeded org.apache.maven.plugins:maven-resources-plugin:2.5(default-resources)
mojoStarted org.apache.maven.plugins:maven-compiler-plugin:2.3.2(default-compile)
[INFO] 
[INFO] --- maven-compiler-plugin:2.3.2:compile (default-compile) @ uimafit ---
[INFO] Compiling 75 source files to F:\hudson\hudson-slave\workspace\UIMA-uimaFIT Java 5\UIMA-2562\uimafit\target\classes
[INFO] -------------------------------------------------------------
[ERROR] COMPILATION ERROR : 
[INFO] -------------------------------------------------------------
[ERROR] \hudson\hudson-slave\workspace\UIMA-uimaFIT Java 5\UIMA-2562\uimafit\src\main\java\org\apache\uima\fit\component\xwriter\CASDumpWriter.java:[33,-1]
cannot access org.apache.commons.io.IOUtils
bad class file: f:\hudson\hudson-slave\maven-repositories\1\commons-io\commons-io\2.4\commons-io-2.4.jar(org/apache/commons/io/IOUtils.class)
class file has wrong version 50.0, should be 49.0
[INFO] 1 error
[INFO] -------------------------------------------------------------
mojoFailed org.apache.maven.plugins:maven-compiler-plugin:2.3.2(default-compile)
projectFailed org.apache.uima:uimafit:2.0.0-SNAPSHOT
projectSkipped org.apache.uima:uimafit-parent:2.0.0-SNAPSHOT
[INFO]                                                                         
[INFO] ------------------------------------------------------------------------
[INFO] Skipping uimaFIT Parent
[INFO] This project has been banned from the build due to previous failures.
[INFO] ------------------------------------------------------------------------
sessionEnded
[INFO] ------------------------------------------------------------------------
[INFO] Reactor Summary:
[INFO] 
[INFO] uimaFIT Parent .................................... SUCCESS [21.269s]
[INFO] uimaFIT ........................................... FAILURE [5.167s]
[INFO] uimaFIT Examples .................................. SKIPPED
[INFO] uimaFIT - Spring integration ...................... SKIPPED
[INFO] uimaFIT Maven Plugin .............................. SKIPPED
[INFO] ------------------------------------------------------------------------
[INFO] BUILD FAILURE
[INFO] ------------------------------------------------------------------------
[INFO] Total time: 31.491s
[INFO] Finished at: Thu Jan 10 19:31:46 GMT 2013
[INFO] Final Memory: 39M/99M
[INFO] ------------------------------------------------------------------------
Projects to build: [MavenProject: org.apache.uima:uimafit-parent:2.0.0-SNAPSHOT @ <https://builds.apache.org/job/UIMA-uimaFIT%20Java%205/ws/UIMA-2562\pom.xml,>
MavenProject: org.apache.uima:uimafit:2.0.0-SNAPSHOT @ F:\hudson\hudson-slave\workspace\UIMA-uimaFIT
Java 5\UIMA-2562\uimafit\pom.xml, MavenProject: org.apache.uima:uimafit-examples:2.0.0-SNAPSHOT
@ F:\hudson\hudson-slave\workspace\UIMA-uimaFIT Java 5\UIMA-2562\uimafit-examples\pom.xml,
MavenProject: org.apache.uima:uimafit-spring:2.0.0-SNAPSHOT @ F:\hudson\hudson-slave\workspace\UIMA-uimaFIT
Java 5\UIMA-2562\uimafit-spring\pom.xml, MavenProject: org.apache.uima:uimafit-maven-plugin:2.0.0-SNAPSHOT
@ F:\hudson\hudson-slave\workspace\UIMA-uimaFIT Java 5\UIMA-2562\uimafit-maven-plugin\pom.xml]
[JENKINS] Archiving F:\hudson\hudson-slave\workspace\UIMA-uimaFIT Java 5\UIMA-2562\uimafit\pom.xml
to /home/hudson/hudson/jobs/UIMA-uimaFIT Java 5/modules/org.apache.uima$uimafit/builds/2013-01-10_19-30-59/archive/org.apache.uima/uimafit/2.0.0-SNAPSHOT/uimafit-2.0.0-SNAPSHOT.pom
[JENKINS] Archiving F:\hudson\hudson-slave\workspace\UIMA-uimaFIT Java 5\UIMA-2562\uimafit-maven-plugin\pom.xml
to /home/hudson/hudson/jobs/UIMA-uimaFIT Java 5/modules/org.apache.uima$uimafit-maven-plugin/builds/2013-01-10_19-30-59/archive/org.apache.uima/uimafit-maven-plugin/2.0.0-SNAPSHOT/uimafit-maven-plugin-2.0.0-SNAPSHOT.pom
[JENKINS] Archiving F:\hudson\hudson-slave\workspace\UIMA-uimaFIT Java 5\UIMA-2562\uimafit-spring\pom.xml
to /home/hudson/hudson/jobs/UIMA-uimaFIT Java 5/modules/org.apache.uima$uimafit-spring/builds/2013-01-10_19-30-59/archive/org.apache.uima/uimafit-spring/2.0.0-SNAPSHOT/uimafit-spring-2.0.0-SNAPSHOT.pom
[JENKINS] Archiving F:\hudson\hudson-slave\workspace\UIMA-uimaFIT Java 5\UIMA-2562\uimafit-examples\pom.xml
to /home/hudson/hudson/jobs/UIMA-uimaFIT Java 5/modules/org.apache.uima$uimafit-examples/builds/2013-01-10_19-30-59/archive/org.apache.uima/uimafit-examples/2.0.0-SNAPSHOT/uimafit-examples-2.0.0-SNAPSHOT.pom
[JENKINS] Archiving <https://builds.apache.org/job/UIMA-uimaFIT%20Java%205/ws/UIMA-2562\pom.xml>
to /home/hudson/hudson/jobs/UIMA-uimaFIT Java 5/modules/org.apache.uima$uimafit-parent/builds/2013-01-10_19-30-59/archive/org.apache.uima/uimafit-parent/2.0.0-SNAPSHOT/uimafit-parent-2.0.0-SNAPSHOT.pom
[JENKINS] Archiving <https://builds.apache.org/job/UIMA-uimaFIT%20Java%205/ws/UIMA-2562\target\uimafit-parent-2.0.0-SNAPSHOT-tests.jar>
to /home/hudson/hudson/jobs/UIMA-uimaFIT Java 5/modules/org.apache.uima$uimafit-parent/builds/2013-01-10_19-30-59/archive/org.apache.uima/uimafit-parent/2.0.0-SNAPSHOT/uimafit-parent-2.0.0-SNAPSHOT-tests.jar
[WARNING] The requested profile "javancss" could not be activated because it does not exist.
[WARNING] The requested profile "cobertura-aggregate" could not be activated because it does
not exist.
[WARNING] The requested profile "attach-source" could not be activated because it does not
exist.
[WARNING] The requested profile "attach-javadoc" could not be activated because it does not
exist.
[WARNING] The requested profile "attach-test" could not be activated because it does not exist.
Waiting for Jenkins to finish collecting data
mavenExecutionResult exceptions not empty
message : Failed to execute goal org.apache.maven.plugins:maven-compiler-plugin:2.3.2:compile
(default-compile) on project uimafit: Compilation failure
\hudson\hudson-slave\workspace\UIMA-uimaFIT Java 5\UIMA-2562\uimafit\src\main\java\org\apache\uima\fit\component\xwriter\CASDumpWriter.java:[33,-1]
cannot access org.apache.commons.io.IOUtils
bad class file: f:\hudson\hudson-slave\maven-repositories\1\commons-io\commons-io\2.4\commons-io-2.4.jar(org/apache/commons/io/IOUtils.class)
class file has wrong version 50.0, should be 49.0

cause : Compilation failure
\hudson\hudson-slave\workspace\UIMA-uimaFIT Java 5\UIMA-2562\uimafit\src\main\java\org\apache\uima\fit\component\xwriter\CASDumpWriter.java:[33,-1]
cannot access org.apache.commons.io.IOUtils
bad class file: f:\hudson\hudson-slave\maven-repositories\1\commons-io\commons-io\2.4\commons-io-2.4.jar(org/apache/commons/io/IOUtils.class)
class file has wrong version 50.0, should be 49.0

Stack trace : 
org.apache.maven.lifecycle.LifecycleExecutionException: Failed to execute goal org.apache.maven.plugins:maven-compiler-plugin:2.3.2:compile
(default-compile) on project uimafit: Compilation failure
\hudson\hudson-slave\workspace\UIMA-uimaFIT Java 5\UIMA-2562\uimafit\src\main\java\org\apache\uima\fit\component\xwriter\CASDumpWriter.java:[33,-1]
cannot access org.apache.commons.io.IOUtils
bad class file: f:\hudson\hudson-slave\maven-repositories\1\commons-io\commons-io\2.4\commons-io-2.4.jar(org/apache/commons/io/IOUtils.class)
class file has wrong version 50.0, should be 49.0

	at org.apache.maven.lifecycle.internal.MojoExecutor.execute(MojoExecutor.java:213)
	at org.apache.maven.lifecycle.internal.MojoExecutor.execute(MojoExecutor.java:153)
	at org.apache.maven.lifecycle.internal.MojoExecutor.execute(MojoExecutor.java:145)
	at org.apache.maven.lifecycle.internal.LifecycleModuleBuilder.buildProject(LifecycleModuleBuilder.java:84)
	at org.apache.maven.lifecycle.internal.LifecycleModuleBuilder.buildProject(LifecycleModuleBuilder.java:59)
	at org.apache.maven.lifecycle.internal.LifecycleStarter.singleThreadedBuild(LifecycleStarter.java:183)
	at org.apache.maven.lifecycle.internal.LifecycleStarter.execute(LifecycleStarter.java:161)
	at org.apache.maven.DefaultMaven.doExecute(DefaultMaven.java:319)
	at org.apache.maven.DefaultMaven.execute(DefaultMaven.java:156)
	at org.jvnet.hudson.maven3.launcher.Maven3Launcher.main(Maven3Launcher.java:79)
	at sun.reflect.NativeMethodAccessorImpl.invoke0(Native Method)
	at sun.reflect.NativeMethodAccessorImpl.invoke(NativeMethodAccessorImpl.java:39)
	at sun.reflect.DelegatingMethodAccessorImpl.invoke(DelegatingMethodAccessorImpl.java:25)
	at java.lang.reflect.Method.invoke(Method.java:592)
	at org.codehaus.plexus.classworlds.launcher.Launcher.launchStandard(Launcher.java:329)
	at org.codehaus.plexus.classworlds.launcher.Launcher.launch(Launcher.java:239)
	at org.jvnet.hudson.maven3.agent.Maven3Main.launch(Maven3Main.java:158)
	at hudson.maven.Maven3Builder.call(Maven3Builder.java:100)
	at hudson.maven.Maven3Builder.call(Maven3Builder.java:66)
	at hudson.remoting.UserRequest.perform(UserRequest.java:118)
	at hudson.remoting.UserRequest.perform(UserRequest.java:48)
	at hudson.remoting.Request$2.run(Request.java:326)
	at hudson.remoting.InterceptingExecutorService$1.call(InterceptingExecutorService.java:72)
	at java.util.concurrent.FutureTask$Sync.innerRun(FutureTask.java:269)
	at java.util.concurrent.FutureTask.run(FutureTask.java:123)
	at java.util.concurrent.ThreadPoolExecutor$Worker.runTask(ThreadPoolExecutor.java:651)
	at java.util.concurrent.ThreadPoolExecutor$Worker.run(ThreadPoolExecutor.java:676)
	at java.lang.Thread.run(Thread.java:595)
Caused by: org.apache.maven.plugin.CompilationFailureException: Compilation failure
\hudson\hudson-slave\workspace\UIMA-uimaFIT Java 5\UIMA-2562\uimafit\src\main\java\org\apache\uima\fit\component\xwriter\CASDumpWriter.java:[33,-1]
cannot access org.apache.commons.io.IOUtils
bad class file: f:\hudson\hudson-slave\maven-repositories\1\commons-io\commons-io\2.4\commons-io-2.4.jar(org/apache/commons/io/IOUtils.class)
class file has wrong version 50.0, should be 49.0

	at org.apache.maven.plugin.AbstractCompilerMojo.execute(AbstractCompilerMojo.java:656)
	at org.apache.maven.plugin.CompilerMojo.execute(CompilerMojo.java:128)
	at org.apache.maven.plugin.DefaultBuildPluginManager.executeMojo(DefaultBuildPluginManager.java:107)
	at org.apache.maven.lifecycle.internal.MojoExecutor.execute(MojoExecutor.java:209)
	... 27 more
Sending e-mails to: dev@uima.apache.org
channel stopped
[WARNINGS] Skipping publisher since build result is FAILURE
Skipping Cobertura coverage report as build was not UNSTABLE or better ...

Mime
View raw message