uima-dev mailing list archives

Site index · List index
Message view « Date » · « Thread »
Top « Date » · « Thread »
From Apache Jenkins Server <jenk...@builds.apache.org>
Subject Build failed in Jenkins: UIMA-TextMarker #34
Date Mon, 21 Jan 2013 18:46:10 GMT
See <https://builds.apache.org/job/UIMA-TextMarker/34/changes>

Changes:

[pkluegl] [maven-release-plugin] prepare release uimaj-textmarker-parent-2.0.0

[pkluegl] [maven-release-plugin] rollback the release of uimaj-textmarker-parent-2.0.0

[pkluegl] [maven-release-plugin] prepare release uimaj-textmarker-parent-2.0.0

[pkluegl] no jira
- added copied feature.xml to svn:ignore

[pkluegl] no jira
- mentioning composed string expression in documentation
- some xml refactoring

------------------------------------------
[...truncated 23605 lines...]
[INFO] --- uima-build-helper-maven-plugin:2:parse-date-time (set buildYear and buildMonth)
@ uimaj-textmarker-eclipse-feature ---
mojoSucceeded org.apache.uima:uima-build-helper-maven-plugin:2(set buildYear and buildMonth)
mojoStarted org.apache.maven.plugins:maven-remote-resources-plugin:1.2.1(default)
[INFO] 
[INFO] --- maven-remote-resources-plugin:1.2.1:process (default) @ uimaj-textmarker-eclipse-feature
---
mojoSucceeded org.apache.maven.plugins:maven-remote-resources-plugin:1.2.1(default)
mojoStarted org.apache.maven.plugins:maven-resources-plugin:2.5(filter feature.xml)[debug]
execute contextualize

[INFO] 
[INFO] --- maven-resources-plugin:2.5:copy-resources (filter feature.xml) @ uimaj-textmarker-eclipse-feature
---
[INFO] Using 'UTF-8' encoding to copy filtered resources.
[INFO] Copying 1 resource
mojoSucceeded org.apache.maven.plugins:maven-resources-plugin:2.5(filter feature.xml)
mojoStarted org.apache.maven.plugins:maven-resources-plugin:2.5(default-resources)[debug]
execute contextualize
[INFO] Using 'UTF-8' encoding to copy filtered resources.

[INFO] Copying 2 resources
[INFO] 
[INFO] --- maven-resources-plugin:2.5:resources (default-resources) @ uimaj-textmarker-eclipse-feature
---
[INFO] Copying 3 resources
mojoSucceeded org.apache.maven.plugins:maven-resources-plugin:2.5(default-resources)
mojoStarted org.apache.maven.plugins:maven-compiler-plugin:2.3.2(default-compile)
[INFO] 
[INFO] --- maven-compiler-plugin:2.3.2:compile (default-compile) @ uimaj-textmarker-eclipse-feature
---[INFO] No sources to compile

mojoSucceeded org.apache.maven.plugins:maven-compiler-plugin:2.3.2(default-compile)
[debug] execute contextualize
mojoStarted org.apache.maven.plugins:maven-resources-plugin:2.5(default-testResources)[INFO]
Using 'UTF-8' encoding to copy filtered resources.
[INFO] skip non existing resourceDirectory F:\hudson\hudson-slave\workspace\UIMA-TextMarker\trunk\uimaj-textmarker-eclipse-feature\src\test\resources

[INFO] 
[INFO] --- maven-resources-plugin:2.5:testResources (default-testResources) @ uimaj-textmarker-eclipse-feature
---
[INFO] Copying 3 resources
mojoSucceeded org.apache.maven.plugins:maven-resources-plugin:2.5(default-testResources)
mojoStarted org.apache.maven.plugins:maven-compiler-plugin:2.3.2(default-testCompile)
[INFO] 
[INFO] [INFO] No sources to compile
--- maven-compiler-plugin:2.3.2:testCompile (default-testCompile) @ uimaj-textmarker-eclipse-feature
---
mojoSucceeded org.apache.maven.plugins:maven-compiler-plugin:2.3.2(default-testCompile)
mojoStarted org.apache.maven.plugins:maven-surefire-plugin:2.9(default-test)
[INFO] 
[INFO] --- maven-surefire-plugin:2.9:test (default-test) @ uimaj-textmarker-eclipse-feature
---
[INFO] Surefire report directory: F:\hudson\hudson-slave\workspace\UIMA-TextMarker\trunk\uimaj-textmarker-eclipse-feature\target\surefire-reports

-------------------------------------------------------
 T E S T S
-------------------------------------------------------

Results :

Tests run: 0, Failures: 0, Errors: 0, Skipped: 0

mojoSucceeded org.apache.maven.plugins:maven-surefire-plugin:2.9(default-test)
[JENKINS] Recording test results
mojoStarted org.apache.maven.plugins:maven-jar-plugin:2.3.1(default-jar)
[INFO] 
[INFO] --- maven-jar-plugin:2.3.1:jar (default-jar) @ uimaj-textmarker-eclipse-feature ---
[INFO] Building jar: F:\hudson\hudson-slave\workspace\UIMA-TextMarker\trunk\uimaj-textmarker-eclipse-feature\target\uimaj-textmarker-eclipse-feature_2.0.0.jar
mojoSucceeded org.apache.maven.plugins:maven-jar-plugin:2.3.1(default-jar)
mojoStarted org.apache.maven.plugins:maven-site-plugin:3.0(attach-descriptor)
[INFO] 
[INFO] --- maven-site-plugin:3.0:attach-descriptor (attach-descriptor) @ uimaj-textmarker-eclipse-feature
---
mojoSucceeded org.apache.maven.plugins:maven-site-plugin:3.0(attach-descriptor)
mojoStarted org.apache.maven.plugins:maven-install-plugin:2.3.1(default-install)
[INFO] Installing F:\hudson\hudson-slave\workspace\UIMA-TextMarker\trunk\uimaj-textmarker-eclipse-feature\target\uimaj-textmarker-eclipse-feature_2.0.0.jar
to f:\hudson\hudson-slave\maven-repositories\0\org\apache\uima\uimaj-textmarker-eclipse-feature\2.0.0\uimaj-textmarker-eclipse-feature-2.0.0.jar
[INFO] 
[INFO] --- maven-install-plugin:2.3.1:install (default-install) @ uimaj-textmarker-eclipse-feature
---
[INFO] Installing F:\hudson\hudson-slave\workspace\UIMA-TextMarker\trunk\uimaj-textmarker-eclipse-feature\pom.xml
to f:\hudson\hudson-slave\maven-repositories\0\org\apache\uima\uimaj-textmarker-eclipse-feature\2.0.0\uimaj-textmarker-eclipse-feature-2.0.0.pom
mojoSucceeded org.apache.maven.plugins:maven-install-plugin:2.3.1(default-install)
mojoStarted org.apache.maven.plugins:maven-pmd-plugin:2.7.1(default-cli)
[INFO] 
[INFO] --- maven-pmd-plugin:2.7.1:pmd (default-cli) @ uimaj-textmarker-eclipse-feature ---
[WARNING] Unable to locate Source XRef to link to - DISABLED
mojoSucceeded org.apache.maven.plugins:maven-pmd-plugin:2.7.1(default-cli)
[PMD] Finding all files that match the pattern pmd.xml
[PMD] Parsing 1 files in F:\hudson\hudson-slave\workspace\UIMA-TextMarker\trunk\uimaj-textmarker-eclipse-feature\target
[PMD] Successfully parsed file F:\hudson\hudson-slave\workspace\UIMA-TextMarker\trunk\uimaj-textmarker-eclipse-feature\target\pmd.xml
of module Apache UIMA TextMarker Eclipse: uimaj-textmarker-eclipse-feature with 0 warnings.
[PMD] Computing warning deltas based on reference build #33
mojoStarted org.apache.maven.plugins:maven-pmd-plugin:2.7.1(default-cli)
[INFO] 
[WARNING] Unable to locate Source XRef to link to - DISABLED
[INFO] --- maven-pmd-plugin:2.7.1:cpd (default-cli) @ uimaj-textmarker-eclipse-feature ---
mojoSucceeded org.apache.maven.plugins:maven-pmd-plugin:2.7.1(default-cli)
[DRY] Finding all files that match the pattern cpd.xml
[DRY] Parsing 1 files in F:\hudson\hudson-slave\workspace\UIMA-TextMarker\trunk\uimaj-textmarker-eclipse-feature\target
[DRY] Successfully parsed file F:\hudson\hudson-slave\workspace\UIMA-TextMarker\trunk\uimaj-textmarker-eclipse-feature\target\cpd.xml
of module Apache UIMA TextMarker Eclipse: uimaj-textmarker-eclipse-feature with 0 warnings.
[DRY] Computing warning deltas based on reference build #33
mojoStarted org.codehaus.mojo:findbugs-maven-plugin:2.5.2(default-cli)
[INFO] 
[INFO] --- findbugs-maven-plugin:2.5.2:findbugs (default-cli) @ uimaj-textmarker-eclipse-feature
---
mojoSucceeded org.codehaus.mojo:findbugs-maven-plugin:2.5.2(default-cli)
[FINDBUGS] No report found for mojo findbugs
forkedProjectStarted org.apache.uima:uimaj-textmarker-eclipse-feature:2.0.0
mojoStarted org.codehaus.mojo:build-helper-maven-plugin:1.5(parse-project-version)
[INFO] 
[INFO] --- build-helper-maven-plugin:1.5:parse-version (parse-project-version) @ uimaj-textmarker-eclipse-feature
---
mojoSucceeded org.codehaus.mojo:build-helper-maven-plugin:1.5(parse-project-version)
mojoStarted org.apache.uima:uima-build-helper-maven-plugin:2(set buildYear and buildMonth)
[INFO] 
[INFO] --- uima-build-helper-maven-plugin:2:parse-date-time (set buildYear and buildMonth)
@ uimaj-textmarker-eclipse-feature ---
mojoSucceeded org.apache.uima:uima-build-helper-maven-plugin:2(set buildYear and buildMonth)
mojoStarted org.apache.maven.plugins:maven-remote-resources-plugin:1.2.1(default)
[INFO] 
[INFO] --- maven-remote-resources-plugin:1.2.1:process (default) @ uimaj-textmarker-eclipse-feature
---
mojoSucceeded org.apache.maven.plugins:maven-remote-resources-plugin:1.2.1(default)
mojoStarted org.apache.maven.plugins:maven-resources-plugin:2.5(filter feature.xml)[debug]
execute contextualize
[INFO] Using 'UTF-8' encoding to copy filtered resources.

[INFO] Copying 1 resource
[INFO] 
[INFO] --- maven-resources-plugin:2.5:copy-resources (filter feature.xml) @ uimaj-textmarker-eclipse-feature
---
mojoSucceeded org.apache.maven.plugins:maven-resources-plugin:2.5(filter feature.xml)
mojoStarted org.apache.maven.plugins:maven-resources-plugin:2.5(default-resources)[debug]
execute contextualize

[INFO] 
[INFO] Using 'UTF-8' encoding to copy filtered resources.
[INFO] [INFO] Copying 2 resources
--- maven-resources-plugin:2.5:resources (default-resources) @ uimaj-textmarker-eclipse-feature
---
[INFO] Copying 3 resources
[INFO] Copying 3 resources
mojoSucceeded org.apache.maven.plugins:maven-resources-plugin:2.5(default-resources)
mojoStarted org.apache.maven.plugins:maven-compiler-plugin:2.3.2(default-compile)
[INFO] 
[INFO] No sources to compile
[INFO] --- maven-compiler-plugin:2.3.2:compile (default-compile) @ uimaj-textmarker-eclipse-feature
---
mojoSucceeded org.apache.maven.plugins:maven-compiler-plugin:2.3.2(default-compile)
mojoStarted org.codehaus.mojo:cobertura-maven-plugin:2.5.2(default-cli)
[INFO] 
[INFO] --- cobertura-maven-plugin:2.5.2:instrument (default-cli) @ uimaj-textmarker-eclipse-feature
---
[WARNING] No files to instrument.
[INFO] NOT adding cobertura ser file to attached artifacts list.
mojoSucceeded org.codehaus.mojo:cobertura-maven-plugin:2.5.2(default-cli)
mojoStarted org.apache.maven.plugins:maven-resources-plugin:2.5(default-testResources)[debug]
execute contextualize

[INFO] 
[INFO] Using 'UTF-8' encoding to copy filtered resources.
[INFO] [INFO] skip non existing resourceDirectory F:\hudson\hudson-slave\workspace\UIMA-TextMarker\trunk\uimaj-textmarker-eclipse-feature\src\test\resources
[INFO] Copying 3 resources
--- maven-resources-plugin:2.5:testResources (default-testResources) @ uimaj-textmarker-eclipse-feature
---
[INFO] Copying 3 resources
mojoSucceeded org.apache.maven.plugins:maven-resources-plugin:2.5(default-testResources)
mojoStarted org.apache.maven.plugins:maven-compiler-plugin:2.3.2(default-testCompile)
[INFO] 
[INFO] [INFO] No sources to compile
--- maven-compiler-plugin:2.3.2:testCompile (default-testCompile) @ uimaj-textmarker-eclipse-feature
---
mojoSucceeded org.apache.maven.plugins:maven-compiler-plugin:2.3.2(default-testCompile)
mojoStarted org.apache.maven.plugins:maven-surefire-plugin:2.9(default-test)
[INFO] 
[INFO] --- maven-surefire-plugin:2.9:test (default-test) @ uimaj-textmarker-eclipse-feature
---
[INFO] Surefire report directory: F:\hudson\hudson-slave\workspace\UIMA-TextMarker\trunk\uimaj-textmarker-eclipse-feature\target\surefire-reports

-------------------------------------------------------
 T E S T S
-------------------------------------------------------

Results :

Tests run: 0, Failures: 0, Errors: 0, Skipped: 0

mojoSucceeded org.apache.maven.plugins:maven-surefire-plugin:2.9(default-test)
[JENKINS] Recording test results
forkedProjectSucceeded org.apache.uima:uimaj-textmarker-eclipse-feature:2.0.0
mojoStarted org.codehaus.mojo:cobertura-maven-plugin:2.5.2(default-cli)
[INFO] 
[INFO] --- cobertura-maven-plugin:2.5.2:cobertura (default-cli) @ uimaj-textmarker-eclipse-feature
---
mojoSucceeded org.codehaus.mojo:cobertura-maven-plugin:2.5.2(default-cli)
projectSucceeded org.apache.uima:uimaj-textmarker-eclipse-feature:2.0.0
sessionEnded
[INFO] ------------------------------------------------------------------------
[INFO] Reactor Summary:
[INFO] 
[INFO] Apache UIMA TextMarker: uimaj-textmarker-parent ... SUCCESS [28.985s]
[INFO] Apache UIMA TextMarker: uimaj-textmarker .......... SUCCESS [4:04.318s]
[INFO] Apache UIMA TextMarker Eclipse: uimaj-ep-textmarker-engine  SUCCESS [3:47.748s]
[INFO] Apache UIMA TextMarker Eclipse: uimaj-ep-textmarker-ide  SUCCESS [3:17.352s]
[INFO] Apache UIMA TextMarker Eclipse: uimaj-ep-textmarker-caseditor  SUCCESS [24.392s]
[INFO] Apache UIMA TextMarker Eclipse: uimaj-ep-textmarker-addons  SUCCESS [59.115s]
[INFO] Apache UIMA TextMarker Eclipse: uimaj-ep-textmarker-textruler  SUCCESS [1:04.918s]
[INFO] Apache UIMA TextMarker Documentation .............. SUCCESS [27.990s]
[INFO] Apache UIMA TextMarker Eclipse: uimaj-textmarker-eclipse-feature  SUCCESS [2.694s]
[INFO] ------------------------------------------------------------------------
[INFO] BUILD SUCCESS
[INFO] ------------------------------------------------------------------------
[INFO] Total time: 15:22.089s
[INFO] Finished at: Mon Jan 21 18:45:52 GMT 2013
[INFO] Final Memory: 122M/368M
[INFO] ------------------------------------------------------------------------
Projects to build: [MavenProject: org.apache.uima:uimaj-textmarker-parent:2.0.0 @ <https://builds.apache.org/job/UIMA-TextMarker/ws/trunk\pom.xml,>
MavenProject: org.apache.uima:uimaj-textmarker:2.0.0 @ F:\hudson\hudson-slave\workspace\UIMA-TextMarker\trunk\uimaj-textmarker\pom.xml,
MavenProject: org.apache.uima:uimaj-ep-textmarker-engine:2.0.0 @ F:\hudson\hudson-slave\workspace\UIMA-TextMarker\trunk\uimaj-ep-textmarker-engine\pom.xml,
MavenProject: org.apache.uima:uimaj-ep-textmarker-ide:2.0.0 @ F:\hudson\hudson-slave\workspace\UIMA-TextMarker\trunk\uimaj-ep-textmarker-ide\pom.xml,
MavenProject: org.apache.uima:uimaj-ep-textmarker-caseditor:2.0.0 @ F:\hudson\hudson-slave\workspace\UIMA-TextMarker\trunk\uimaj-ep-textmarker-caseditor\pom.xml,
MavenProject: org.apache.uima:uimaj-ep-textmarker-addons:2.0.0 @ F:\hudson\hudson-slave\workspace\UIMA-TextMarker\trunk\uimaj-ep-textmarker-addons\pom.xml,
MavenProject: org.apache.uima:uimaj-ep-textmarker-textruler:2.0.0 @ F:\hudson\hudson-slave\workspace\UIMA-TextMarker\trunk\uimaj-ep-textmarker-textruler\pom.xml,
MavenProject: org.apache.uima:uima-docbook-textmarker:2.0.0 @ F:\hudson\hudson-slave\workspace\UIMA-TextMarker\trunk\uima-docbook-textmarker\pom.xml,
MavenProject: org.apache.uima:uimaj-textmarker-eclipse-feature:2.0.0 @ F:\hudson\hudson-slave\workspace\UIMA-TextMarker\trunk\uimaj-textmarker-eclipse-feature\pom.xml]
[JENKINS] Archiving <https://builds.apache.org/job/UIMA-TextMarker/ws/trunk\pom.xml>
to /home/hudson/hudson/jobs/UIMA-TextMarker/modules/org.apache.uima$uimaj-textmarker-parent/builds/2013-01-21_18-28-41/archive/org.apache.uima/uimaj-textmarker-parent/2.0.0/uimaj-textmarker-parent-2.0.0.pom
[JENKINS] Archiving F:\hudson\hudson-slave\workspace\UIMA-TextMarker\trunk\uimaj-textmarker-eclipse-feature\pom.xml
to /home/hudson/hudson/jobs/UIMA-TextMarker/modules/org.apache.uima$uimaj-textmarker-eclipse-feature/builds/2013-01-21_18-28-41/archive/org.apache.uima/uimaj-textmarker-eclipse-feature/2.0.0/uimaj-textmarker-eclipse-feature-2.0.0.pom
[JENKINS] Archiving F:\hudson\hudson-slave\workspace\UIMA-TextMarker\trunk\uimaj-textmarker-eclipse-feature\target\uimaj-textmarker-eclipse-feature_2.0.0.jar
to /home/hudson/hudson/jobs/UIMA-TextMarker/modules/org.apache.uima$uimaj-textmarker-eclipse-feature/builds/2013-01-21_18-28-41/archive/org.apache.uima/uimaj-textmarker-eclipse-feature/2.0.0/uimaj-textmarker-eclipse-feature-2.0.0.jar
[JENKINS] Archiving F:\hudson\hudson-slave\workspace\UIMA-TextMarker\trunk\uimaj-ep-textmarker-ide\pom.xml
to /home/hudson/hudson/jobs/UIMA-TextMarker/modules/org.apache.uima$uimaj-ep-textmarker-ide/builds/2013-01-21_18-28-41/archive/org.apache.uima/uimaj-ep-textmarker-ide/2.0.0/uimaj-ep-textmarker-ide-2.0.0.pom
[JENKINS] Archiving F:\hudson\hudson-slave\workspace\UIMA-TextMarker\trunk\uimaj-ep-textmarker-ide\target\org.apache.uima.textmarker.ide_2.0.0.jar
to /home/hudson/hudson/jobs/UIMA-TextMarker/modules/org.apache.uima$uimaj-ep-textmarker-ide/builds/2013-01-21_18-28-41/archive/org.apache.uima/uimaj-ep-textmarker-ide/2.0.0/uimaj-ep-textmarker-ide-2.0.0.jar
[JENKINS] Archiving F:\hudson\hudson-slave\workspace\UIMA-TextMarker\trunk\uimaj-ep-textmarker-addons\pom.xml
to /home/hudson/hudson/jobs/UIMA-TextMarker/modules/org.apache.uima$uimaj-ep-textmarker-addons/builds/2013-01-21_18-28-41/archive/org.apache.uima/uimaj-ep-textmarker-addons/2.0.0/uimaj-ep-textmarker-addons-2.0.0.pom
[JENKINS] Archiving F:\hudson\hudson-slave\workspace\UIMA-TextMarker\trunk\uimaj-ep-textmarker-addons\target\org.apache.uima.textmarker.addons_2.0.0.jar
to /home/hudson/hudson/jobs/UIMA-TextMarker/modules/org.apache.uima$uimaj-ep-textmarker-addons/builds/2013-01-21_18-28-41/archive/org.apache.uima/uimaj-ep-textmarker-addons/2.0.0/uimaj-ep-textmarker-addons-2.0.0.jar
[JENKINS] Archiving F:\hudson\hudson-slave\workspace\UIMA-TextMarker\trunk\uimaj-ep-textmarker-textruler\pom.xml
to /home/hudson/hudson/jobs/UIMA-TextMarker/modules/org.apache.uima$uimaj-ep-textmarker-textruler/builds/2013-01-21_18-28-41/archive/org.apache.uima/uimaj-ep-textmarker-textruler/2.0.0/uimaj-ep-textmarker-textruler-2.0.0.pom
[JENKINS] Archiving F:\hudson\hudson-slave\workspace\UIMA-TextMarker\trunk\uimaj-ep-textmarker-textruler\target\org.apache.uima.textmarker.textruler_2.0.0.jar
to /home/hudson/hudson/jobs/UIMA-TextMarker/modules/org.apache.uima$uimaj-ep-textmarker-textruler/builds/2013-01-21_18-28-41/archive/org.apache.uima/uimaj-ep-textmarker-textruler/2.0.0/uimaj-ep-textmarker-textruler-2.0.0.jar
[JENKINS] Archiving F:\hudson\hudson-slave\workspace\UIMA-TextMarker\trunk\uimaj-ep-textmarker-engine\pom.xml
to /home/hudson/hudson/jobs/UIMA-TextMarker/modules/org.apache.uima$uimaj-ep-textmarker-engine/builds/2013-01-21_18-28-41/archive/org.apache.uima/uimaj-ep-textmarker-engine/2.0.0/uimaj-ep-textmarker-engine-2.0.0.pom
[JENKINS] Archiving F:\hudson\hudson-slave\workspace\UIMA-TextMarker\trunk\uimaj-ep-textmarker-engine\target\org.apache.uima.textmarker.engine_2.0.0.jar
to /home/hudson/hudson/jobs/UIMA-TextMarker/modules/org.apache.uima$uimaj-ep-textmarker-engine/builds/2013-01-21_18-28-41/archive/org.apache.uima/uimaj-ep-textmarker-engine/2.0.0/uimaj-ep-textmarker-engine-2.0.0.jar
[JENKINS] Archiving F:\hudson\hudson-slave\workspace\UIMA-TextMarker\trunk\uimaj-ep-textmarker-caseditor\pom.xml
to /home/hudson/hudson/jobs/UIMA-TextMarker/modules/org.apache.uima$uimaj-ep-textmarker-caseditor/builds/2013-01-21_18-28-41/archive/org.apache.uima/uimaj-ep-textmarker-caseditor/2.0.0/uimaj-ep-textmarker-caseditor-2.0.0.pom
[JENKINS] Archiving F:\hudson\hudson-slave\workspace\UIMA-TextMarker\trunk\uimaj-ep-textmarker-caseditor\target\org.apache.uima.textmarker.caseditor_2.0.0.jar
to /home/hudson/hudson/jobs/UIMA-TextMarker/modules/org.apache.uima$uimaj-ep-textmarker-caseditor/builds/2013-01-21_18-28-41/archive/org.apache.uima/uimaj-ep-textmarker-caseditor/2.0.0/uimaj-ep-textmarker-caseditor-2.0.0.jar
[JENKINS] Archiving F:\hudson\hudson-slave\workspace\UIMA-TextMarker\trunk\uima-docbook-textmarker\pom.xml
to /home/hudson/hudson/jobs/UIMA-TextMarker/modules/org.apache.uima$uima-docbook-textmarker/builds/2013-01-21_18-28-41/archive/org.apache.uima/uima-docbook-textmarker/2.0.0/uima-docbook-textmarker-2.0.0.pom
[JENKINS] Archiving F:\hudson\hudson-slave\workspace\UIMA-TextMarker\trunk\uimaj-textmarker\pom.xml
to /home/hudson/hudson/jobs/UIMA-TextMarker/modules/org.apache.uima$uimaj-textmarker/builds/2013-01-21_18-28-41/archive/org.apache.uima/uimaj-textmarker/2.0.0/uimaj-textmarker-2.0.0.pom
[JENKINS] Archiving F:\hudson\hudson-slave\workspace\UIMA-TextMarker\trunk\uimaj-textmarker\target\uima-textmarker.jar
to /home/hudson/hudson/jobs/UIMA-TextMarker/modules/org.apache.uima$uimaj-textmarker/builds/2013-01-21_18-28-41/archive/org.apache.uima/uimaj-textmarker/2.0.0/uimaj-textmarker-2.0.0.jar
Waiting for Jenkins to finish collecting data
channel stopped
[WARNINGS] Parsing warnings in console log with parser Java Compiler (javac)
[WARNINGS] Parsing warnings in console log with parser JavaDoc Tool
Maven RedeployPublisher use remote windows1 maven settings from : C:\Users\hudson/.m2/settings.xml
[INFO] Deployment in https://repository.apache.org/content/repositories/snapshots (id=apache.snapshots.https,uniqueVersion=true)
Deploying the main artifact uima-docbook-textmarker-2.0.0.pom
Uploading: https://repository.apache.org/content/repositories/snapshots/org/apache/uima/uima-docbook-textmarker/2.0.0/uima-docbook-textmarker-2.0.0.pom
ERROR: Failed to deploy artifacts: Could not transfer artifact org.apache.uima:uima-docbook-textmarker:pom:2.0.0
from/to apache.snapshots.https (https://repository.apache.org/content/repositories/snapshots):
Failed to transfer file: https://repository.apache.org/content/repositories/snapshots/org/apache/uima/uima-docbook-textmarker/2.0.0/uima-docbook-textmarker-2.0.0.pom.
Return code is: 400, ReasonPhrase:Bad Request.
org.apache.maven.artifact.deployer.ArtifactDeploymentException: Failed to deploy artifacts:
Could not transfer artifact org.apache.uima:uima-docbook-textmarker:pom:2.0.0 from/to apache.snapshots.https
(https://repository.apache.org/content/repositories/snapshots): Failed to transfer file: https://repository.apache.org/content/repositories/snapshots/org/apache/uima/uima-docbook-textmarker/2.0.0/uima-docbook-textmarker-2.0.0.pom.
Return code is: 400, ReasonPhrase:Bad Request.
	at org.apache.maven.artifact.deployer.DefaultArtifactDeployer.deploy(DefaultArtifactDeployer.java:141)
	at hudson.maven.reporters.MavenArtifactRecord.deploy(MavenArtifactRecord.java:190)
	at hudson.maven.RedeployPublisher.perform(RedeployPublisher.java:176)
	at hudson.tasks.BuildStepMonitor$1.perform(BuildStepMonitor.java:19)
	at hudson.model.AbstractBuild$AbstractBuildExecution.perform(AbstractBuild.java:810)
	at hudson.model.AbstractBuild$AbstractBuildExecution.performAllBuildSteps(AbstractBuild.java:785)
	at hudson.maven.MavenModuleSetBuild$MavenModuleSetBuildExecution.post2(MavenModuleSetBuild.java:946)
	at hudson.model.AbstractBuild$AbstractBuildExecution.post(AbstractBuild.java:732)
	at hudson.model.Run.execute(Run.java:1568)
	at hudson.maven.MavenModuleSetBuild.run(MavenModuleSetBuild.java:477)
	at hudson.model.ResourceController.execute(ResourceController.java:88)
	at hudson.model.Executor.run(Executor.java:236)
Caused by: org.sonatype.aether.deployment.DeploymentException: Failed to deploy artifacts:
Could not transfer artifact org.apache.uima:uima-docbook-textmarker:pom:2.0.0 from/to apache.snapshots.https
(https://repository.apache.org/content/repositories/snapshots): Failed to transfer file: https://repository.apache.org/content/repositories/snapshots/org/apache/uima/uima-docbook-textmarker/2.0.0/uima-docbook-textmarker-2.0.0.pom.
Return code is: 400, ReasonPhrase:Bad Request.
	at org.sonatype.aether.impl.internal.DefaultDeployer.deploy(DefaultDeployer.java:280)
	at org.sonatype.aether.impl.internal.DefaultDeployer.deploy(DefaultDeployer.java:211)
	at org.sonatype.aether.impl.internal.DefaultRepositorySystem.deploy(DefaultRepositorySystem.java:443)
	at org.apache.maven.artifact.deployer.DefaultArtifactDeployer.deploy(DefaultArtifactDeployer.java:137)
	... 11 more
Caused by: org.sonatype.aether.transfer.ArtifactTransferException: Could not transfer artifact
org.apache.uima:uima-docbook-textmarker:pom:2.0.0 from/to apache.snapshots.https (https://repository.apache.org/content/repositories/snapshots):
Failed to transfer file: https://repository.apache.org/content/repositories/snapshots/org/apache/uima/uima-docbook-textmarker/2.0.0/uima-docbook-textmarker-2.0.0.pom.
Return code is: 400, ReasonPhrase:Bad Request.
	at org.sonatype.aether.connector.wagon.WagonRepositoryConnector$4.wrap(WagonRepositoryConnector.java:951)
	at org.sonatype.aether.connector.wagon.WagonRepositoryConnector$4.wrap(WagonRepositoryConnector.java:941)
	at org.sonatype.aether.connector.wagon.WagonRepositoryConnector$PutTask.run(WagonRepositoryConnector.java:837)
	at org.sonatype.aether.connector.wagon.WagonRepositoryConnector.put(WagonRepositoryConnector.java:467)
	at org.sonatype.aether.impl.internal.DefaultDeployer.deploy(DefaultDeployer.java:274)
	... 14 more
Caused by: org.apache.maven.wagon.TransferFailedException: Failed to transfer file: https://repository.apache.org/content/repositories/snapshots/org/apache/uima/uima-docbook-textmarker/2.0.0/uima-docbook-textmarker-2.0.0.pom.
Return code is: 400, ReasonPhrase:Bad Request.
	at org.apache.maven.wagon.shared.http4.AbstractHttpClientWagon.put(AbstractHttpClientWagon.java:613)
	at org.apache.maven.wagon.shared.http4.AbstractHttpClientWagon.put(AbstractHttpClientWagon.java:509)
	at org.apache.maven.wagon.shared.http4.AbstractHttpClientWagon.put(AbstractHttpClientWagon.java:490)
	at org.apache.maven.wagon.shared.http4.AbstractHttpClientWagon.put(AbstractHttpClientWagon.java:470)
	at org.sonatype.aether.connector.wagon.WagonRepositoryConnector$PutTask.run(WagonRepositoryConnector.java:811)
	... 16 more
[INFO] Deployment failed after 0.4 sec
Build step 'Deploy artifacts to Maven repository' changed build result to FAILURE
Skipping Cobertura coverage report as build was not UNSTABLE or better ...

Mime
View raw message