uima-dev mailing list archives

Site index · List index
Message view « Date » · « Thread »
Top « Date » · « Thread »
From Apache Jenkins Server <jenk...@builds.apache.org>
Subject Build failed in Jenkins: UIMA-uimaFIT » uimaFIT #35
Date Fri, 01 Mar 2013 06:43:56 GMT
See <https://builds.apache.org/job/UIMA-uimaFIT/org.apache.uima$uimafit/35/>

------------------------------------------
[...truncated 277 lines...]
	at org.apache.maven.surefire.junit4.JUnit4Provider.invoke(JUnit4Provider.java:124)
	at sun.reflect.NativeMethodAccessorImpl.invoke0(Native Method)
	at sun.reflect.NativeMethodAccessorImpl.invoke(NativeMethodAccessorImpl.java:39)
	at sun.reflect.DelegatingMethodAccessorImpl.invoke(DelegatingMethodAccessorImpl.java:25)
	at java.lang.reflect.Method.invoke(Method.java:592)
	at org.apache.maven.surefire.util.ReflectionUtils.invokeMethodWithArray2(ReflectionUtils.java:208)
	at org.apache.maven.surefire.booter.ProviderFactory$ProviderProxy.invoke(ProviderFactory.java:158)
	at org.apache.maven.surefire.booter.ProviderFactory.invokeProvider(ProviderFactory.java:86)
	at org.apache.maven.surefire.booter.ForkedBooter.runSuitesInProcess(ForkedBooter.java:153)
	at org.apache.maven.surefire.booter.ForkedBooter.main(ForkedBooter.java:95)
Caused by: org.apache.uima.cas.CASRuntimeException: No sofaFS with name myView found.
	at org.apache.uima.cas.impl.CASImpl.getSofa(CASImpl.java:661)
	at org.apache.uima.cas.impl.CASImpl.getView(CASImpl.java:2658)
	at org.apache.uima.impl.Util.getStartingView(Util.java:46)
	at org.apache.uima.analysis_engine.impl.PrimitiveAnalysisEngine_impl.callAnalysisComponentProcess(PrimitiveAnalysisEngine_impl.java:346)
	... 39 more
Mar 1, 2013 6:42:56 AM org.apache.uima.analysis_engine.impl.AggregateAnalysisEngine_impl processAndOutputNewCASes(275)
SEVERE: Exception occurred
org.apache.uima.analysis_engine.AnalysisEngineProcessException: Annotator processing failed.
   
	at org.apache.uima.analysis_engine.impl.PrimitiveAnalysisEngine_impl.callAnalysisComponentProcess(PrimitiveAnalysisEngine_impl.java:391)
	at org.apache.uima.analysis_engine.impl.PrimitiveAnalysisEngine_impl.processAndOutputNewCASes(PrimitiveAnalysisEngine_impl.java:296)
	at org.apache.uima.analysis_engine.asb.impl.ASB_impl$AggregateCasIterator.processUntilNextOutputCas(ASB_impl.java:567)
	at org.apache.uima.analysis_engine.asb.impl.ASB_impl$AggregateCasIterator.<init>(ASB_impl.java:409)
	at org.apache.uima.analysis_engine.asb.impl.ASB_impl.process(ASB_impl.java:342)
	at org.apache.uima.analysis_engine.impl.AggregateAnalysisEngine_impl.processAndOutputNewCASes(AggregateAnalysisEngine_impl.java:267)
	at org.apache.uima.analysis_engine.impl.AnalysisEngineImplBase.process(AnalysisEngineImplBase.java:267)
	at org.apache.uima.analysis_engine.impl.AnalysisEngineImplBase.process(AnalysisEngineImplBase.java:280)
	at org.apache.uima.fit.component.ViewCreatorAnnotatorTest.testOtherViewUnaware(ViewCreatorAnnotatorTest.java:100)
	at sun.reflect.NativeMethodAccessorImpl.invoke0(Native Method)
	at sun.reflect.NativeMethodAccessorImpl.invoke(NativeMethodAccessorImpl.java:39)
	at sun.reflect.DelegatingMethodAccessorImpl.invoke(DelegatingMethodAccessorImpl.java:25)
	at java.lang.reflect.Method.invoke(Method.java:592)
	at org.junit.runners.model.FrameworkMethod$1.runReflectiveCall(FrameworkMethod.java:45)
	at org.junit.internal.runners.model.ReflectiveCallable.run(ReflectiveCallable.java:15)
	at org.junit.runners.model.FrameworkMethod.invokeExplosively(FrameworkMethod.java:42)
	at org.junit.internal.runners.statements.InvokeMethod.evaluate(InvokeMethod.java:20)
	at org.junit.internal.runners.statements.ExpectException.evaluate(ExpectException.java:22)
	at org.junit.internal.runners.statements.RunBefores.evaluate(RunBefores.java:28)
	at org.junit.runners.ParentRunner.runLeaf(ParentRunner.java:263)
	at org.junit.runners.BlockJUnit4ClassRunner.runChild(BlockJUnit4ClassRunner.java:68)
	at org.junit.runners.BlockJUnit4ClassRunner.runChild(BlockJUnit4ClassRunner.java:47)
	at org.junit.runners.ParentRunner$3.run(ParentRunner.java:231)
	at org.junit.runners.ParentRunner$1.schedule(ParentRunner.java:60)
	at org.junit.runners.ParentRunner.runChildren(ParentRunner.java:229)
	at org.junit.runners.ParentRunner.access$000(ParentRunner.java:50)
	at org.junit.runners.ParentRunner$2.evaluate(ParentRunner.java:222)
	at org.junit.runners.ParentRunner.run(ParentRunner.java:300)
	at org.apache.maven.surefire.junit4.JUnit4Provider.execute(JUnit4Provider.java:264)
	at org.apache.maven.surefire.junit4.JUnit4Provider.executeTestSet(JUnit4Provider.java:153)
	at org.apache.maven.surefire.junit4.JUnit4Provider.invoke(JUnit4Provider.java:124)
	at sun.reflect.NativeMethodAccessorImpl.invoke0(Native Method)
	at sun.reflect.NativeMethodAccessorImpl.invoke(NativeMethodAccessorImpl.java:39)
	at sun.reflect.DelegatingMethodAccessorImpl.invoke(DelegatingMethodAccessorImpl.java:25)
	at java.lang.reflect.Method.invoke(Method.java:592)
	at org.apache.maven.surefire.util.ReflectionUtils.invokeMethodWithArray2(ReflectionUtils.java:208)
	at org.apache.maven.surefire.booter.ProviderFactory$ProviderProxy.invoke(ProviderFactory.java:158)
	at org.apache.maven.surefire.booter.ProviderFactory.invokeProvider(ProviderFactory.java:86)
	at org.apache.maven.surefire.booter.ForkedBooter.runSuitesInProcess(ForkedBooter.java:153)
	at org.apache.maven.surefire.booter.ForkedBooter.main(ForkedBooter.java:95)
Caused by: org.apache.uima.cas.CASRuntimeException: No sofaFS with name myView found.
	at org.apache.uima.cas.impl.CASImpl.getSofa(CASImpl.java:661)
	at org.apache.uima.cas.impl.CASImpl.getView(CASImpl.java:2658)
	at org.apache.uima.impl.Util.getStartingView(Util.java:46)
	at org.apache.uima.analysis_engine.impl.PrimitiveAnalysisEngine_impl.callAnalysisComponentProcess(PrimitiveAnalysisEngine_impl.java:346)
	... 39 more
Tests run: 5, Failures: 0, Errors: 0, Skipped: 0, Time elapsed: 0.067 sec
Running org.apache.uima.fit.component.ViewTextCopierAnnotatorTest
Mar 1, 2013 6:42:56 AM org.apache.uima.analysis_engine.impl.PrimitiveAnalysisEngine_impl callAnalysisComponentProcess(407)
SEVERE: Exception occurred
org.apache.uima.analysis_engine.AnalysisEngineProcessException: Annotator processing failed.
   
	at org.apache.uima.analysis_engine.impl.PrimitiveAnalysisEngine_impl.callAnalysisComponentProcess(PrimitiveAnalysisEngine_impl.java:391)
	at org.apache.uima.analysis_engine.impl.PrimitiveAnalysisEngine_impl.processAndOutputNewCASes(PrimitiveAnalysisEngine_impl.java:296)
	at org.apache.uima.analysis_engine.impl.AnalysisEngineImplBase.process(AnalysisEngineImplBase.java:267)
	at org.apache.uima.analysis_engine.impl.AnalysisEngineImplBase.process(AnalysisEngineImplBase.java:280)
	at org.apache.uima.fit.component.ViewTextCopierAnnotatorTest.testExceptions(ViewTextCopierAnnotatorTest.java:90)
	at sun.reflect.NativeMethodAccessorImpl.invoke0(Native Method)
	at sun.reflect.NativeMethodAccessorImpl.invoke(NativeMethodAccessorImpl.java:39)
	at sun.reflect.DelegatingMethodAccessorImpl.invoke(DelegatingMethodAccessorImpl.java:25)
	at java.lang.reflect.Method.invoke(Method.java:592)
	at org.junit.runners.model.FrameworkMethod$1.runReflectiveCall(FrameworkMethod.java:45)
	at org.junit.internal.runners.model.ReflectiveCallable.run(ReflectiveCallable.java:15)
	at org.junit.runners.model.FrameworkMethod.invokeExplosively(FrameworkMethod.java:42)
	at org.junit.internal.runners.statements.InvokeMethod.evaluate(InvokeMethod.java:20)
	at org.junit.internal.runners.statements.ExpectException.evaluate(ExpectException.java:22)
	at org.junit.internal.runners.statements.RunBefores.evaluate(RunBefores.java:28)
	at org.junit.runners.ParentRunner.runLeaf(ParentRunner.java:263)
	at org.junit.runners.BlockJUnit4ClassRunner.runChild(BlockJUnit4ClassRunner.java:68)
	at org.junit.runners.BlockJUnit4ClassRunner.runChild(BlockJUnit4ClassRunner.java:47)
	at org.junit.runners.ParentRunner$3.run(ParentRunner.java:231)
	at org.junit.runners.ParentRunner$1.schedule(ParentRunner.java:60)
	at org.junit.runners.ParentRunner.runChildren(ParentRunner.java:229)
	at org.junit.runners.ParentRunner.access$000(ParentRunner.java:50)
	at org.junit.runners.ParentRunner$2.evaluate(ParentRunner.java:222)
	at org.junit.runners.ParentRunner.run(ParentRunner.java:300)
	at org.apache.maven.surefire.junit4.JUnit4Provider.execute(JUnit4Provider.java:264)
	at org.apache.maven.surefire.junit4.JUnit4Provider.executeTestSet(JUnit4Provider.java:153)
	at org.apache.maven.surefire.junit4.JUnit4Provider.invoke(JUnit4Provider.java:124)
	at sun.reflect.NativeMethodAccessorImpl.invoke0(Native Method)
	at sun.reflect.NativeMethodAccessorImpl.invoke(NativeMethodAccessorImpl.java:39)
	at sun.reflect.DelegatingMethodAccessorImpl.invoke(DelegatingMethodAccessorImpl.java:25)
	at java.lang.reflect.Method.invoke(Method.java:592)
	at org.apache.maven.surefire.util.ReflectionUtils.invokeMethodWithArray2(ReflectionUtils.java:208)
	at org.apache.maven.surefire.booter.ProviderFactory$ProviderProxy.invoke(ProviderFactory.java:158)
	at org.apache.maven.surefire.booter.ProviderFactory.invokeProvider(ProviderFactory.java:86)
	at org.apache.maven.surefire.booter.ForkedBooter.runSuitesInProcess(ForkedBooter.java:153)
	at org.apache.maven.surefire.booter.ForkedBooter.main(ForkedBooter.java:95)
Caused by: org.apache.uima.cas.CASRuntimeException: No sofaFS with name SourceView found.
	at org.apache.uima.cas.impl.CASImpl.getSofa(CASImpl.java:661)
	at org.apache.uima.cas.impl.CASImpl.getView(CASImpl.java:2658)
	at org.apache.uima.jcas.impl.JCasImpl.getView(JCasImpl.java:1415)
	at org.apache.uima.fit.component.ViewTextCopierAnnotator.process(ViewTextCopierAnnotator.java:58)
	at org.apache.uima.analysis_component.JCasAnnotator_ImplBase.process(JCasAnnotator_ImplBase.java:48)
	at org.apache.uima.analysis_engine.impl.PrimitiveAnalysisEngine_impl.callAnalysisComponentProcess(PrimitiveAnalysisEngine_impl.java:375)
	... 35 more
Tests run: 2, Failures: 0, Errors: 0, Skipped: 0, Time elapsed: 0.009 sec
Running org.apache.uima.fit.descriptor.TypeCapabilityTest
Tests run: 1, Failures: 0, Errors: 0, Skipped: 0, Time elapsed: 0.002 sec
Running org.apache.uima.fit.factory.ExternalResourceConfiguratorTest
Tests run: 2, Failures: 0, Errors: 0, Skipped: 0, Time elapsed: 0.003 sec
Running org.apache.uima.fit.factory.AggregateWithReaderTest
Tests run: 2, Failures: 0, Errors: 0, Skipped: 0, Time elapsed: 0.04 sec
Running org.apache.uima.fit.factory.JCasBuilderTest
Tests run: 1, Failures: 0, Errors: 0, Skipped: 0, Time elapsed: 0.072 sec
Running org.apache.uima.fit.factory.SofaMappingFactoryTest
Tests run: 1, Failures: 0, Errors: 0, Skipped: 0, Time elapsed: 0 sec
Running org.apache.uima.fit.factory.JCasFactoryTest
Tests run: 4, Failures: 0, Errors: 0, Skipped: 0, Time elapsed: 0.082 sec
Running org.apache.uima.fit.factory.ResourceMetaDataFactoryTest
Tests run: 3, Failures: 0, Errors: 0, Skipped: 0, Time elapsed: 0.003 sec
Running org.apache.uima.fit.factory.LoggingTest
Mar 1, 2013 6:42:57 AM org.apache.uima.fit.util.ExtendedLogger info(262)
INFO: Logging: org.apache.uima.fit.factory.LoggingTest$LoggingCasCollectionReader
Mar 1, 2013 6:42:57 AM org.apache.uima.fit.util.ExtendedLogger info(262)
INFO: Logging: org.apache.uima.fit.factory.LoggingTest$LoggingJCasCollectionReader
Mar 1, 2013 6:42:57 AM org.apache.uima.fit.util.ExtendedLogger info(262)
INFO: Logging: org.apache.uima.fit.factory.LoggingTest$LoggingCasAnnotator
Mar 1, 2013 6:42:57 AM org.apache.uima.fit.util.ExtendedLogger info(262)
INFO: Logging: org.apache.uima.fit.factory.LoggingTest$LoggingJCasAnnotator
Mar 1, 2013 6:42:57 AM org.apache.uima.fit.util.ExtendedLogger info(262)
INFO: Logging: org.apache.uima.fit.factory.LoggingTest$LoggingCasConsumer
Mar 1, 2013 6:42:57 AM org.apache.uima.fit.util.ExtendedLogger info(262)
INFO: Logging: org.apache.uima.fit.factory.LoggingTest$LoggingJCasConsumer
Mar 1, 2013 6:42:57 AM org.apache.uima.fit.util.ExtendedLogger info(262)
INFO: Logging: org.apache.uima.fit.factory.LoggingTest$LoggingCasMultiplier
Mar 1, 2013 6:42:57 AM org.apache.uima.fit.util.ExtendedLogger info(262)
INFO: Logging: org.apache.uima.fit.factory.LoggingTest$LoggingJCasMultiplier
Tests run: 2, Failures: 0, Errors: 0, Skipped: 0, Time elapsed: 0.186 sec
Running org.apache.uima.fit.factory.CollectionReaderFactoryExternalResourceTest
Tests run: 1, Failures: 0, Errors: 0, Skipped: 0, Time elapsed: 0.021 sec
Running org.apache.uima.fit.factory.FlowControllerFactoryExternalResourceTest
Tests run: 1, Failures: 0, Errors: 0, Skipped: 0, Time elapsed: 0.023 sec
Running org.apache.uima.fit.factory.testCrs.SingleFileXReaderTest
Tests run: 1, Failures: 0, Errors: 0, Skipped: 0, Time elapsed: 0.069 sec
Running org.apache.uima.fit.factory.TypeSystemDescriptionFactoryTest
Tests run: 2, Failures: 0, Errors: 0, Skipped: 0, Time elapsed: 0.024 sec
Running org.apache.uima.fit.factory.UimaContextFactoryTest
Tests run: 1, Failures: 0, Errors: 0, Skipped: 0, Time elapsed: 0.002 sec
Running org.apache.uima.fit.factory.AggregateBuilderTest
Tests run: 6, Failures: 0, Errors: 0, Skipped: 0, Time elapsed: 0.072 sec
Running org.apache.uima.fit.factory.AnalysisEngineFactoryExternalResourceTest
Tests run: 10, Failures: 0, Errors: 0, Skipped: 0, Time elapsed: 1.587 sec
Running org.apache.uima.fit.factory.FlowControllerFactoryTest
Tests run: 1, Failures: 0, Errors: 0, Skipped: 0, Time elapsed: 0.001 sec
Running org.apache.uima.fit.factory.AnnotationFactoryTest
Tests run: 1, Failures: 0, Errors: 0, Skipped: 0, Time elapsed: 0 sec
Running org.apache.uima.fit.factory.ResourceCreationSpecifierFactoryTest
Tests run: 4, Failures: 0, Errors: 0, Skipped: 0, Time elapsed: 0.007 sec
Running org.apache.uima.fit.factory.CollectionReaderFactoryTest
Tests run: 3, Failures: 0, Errors: 0, Skipped: 0, Time elapsed: 0.068 sec
Running org.apache.uima.fit.factory.ConfigurationParameterFactoryTest
Tests run: 8, Failures: 0, Errors: 0, Skipped: 0, Time elapsed: 0.003 sec
Running org.apache.uima.fit.factory.FsIndexFactoryTest
Tests run: 3, Failures: 0, Errors: 0, Skipped: 0, Time elapsed: 0.032 sec
Running org.apache.uima.fit.factory.AnalysisEngineFactoryTest
Tests run: 15, Failures: 0, Errors: 0, Skipped: 0, Time elapsed: 0.203 sec
Running org.apache.uima.fit.factory.initializable.InitializableFactoryTest
Tests run: 3, Failures: 0, Errors: 0, Skipped: 0, Time elapsed: 0.004 sec
Running org.apache.uima.fit.factory.ExternalResourceFactoryTest
Mar 1, 2013 6:42:59 AM org.springframework.mock.jndi.SimpleNamingContextBuilder bind
INFO: Static JNDI binding: [dictionaries/german] = [{Hans=proper noun}]
Mar 1, 2013 6:42:59 AM org.springframework.mock.jndi.SimpleNamingContextBuilder activate
INFO: Activating simple JNDI environment
Tests run: 4, Failures: 0, Errors: 0, Skipped: 0, Time elapsed: 0.842 sec
Running org.apache.uima.fit.factory.TypePrioritiesFactoryTest
Tests run: 1, Failures: 0, Errors: 0, Skipped: 0, Time elapsed: 0.008 sec
Running org.apache.uima.fit.util.LocaleUtilTest
Tests run: 2, Failures: 0, Errors: 0, Skipped: 0, Time elapsed: 0 sec
Running org.apache.uima.fit.util.DisableLoggingTest
Tests run: 1, Failures: 0, Errors: 0, Skipped: 0, Time elapsed: 0.001 sec
Running org.apache.uima.fit.util.FSCollectionFactoryTest
Tests run: 13, Failures: 0, Errors: 0, Skipped: 0, Time elapsed: 0.21 sec
Running org.apache.uima.fit.util.HideOutputTest
Tests run: 1, Failures: 0, Errors: 0, Skipped: 0, Time elapsed: 0 sec
Running org.apache.uima.fit.util.SimplePipelineTest
Tests run: 1, Failures: 0, Errors: 0, Skipped: 0, Time elapsed: 0.009 sec
Running org.apache.uima.fit.util.JCasUtilTest
Tests run: 25, Failures: 0, Errors: 0, Skipped: 0, Time elapsed: 9.979 sec
Running org.apache.uima.fit.util.JCasIterableTest
Tests run: 1, Failures: 0, Errors: 0, Skipped: 0, Time elapsed: 0.001 sec
Running org.apache.uima.fit.util.ContainmentIndexTest
Tests run: 1, Failures: 0, Errors: 0, Skipped: 0, Time elapsed: 0.003 sec
Running org.apache.uima.fit.util.CasUtilTest
Tests run: 8, Failures: 0, Errors: 0, Skipped: 0, Time elapsed: 0.006 sec
Running org.apache.uima.fit.pipeline.CpePipelineTest
Tests run: 1, Failures: 0, Errors: 0, Skipped: 0, Time elapsed: 0.121 sec
Running org.apache.uima.fit.pipeline.SimplePipelineTest
Tests run: 2, Failures: 0, Errors: 0, Skipped: 0, Time elapsed: 0.056 sec
Running org.apache.uima.fit.testing.factory.TokenBuilderTest
Tests run: 9, Failures: 0, Errors: 0, Skipped: 0, Time elapsed: 0.011 sec

Results :

Tests run: 169, Failures: 0, Errors: 0, Skipped: 0

[JENKINS] Recording test results
[INFO] 
[INFO] --- build-helper-maven-plugin:1.7:parse-version (parse-project-version) @ uimafit ---
[INFO] 
[INFO] --- uima-build-helper-maven-plugin:4:parse-date-time (set buildYear and buildMonth)
@ uimafit ---
[INFO] 
[INFO] --- gmaven-plugin:1.4:execute (read-notice) @ uimafit ---
Mar 1, 2013 6:43:17 AM hudson.maven.ExecutedMojo <init>
WARNING: Failed to getClass for org.apache.maven.plugin.javadoc.JavadocReport
[INFO] 
[INFO] --- maven-javadoc-plugin:2.9:javadoc (javadocs-distr) @ uimafit ---
[INFO] 
9 warnings
[WARNING] Javadoc Warnings
[WARNING] <https://builds.apache.org/job/UIMA-uimaFIT/org.apache.uima$uimafit/ws/src/main/java/org/apache/uima/fit/component/xwriter/CASDumpWriter.java>:86:
warning - Tag @link: can't find toString() in org.apache.uima.cas.FeatureStructure
[WARNING] <https://builds.apache.org/job/UIMA-uimaFIT/org.apache.uima$uimafit/ws/src/main/java/org/apache/uima/fit/descriptor/SofaCapability.java>:52:
warning - @SofaCapability(inputSofas is an unknown tag.
[WARNING] <https://builds.apache.org/job/UIMA-uimaFIT/org.apache.uima$uimafit/ws/src/main/java/org/apache/uima/fit/descriptor/SofaCapability.java>:52:
warning - @SofaCapability(inputSofas is an unknown tag.
[WARNING] <https://builds.apache.org/job/UIMA-uimaFIT/org.apache.uima$uimafit/ws/src/main/java/org/apache/uima/fit/descriptor/TypeCapability.java>:43:
warning - @TypeCapability(inputs="org.apache.uima.fit.type.Token", is an unknown tag.
[WARNING] <https://builds.apache.org/job/UIMA-uimaFIT/org.apache.uima$uimafit/ws/src/main/java/org/apache/uima/fit/descriptor/TypeCapability.java>:43:
warning - @TypeCapability(inputs={"org.apache.uima.fit.type.Token","org.apache.uima.fit.type.Sentence"},
is an unknown tag.
[WARNING] <https://builds.apache.org/job/UIMA-uimaFIT/org.apache.uima$uimafit/ws/src/main/java/org/apache/uima/fit/factory/FsIndexFactory.java>:201:
warning - Tag @link: can't find FS_INDEX_IMPORT_PATTERN in org.apache.uima.fit.factory.FsIndexFactory
[WARNING] <https://builds.apache.org/job/UIMA-uimaFIT/org.apache.uima$uimafit/ws/src/main/java/org/apache/uima/fit/factory/TypeSystemDescriptionFactory.java>:124:
warning - Tag @link: can't find TYPE_IMPORT_PATTERN in org.apache.uima.fit.factory.TypeSystemDescriptionFactory
[WARNING] <https://builds.apache.org/job/UIMA-uimaFIT/org.apache.uima$uimafit/ws/src/main/java/org/apache/uima/fit/util/MetaDataUtil.java>:55:
warning - @param argument "manifestPatterns" is not a parameter name.
[WARNING] <https://builds.apache.org/job/UIMA-uimaFIT/org.apache.uima$uimafit/ws/src/main/java/org/apache/uima/fit/util/MetaDataUtil.java>:55:
warning - @param argument "importProperty" is not a parameter name.
[JENKINS] Archiving  javadoc
Successfully loaded native POSIX impl.
[INFO] 
[INFO] --- maven-jar-plugin:2.4:jar (default-jar) @ uimafit ---
[INFO] Building jar: <https://builds.apache.org/job/UIMA-uimaFIT/org.apache.uima$uimafit/ws/target/uimafit-2.0.0-SNAPSHOT.jar>
[INFO] 
[INFO] --- maven-site-plugin:3.2:attach-descriptor (attach-descriptor) @ uimafit ---
[INFO] 
[INFO] --- findbugs-maven-plugin:2.5.2:findbugs (default) @ uimafit ---
[INFO] Fork Value is true
     [java] Warnings generated: 19
[INFO] Done FindBugs Analysis....

Mime
View raw message