uima-dev mailing list archives

Site index · List index
Message view « Date » · « Thread »
Top « Date » · « Thread »
From Apache Jenkins Server <jenk...@builds.apache.org>
Subject Build failed in Jenkins: UIMA-uimaFIT #35
Date Fri, 01 Mar 2013 06:43:57 GMT
See <https://builds.apache.org/job/UIMA-uimaFIT/35/>

------------------------------------------
[...truncated 1109 lines...]
	at org.apache.uima.jcas.impl.JCasImpl.getView(JCasImpl.java:1415)
	at org.apache.uima.fit.component.ViewTextCopierAnnotator.process(ViewTextCopierAnnotator.java:58)
	at org.apache.uima.analysis_component.JCasAnnotator_ImplBase.process(JCasAnnotator_ImplBase.java:48)
	at org.apache.uima.analysis_engine.impl.PrimitiveAnalysisEngine_impl.callAnalysisComponentProcess(PrimitiveAnalysisEngine_impl.java:375)
	... 35 more
Tests run: 2, Failures: 0, Errors: 0, Skipped: 0, Time elapsed: 0.009 sec
Running org.apache.uima.fit.descriptor.TypeCapabilityTest
Tests run: 1, Failures: 0, Errors: 0, Skipped: 0, Time elapsed: 0.002 sec
Running org.apache.uima.fit.factory.ExternalResourceConfiguratorTest
Tests run: 2, Failures: 0, Errors: 0, Skipped: 0, Time elapsed: 0.003 sec
Running org.apache.uima.fit.factory.AggregateWithReaderTest
Tests run: 2, Failures: 0, Errors: 0, Skipped: 0, Time elapsed: 0.04 sec
Running org.apache.uima.fit.factory.JCasBuilderTest
Tests run: 1, Failures: 0, Errors: 0, Skipped: 0, Time elapsed: 0.072 sec
Running org.apache.uima.fit.factory.SofaMappingFactoryTest
Tests run: 1, Failures: 0, Errors: 0, Skipped: 0, Time elapsed: 0 sec
Running org.apache.uima.fit.factory.JCasFactoryTest
Tests run: 4, Failures: 0, Errors: 0, Skipped: 0, Time elapsed: 0.082 sec
Running org.apache.uima.fit.factory.ResourceMetaDataFactoryTest
Tests run: 3, Failures: 0, Errors: 0, Skipped: 0, Time elapsed: 0.003 sec
Running org.apache.uima.fit.factory.LoggingTest
Mar 1, 2013 6:42:57 AM org.apache.uima.fit.util.ExtendedLogger info(262)
INFO: Logging: org.apache.uima.fit.factory.LoggingTest$LoggingCasCollectionReader
Mar 1, 2013 6:42:57 AM org.apache.uima.fit.util.ExtendedLogger info(262)
INFO: Logging: org.apache.uima.fit.factory.LoggingTest$LoggingJCasCollectionReader
Mar 1, 2013 6:42:57 AM org.apache.uima.fit.util.ExtendedLogger info(262)
INFO: Logging: org.apache.uima.fit.factory.LoggingTest$LoggingCasAnnotator
Mar 1, 2013 6:42:57 AM org.apache.uima.fit.util.ExtendedLogger info(262)
INFO: Logging: org.apache.uima.fit.factory.LoggingTest$LoggingJCasAnnotator
Mar 1, 2013 6:42:57 AM org.apache.uima.fit.util.ExtendedLogger info(262)
INFO: Logging: org.apache.uima.fit.factory.LoggingTest$LoggingCasConsumer
Mar 1, 2013 6:42:57 AM org.apache.uima.fit.util.ExtendedLogger info(262)
INFO: Logging: org.apache.uima.fit.factory.LoggingTest$LoggingJCasConsumer
Mar 1, 2013 6:42:57 AM org.apache.uima.fit.util.ExtendedLogger info(262)
INFO: Logging: org.apache.uima.fit.factory.LoggingTest$LoggingCasMultiplier
Mar 1, 2013 6:42:57 AM org.apache.uima.fit.util.ExtendedLogger info(262)
INFO: Logging: org.apache.uima.fit.factory.LoggingTest$LoggingJCasMultiplier
Tests run: 2, Failures: 0, Errors: 0, Skipped: 0, Time elapsed: 0.186 sec
Running org.apache.uima.fit.factory.CollectionReaderFactoryExternalResourceTest
Tests run: 1, Failures: 0, Errors: 0, Skipped: 0, Time elapsed: 0.021 sec
Running org.apache.uima.fit.factory.FlowControllerFactoryExternalResourceTest
Tests run: 1, Failures: 0, Errors: 0, Skipped: 0, Time elapsed: 0.023 sec
Running org.apache.uima.fit.factory.testCrs.SingleFileXReaderTest
Tests run: 1, Failures: 0, Errors: 0, Skipped: 0, Time elapsed: 0.069 sec
Running org.apache.uima.fit.factory.TypeSystemDescriptionFactoryTest
Tests run: 2, Failures: 0, Errors: 0, Skipped: 0, Time elapsed: 0.024 sec
Running org.apache.uima.fit.factory.UimaContextFactoryTest
Tests run: 1, Failures: 0, Errors: 0, Skipped: 0, Time elapsed: 0.002 sec
Running org.apache.uima.fit.factory.AggregateBuilderTest
Tests run: 6, Failures: 0, Errors: 0, Skipped: 0, Time elapsed: 0.072 sec
Running org.apache.uima.fit.factory.AnalysisEngineFactoryExternalResourceTest
Tests run: 10, Failures: 0, Errors: 0, Skipped: 0, Time elapsed: 1.587 sec
Running org.apache.uima.fit.factory.FlowControllerFactoryTest
Tests run: 1, Failures: 0, Errors: 0, Skipped: 0, Time elapsed: 0.001 sec
Running org.apache.uima.fit.factory.AnnotationFactoryTest
Tests run: 1, Failures: 0, Errors: 0, Skipped: 0, Time elapsed: 0 sec
Running org.apache.uima.fit.factory.ResourceCreationSpecifierFactoryTest
Tests run: 4, Failures: 0, Errors: 0, Skipped: 0, Time elapsed: 0.007 sec
Running org.apache.uima.fit.factory.CollectionReaderFactoryTest
Tests run: 3, Failures: 0, Errors: 0, Skipped: 0, Time elapsed: 0.068 sec
Running org.apache.uima.fit.factory.ConfigurationParameterFactoryTest
Tests run: 8, Failures: 0, Errors: 0, Skipped: 0, Time elapsed: 0.003 sec
Running org.apache.uima.fit.factory.FsIndexFactoryTest
Tests run: 3, Failures: 0, Errors: 0, Skipped: 0, Time elapsed: 0.032 sec
Running org.apache.uima.fit.factory.AnalysisEngineFactoryTest
Tests run: 15, Failures: 0, Errors: 0, Skipped: 0, Time elapsed: 0.203 sec
Running org.apache.uima.fit.factory.initializable.InitializableFactoryTest
Tests run: 3, Failures: 0, Errors: 0, Skipped: 0, Time elapsed: 0.004 sec
Running org.apache.uima.fit.factory.ExternalResourceFactoryTest
Mar 1, 2013 6:42:59 AM org.springframework.mock.jndi.SimpleNamingContextBuilder bind
INFO: Static JNDI binding: [dictionaries/german] = [{Hans=proper noun}]
Mar 1, 2013 6:42:59 AM org.springframework.mock.jndi.SimpleNamingContextBuilder activate
INFO: Activating simple JNDI environment
Tests run: 4, Failures: 0, Errors: 0, Skipped: 0, Time elapsed: 0.842 sec
Running org.apache.uima.fit.factory.TypePrioritiesFactoryTest
Tests run: 1, Failures: 0, Errors: 0, Skipped: 0, Time elapsed: 0.008 sec
Running org.apache.uima.fit.util.LocaleUtilTest
Tests run: 2, Failures: 0, Errors: 0, Skipped: 0, Time elapsed: 0 sec
Running org.apache.uima.fit.util.DisableLoggingTest
Tests run: 1, Failures: 0, Errors: 0, Skipped: 0, Time elapsed: 0.001 sec
Running org.apache.uima.fit.util.FSCollectionFactoryTest
Tests run: 13, Failures: 0, Errors: 0, Skipped: 0, Time elapsed: 0.21 sec
Running org.apache.uima.fit.util.HideOutputTest
Tests run: 1, Failures: 0, Errors: 0, Skipped: 0, Time elapsed: 0 sec
Running org.apache.uima.fit.util.SimplePipelineTest
Tests run: 1, Failures: 0, Errors: 0, Skipped: 0, Time elapsed: 0.009 sec
Running org.apache.uima.fit.util.JCasUtilTest
Tests run: 25, Failures: 0, Errors: 0, Skipped: 0, Time elapsed: 9.979 sec
Running org.apache.uima.fit.util.JCasIterableTest
Tests run: 1, Failures: 0, Errors: 0, Skipped: 0, Time elapsed: 0.001 sec
Running org.apache.uima.fit.util.ContainmentIndexTest
Tests run: 1, Failures: 0, Errors: 0, Skipped: 0, Time elapsed: 0.003 sec
Running org.apache.uima.fit.util.CasUtilTest
Tests run: 8, Failures: 0, Errors: 0, Skipped: 0, Time elapsed: 0.006 sec
Running org.apache.uima.fit.pipeline.CpePipelineTest
Tests run: 1, Failures: 0, Errors: 0, Skipped: 0, Time elapsed: 0.121 sec
Running org.apache.uima.fit.pipeline.SimplePipelineTest
Tests run: 2, Failures: 0, Errors: 0, Skipped: 0, Time elapsed: 0.056 sec
Running org.apache.uima.fit.testing.factory.TokenBuilderTest
Tests run: 9, Failures: 0, Errors: 0, Skipped: 0, Time elapsed: 0.011 sec

Results :

Tests run: 169, Failures: 0, Errors: 0, Skipped: 0

[JENKINS] Recording test results
[INFO] 
[INFO] --- build-helper-maven-plugin:1.7:parse-version (parse-project-version) @ uimafit ---
[INFO] 
[INFO] --- uima-build-helper-maven-plugin:4:parse-date-time (set buildYear and buildMonth)
@ uimafit ---
[INFO] 
[INFO] --- gmaven-plugin:1.4:execute (read-notice) @ uimafit ---
Mar 1, 2013 6:43:17 AM hudson.maven.ExecutedMojo <init>
WARNING: Failed to getClass for org.apache.maven.plugin.javadoc.JavadocReport
[INFO] 
[INFO] --- maven-javadoc-plugin:2.9:javadoc (javadocs-distr) @ uimafit ---
[INFO] 
9 warnings
[WARNING] Javadoc Warnings
[WARNING] <https://builds.apache.org/job/UIMA-uimaFIT/ws/trunk/uimafit/src/main/java/org/apache/uima/fit/component/xwriter/CASDumpWriter.java>:86:
warning - Tag @link: can't find toString() in org.apache.uima.cas.FeatureStructure
[WARNING] <https://builds.apache.org/job/UIMA-uimaFIT/ws/trunk/uimafit/src/main/java/org/apache/uima/fit/descriptor/SofaCapability.java>:52:
warning - @SofaCapability(inputSofas is an unknown tag.
[WARNING] <https://builds.apache.org/job/UIMA-uimaFIT/ws/trunk/uimafit/src/main/java/org/apache/uima/fit/descriptor/SofaCapability.java>:52:
warning - @SofaCapability(inputSofas is an unknown tag.
[WARNING] <https://builds.apache.org/job/UIMA-uimaFIT/ws/trunk/uimafit/src/main/java/org/apache/uima/fit/descriptor/TypeCapability.java>:43:
warning - @TypeCapability(inputs="org.apache.uima.fit.type.Token", is an unknown tag.
[WARNING] <https://builds.apache.org/job/UIMA-uimaFIT/ws/trunk/uimafit/src/main/java/org/apache/uima/fit/descriptor/TypeCapability.java>:43:
warning - @TypeCapability(inputs={"org.apache.uima.fit.type.Token","org.apache.uima.fit.type.Sentence"},
is an unknown tag.
[WARNING] <https://builds.apache.org/job/UIMA-uimaFIT/ws/trunk/uimafit/src/main/java/org/apache/uima/fit/factory/FsIndexFactory.java>:201:
warning - Tag @link: can't find FS_INDEX_IMPORT_PATTERN in org.apache.uima.fit.factory.FsIndexFactory
[WARNING] <https://builds.apache.org/job/UIMA-uimaFIT/ws/trunk/uimafit/src/main/java/org/apache/uima/fit/factory/TypeSystemDescriptionFactory.java>:124:
warning - Tag @link: can't find TYPE_IMPORT_PATTERN in org.apache.uima.fit.factory.TypeSystemDescriptionFactory
[WARNING] <https://builds.apache.org/job/UIMA-uimaFIT/ws/trunk/uimafit/src/main/java/org/apache/uima/fit/util/MetaDataUtil.java>:55:
warning - @param argument "manifestPatterns" is not a parameter name.
[WARNING] <https://builds.apache.org/job/UIMA-uimaFIT/ws/trunk/uimafit/src/main/java/org/apache/uima/fit/util/MetaDataUtil.java>:55:
warning - @param argument "importProperty" is not a parameter name.
[JENKINS] Archiving  javadoc
Successfully loaded native POSIX impl.
[INFO] 
[INFO] --- maven-jar-plugin:2.4:jar (default-jar) @ uimafit ---
[INFO] Building jar: <https://builds.apache.org/job/UIMA-uimaFIT/ws/trunk/uimafit/target/uimafit-2.0.0-SNAPSHOT.jar>
[INFO] 
[INFO] --- maven-site-plugin:3.2:attach-descriptor (attach-descriptor) @ uimafit ---
[INFO] 
[INFO] --- findbugs-maven-plugin:2.5.2:findbugs (default) @ uimafit ---
[INFO] Fork Value is true
     [java] Warnings generated: 19
[INFO] Done FindBugs Analysis....
[INFO]                                                                         
[INFO] ------------------------------------------------------------------------
[INFO] Skipping uimaFIT - Parent
[INFO] This project has been banned from the build due to previous failures.
[INFO] ------------------------------------------------------------------------
[INFO] ------------------------------------------------------------------------
[INFO] Reactor Summary:
[INFO] 
[INFO] uimaFIT - Parent .................................. SUCCESS [50.098s]
[INFO] uimaFIT ........................................... FAILURE [1:05.440s]
[INFO] uimaFIT - Examples ................................ SKIPPED
[INFO] uimaFIT - Spring integration ...................... SKIPPED
[INFO] uimaFIT - Maven Plugin ............................ SKIPPED
[INFO] uimaFIT - Legacy uimaFIT support .................. SKIPPED
[INFO] ------------------------------------------------------------------------
[INFO] BUILD FAILURE
[INFO] ------------------------------------------------------------------------
[INFO] Total time: 2:01.871s
[INFO] Finished at: Fri Mar 01 06:43:48 UTC 2013
[INFO] Final Memory: 39M/98M
[INFO] ------------------------------------------------------------------------
[JENKINS] Archiving <https://builds.apache.org/job/UIMA-uimaFIT/ws/trunk/uimafit/pom.xml>
to /home/hudson/hudson/jobs/UIMA-uimaFIT/modules/org.apache.uima$uimafit/builds/2013-03-01_06-41-19/archive/org.apache.uima/uimafit/2.0.0-SNAPSHOT/uimafit-2.0.0-SNAPSHOT.pom
[JENKINS] Archiving <https://builds.apache.org/job/UIMA-uimaFIT/ws/trunk/uimafit/target/uimafit-2.0.0-SNAPSHOT.jar>
to /home/hudson/hudson/jobs/UIMA-uimaFIT/modules/org.apache.uima$uimafit/builds/2013-03-01_06-41-19/archive/org.apache.uima/uimafit/2.0.0-SNAPSHOT/uimafit-2.0.0-SNAPSHOT.jar
[JENKINS] Archiving <https://builds.apache.org/job/UIMA-uimaFIT/ws/trunk/uimafit-maven-plugin/pom.xml>
to /home/hudson/hudson/jobs/UIMA-uimaFIT/modules/org.apache.uima$uimafit-maven-plugin/builds/2013-03-01_06-41-19/archive/org.apache.uima/uimafit-maven-plugin/2.0.0-SNAPSHOT/uimafit-maven-plugin-2.0.0-SNAPSHOT.pom
[JENKINS] Archiving <https://builds.apache.org/job/UIMA-uimaFIT/ws/trunk/uimafit-spring/pom.xml>
to /home/hudson/hudson/jobs/UIMA-uimaFIT/modules/org.apache.uima$uimafit-spring/builds/2013-03-01_06-41-19/archive/org.apache.uima/uimafit-spring/2.0.0-SNAPSHOT/uimafit-spring-2.0.0-SNAPSHOT.pom
[JENKINS] Archiving <https://builds.apache.org/job/UIMA-uimaFIT/ws/trunk/uimafit-examples/pom.xml>
to /home/hudson/hudson/jobs/UIMA-uimaFIT/modules/org.apache.uima$uimafit-examples/builds/2013-03-01_06-41-19/archive/org.apache.uima/uimafit-examples/2.0.0-SNAPSHOT/uimafit-examples-2.0.0-SNAPSHOT.pom
[JENKINS] Archiving <https://builds.apache.org/job/UIMA-uimaFIT/ws/trunk/pom.xml> to
/home/hudson/hudson/jobs/UIMA-uimaFIT/modules/org.apache.uima$uimafit-parent/builds/2013-03-01_06-41-19/archive/org.apache.uima/uimafit-parent/2.0.0-SNAPSHOT/uimafit-parent-2.0.0-SNAPSHOT.pom
[JENKINS] Archiving <https://builds.apache.org/job/UIMA-uimaFIT/ws/trunk/uimafit-legacy-support/pom.xml>
to /home/hudson/hudson/jobs/UIMA-uimaFIT/modules/org.apache.uima$uimafit-legacy-support/builds/2013-03-01_06-41-20/archive/org.apache.uima/uimafit-legacy-support/2.0.0-SNAPSHOT/uimafit-legacy-support-2.0.0-SNAPSHOT.pom
[WARNING] The requested profile "javancss" could not be activated because it does not exist.
[WARNING] The requested profile "cobertura-aggregate" could not be activated because it does
not exist.
[WARNING] The requested profile "attach-source" could not be activated because it does not
exist.
[WARNING] The requested profile "attach-javadoc" could not be activated because it does not
exist.
[WARNING] The requested profile "attach-test" could not be activated because it does not exist.
Waiting for Jenkins to finish collecting data
mavenExecutionResult exceptions not empty
message : Internal error: java.lang.reflect.UndeclaredThrowableException
cause : null
Stack trace : 
org.apache.maven.InternalErrorException: Internal error: java.lang.reflect.UndeclaredThrowableException
	at org.apache.maven.lifecycle.internal.BuilderCommon.handleBuildError(BuilderCommon.java:128)
	at org.apache.maven.lifecycle.internal.LifecycleModuleBuilder.buildProject(LifecycleModuleBuilder.java:95)
	at org.apache.maven.lifecycle.internal.LifecycleModuleBuilder.buildProject(LifecycleModuleBuilder.java:59)
	at org.apache.maven.lifecycle.internal.LifecycleStarter.singleThreadedBuild(LifecycleStarter.java:183)
	at org.apache.maven.lifecycle.internal.LifecycleStarter.execute(LifecycleStarter.java:161)
	at org.apache.maven.DefaultMaven.doExecute(DefaultMaven.java:320)
	at org.apache.maven.DefaultMaven.execute(DefaultMaven.java:156)
	at org.jvnet.hudson.maven3.launcher.Maven3Launcher.main(Maven3Launcher.java:79)
	at sun.reflect.NativeMethodAccessorImpl.invoke0(Native Method)
	at sun.reflect.NativeMethodAccessorImpl.invoke(NativeMethodAccessorImpl.java:39)
	at sun.reflect.DelegatingMethodAccessorImpl.invoke(DelegatingMethodAccessorImpl.java:25)
	at java.lang.reflect.Method.invoke(Method.java:592)
	at org.codehaus.plexus.classworlds.launcher.Launcher.launchStandard(Launcher.java:329)
	at org.codehaus.plexus.classworlds.launcher.Launcher.launch(Launcher.java:239)
	at org.jvnet.hudson.maven3.agent.Maven3Main.launch(Maven3Main.java:158)
	at hudson.maven.Maven3Builder.call(Maven3Builder.java:100)
	at hudson.maven.Maven3Builder.call(Maven3Builder.java:66)
	at hudson.remoting.UserRequest.perform(UserRequest.java:118)
	at hudson.remoting.UserRequest.perform(UserRequest.java:48)
	at hudson.remoting.Request$2.run(Request.java:326)
	at hudson.remoting.InterceptingExecutorService$1.call(InterceptingExecutorService.java:72)
	at java.util.concurrent.FutureTask$Sync.innerRun(FutureTask.java:269)
	at java.util.concurrent.FutureTask.run(FutureTask.java:123)
	at java.util.concurrent.ThreadPoolExecutor$Worker.runTask(ThreadPoolExecutor.java:651)
	at java.util.concurrent.ThreadPoolExecutor$Worker.run(ThreadPoolExecutor.java:676)
	at java.lang.Thread.run(Thread.java:595)
Caused by: java.lang.reflect.UndeclaredThrowableException
	at $Proxy2.setExecutedMojos(Unknown Source)
	at hudson.maven.MavenBuildProxy$Filter.setExecutedMojos(MavenBuildProxy.java:243)
	at hudson.maven.Maven3Builder$MavenExecutionListener.recordMojoEnded(Maven3Builder.java:439)
	at hudson.maven.Maven3Builder$MavenExecutionListener.mojoSucceeded(Maven3Builder.java:425)
	at org.apache.maven.lifecycle.internal.DefaultExecutionEventCatapult.fire(DefaultExecutionEventCatapult.java:87)
	at org.apache.maven.lifecycle.internal.DefaultExecutionEventCatapult.fire(DefaultExecutionEventCatapult.java:42)
	at org.apache.maven.lifecycle.internal.MojoExecutor.execute(MojoExecutor.java:228)
	at org.apache.maven.lifecycle.internal.MojoExecutor.execute(MojoExecutor.java:153)
	at org.apache.maven.lifecycle.internal.MojoExecutor.execute(MojoExecutor.java:145)
	at org.apache.maven.lifecycle.internal.LifecycleModuleBuilder.buildProject(LifecycleModuleBuilder.java:84)
	... 24 more
Caused by: java.io.StreamCorruptedException: invalid type code: 00
	at java.io.ObjectInputStream.readObject0(ObjectInputStream.java:1374)
	at java.io.ObjectInputStream.readObject(ObjectInputStream.java:369)
	at java.util.concurrent.CopyOnWriteArrayList.readObject(CopyOnWriteArrayList.java:879)
	at sun.reflect.GeneratedMethodAccessor3171.invoke(Unknown Source)
	at sun.reflect.DelegatingMethodAccessorImpl.invoke(DelegatingMethodAccessorImpl.java:43)
	at java.lang.reflect.Method.invoke(Method.java:601)
	at java.io.ObjectStreamClass.invokeReadObject(ObjectStreamClass.java:1004)
	at java.io.ObjectInputStream.readSerialData(ObjectInputStream.java:1872)
	at java.io.ObjectInputStream.readOrdinaryObject(ObjectInputStream.java:1777)
	at java.io.ObjectInputStream.readObject0(ObjectInputStream.java:1347)
	at java.io.ObjectInputStream.readArray(ObjectInputStream.java:1685)
	at java.io.ObjectInputStream.readObject0(ObjectInputStream.java:1341)
	at java.io.ObjectInputStream.defaultReadFields(ObjectInputStream.java:1970)
	at java.io.ObjectInputStream.readSerialData(ObjectInputStream.java:1894)
	at java.io.ObjectInputStream.readOrdinaryObject(ObjectInputStream.java:1777)
	at java.io.ObjectInputStream.readObject0(ObjectInputStream.java:1347)
	at java.io.ObjectInputStream.readObject(ObjectInputStream.java:369)
	at hudson.remoting.UserRequest.deserialize(UserRequest.java:182)
	at hudson.remoting.UserRequest.perform(UserRequest.java:98)
	at hudson.remoting.UserRequest.perform(UserRequest.java:48)
	at hudson.remoting.Request$2.run(Request.java:326)
	at hudson.remoting.InterceptingExecutorService$1.call(InterceptingExecutorService.java:72)
	at java.util.concurrent.FutureTask$Sync.innerRun(FutureTask.java:334)
	at java.util.concurrent.FutureTask.run(FutureTask.java:166)
	at java.util.concurrent.ThreadPoolExecutor.runWorker(ThreadPoolExecutor.java:1145)
	at java.util.concurrent.ThreadPoolExecutor$Worker.run(ThreadPoolExecutor.java:615)
	at java.lang.Thread.run(Thread.java:722)
Sending e-mails to: dev@uima.apache.org
channel stopped
[WARNINGS] Skipping publisher since build result is FAILURE
Skipping Cobertura coverage report as build was not UNSTABLE or better ...

Mime
View raw message