uima-dev mailing list archives

Site index · List index
Message view « Date » · « Thread »
Top « Date » · « Thread »
From Apache Jenkins Server <jenk...@builds.apache.org>
Subject Build failed in Jenkins: UIMA-AS #234
Date Fri, 14 Jun 2013 22:16:35 GMT
See <https://builds.apache.org/job/UIMA-AS/234/changes>

Changes:

[cwiklik] UIMA-3001 - modified finalState to fix a race condition when a child and its parent
are in play at the same time.

------------------------------------------
[...truncated 1701 lines...]
Downloading: http://repo1.maven.org/maven2/org/jasypt/jasypt/1.6/jasypt-1.6.jar
Downloaded: http://repo1.maven.org/maven2/commons-net/commons-net/2.0/commons-net-2.0.jar
(193 KB at 19244.8 KB/sec)
Downloading: http://repo1.maven.org/maven2/com/ibm/icu/icu4j/4.0.1/icu4j-4.0.1.jar
Downloaded: http://repo1.maven.org/maven2/org/jasypt/jasypt/1.6/jasypt-1.6.jar (129 KB at
885.3 KB/sec)
Downloading: http://repo1.maven.org/maven2/org/apache/activemq/activemq-camel/5.4.1/activemq-camel-5.4.1.jar
Downloaded: http://repo1.maven.org/maven2/com/ibm/icu/icu4j/4.0.1/icu4j-4.0.1.jar (5517 KB
at 33431.8 KB/sec)
Downloading: http://repo1.maven.org/maven2/org/apache/camel/camel-jms/2.4.0/camel-jms-2.4.0.jar
Downloaded: http://repo1.maven.org/maven2/org/apache/activemq/activemq-web/5.4.1/activemq-web-5.4.1.jar
(96 KB at 382.1 KB/sec)
Downloading: http://repo1.maven.org/maven2/org/apache/camel/camel-core/2.4.0/camel-core-2.4.0.jar
Downloaded: http://repo1.maven.org/maven2/org/apache/activemq/activemq-core/5.4.1/activemq-core-5.4.1.jar
(3220 KB at 11335.7 KB/sec)
Downloading: http://repo1.maven.org/maven2/org/fusesource/commonman/commons-management/1.0/commons-management-1.0.jar
Downloaded: http://repo1.maven.org/maven2/org/fusesource/commonman/commons-management/1.0/commons-management-1.0.jar
(16 KB at 381.5 KB/sec)
Downloading: http://repo1.maven.org/maven2/javax/xml/bind/jaxb-api/2.1/jaxb-api-2.1.jar
Downloaded: http://repo1.maven.org/maven2/javax/xml/bind/jaxb-api/2.1/jaxb-api-2.1.jar (88
KB at 10982.3 KB/sec)
Downloading: http://repo1.maven.org/maven2/javax/xml/stream/stax-api/1.0-2/stax-api-1.0-2.jar
Downloaded: http://repo1.maven.org/maven2/javax/xml/stream/stax-api/1.0-2/stax-api-1.0-2.jar
(23 KB at 3257.0 KB/sec)
Downloading: http://repo1.maven.org/maven2/com/sun/xml/bind/jaxb-impl/2.1.12/jaxb-impl-2.1.12.jar
Downloaded: http://repo1.maven.org/maven2/org/apache/activemq/activemq-jaas/5.4.1/activemq-jaas-5.4.1.jar
(28 KB at 75.6 KB/sec)
Downloading: http://repo1.maven.org/maven2/org/apache/camel/camel-spring/2.4.0/camel-spring-2.4.0.jar
Downloaded: http://repo1.maven.org/maven2/com/sun/xml/bind/jaxb-impl/2.1.12/jaxb-impl-2.1.12.jar
(848 KB at 14867.8 KB/sec)
Downloading: http://repo1.maven.org/maven2/org/eclipse/jetty/jetty-websocket/7.0.1.v20091125/jetty-websocket-7.0.1.v20091125.jar
Downloaded: http://repo1.maven.org/maven2/org/apache/camel/camel-jms/2.4.0/camel-jms-2.4.0.jar
(119 KB at 462.2 KB/sec)
Downloading: http://repo1.maven.org/maven2/org/eclipse/jetty/jetty-server/7.0.1.v20091125/jetty-server-7.0.1.v20091125.jar
Downloaded: http://repo1.maven.org/maven2/org/apache/activemq/activemq-camel/5.4.1/activemq-camel-5.4.1.jar
(44 KB at 155.8 KB/sec)
Downloading: http://repo1.maven.org/maven2/org/eclipse/jetty/jetty-http/7.0.1.v20091125/jetty-http-7.0.1.v20091125.jar
Downloaded: http://repo1.maven.org/maven2/org/eclipse/jetty/jetty-http/7.0.1.v20091125/jetty-http-7.0.1.v20091125.jar
(105 KB at 3862.1 KB/sec)
Downloading: http://repo1.maven.org/maven2/org/eclipse/jetty/jetty-io/7.0.1.v20091125/jetty-io-7.0.1.v20091125.jar
Downloaded: http://repo1.maven.org/maven2/org/eclipse/jetty/jetty-server/7.0.1.v20091125/jetty-server-7.0.1.v20091125.jar
(245 KB at 3764.4 KB/sec)
Downloading: http://repo1.maven.org/maven2/org/eclipse/jetty/jetty-continuation/7.0.1.v20091125/jetty-continuation-7.0.1.v20091125.jar
Downloaded: http://repo1.maven.org/maven2/org/eclipse/jetty/jetty-io/7.0.1.v20091125/jetty-io-7.0.1.v20091125.jar
(66 KB at 1685.8 KB/sec)
Downloading: http://repo1.maven.org/maven2/rome/rome/0.8/rome-0.8.jar
Downloaded: http://repo1.maven.org/maven2/org/eclipse/jetty/jetty-continuation/7.0.1.v20091125/jetty-continuation-7.0.1.v20091125.jar
(19 KB at 555.3 KB/sec)
Downloading: http://repo1.maven.org/maven2/jdom/jdom/1.0/jdom-1.0.jar
Downloaded: http://repo1.maven.org/maven2/jdom/jdom/1.0/jdom-1.0.jar (150 KB at 13605.6 KB/sec)
Downloading: http://repo1.maven.org/maven2/org/apache/xbean/xbean-spring/3.7/xbean-spring-3.7.jar
Downloaded: http://repo1.maven.org/maven2/rome/rome/0.8/rome-0.8.jar (193 KB at 3567.9 KB/sec)
Downloading: http://repo1.maven.org/maven2/org/springframework/spring-webmvc/3.0.3.RELEASE/spring-webmvc-3.0.3.RELEASE.jar
Downloaded: http://repo1.maven.org/maven2/org/apache/xbean/xbean-spring/3.7/xbean-spring-3.7.jar
(128 KB at 3278.8 KB/sec)
Downloading: http://repo1.maven.org/maven2/org/springframework/spring-context-support/3.0.3.RELEASE/spring-context-support-3.0.3.RELEASE.jar
Downloaded: http://repo1.maven.org/maven2/org/apache/camel/camel-core/2.4.0/camel-core-2.4.0.jar
(1483 KB at 3953.4 KB/sec)
Downloading: http://repo1.maven.org/maven2/stax/stax/1.2.0/stax-1.2.0.jar
Downloaded: http://repo1.maven.org/maven2/stax/stax/1.2.0/stax-1.2.0.jar (176 KB at 5151.3
KB/sec)
Downloading: http://repo1.maven.org/maven2/org/springframework/spring-web/3.0.3.RELEASE/spring-web-3.0.3.RELEASE.jar
Downloaded: http://repo1.maven.org/maven2/org/springframework/spring-webmvc/3.0.3.RELEASE/spring-webmvc-3.0.3.RELEASE.jar
(395 KB at 5060.1 KB/sec)
Downloading: http://repo1.maven.org/maven2/xmlpull/xmlpull/1.1.3.4d_b4_min/xmlpull-1.1.3.4d_b4_min.jar
Downloaded: http://repo1.maven.org/maven2/org/springframework/spring-context-support/3.0.3.RELEASE/spring-context-support-3.0.3.RELEASE.jar
(99 KB at 1225.2 KB/sec)
Downloading: http://repo1.maven.org/maven2/org/apache/activemq/activemq-spring/5.4.1/activemq-spring-5.4.1.jar
Downloaded: http://repo1.maven.org/maven2/org/eclipse/jetty/jetty-websocket/7.0.1.v20091125/jetty-websocket-7.0.1.v20091125.jar
(18 KB at 50.8 KB/sec)
Downloading: http://repo1.maven.org/maven2/org/apache/activemq/activemq-pool/5.4.1/activemq-pool-5.4.1.jar
Downloaded: http://repo1.maven.org/maven2/org/apache/camel/camel-spring/2.4.0/camel-spring-2.4.0.jar
(180 KB at 463.2 KB/sec)
Downloading: http://repo1.maven.org/maven2/org/apache/geronimo/specs/geronimo-jta_1.0.1B_spec/1.0.1/geronimo-jta_1.0.1B_spec-1.0.1.jar
Downloaded: http://repo1.maven.org/maven2/org/springframework/spring-web/3.0.3.RELEASE/spring-web-3.0.3.RELEASE.jar
(380 KB at 4130.4 KB/sec)
Downloading: http://repo1.maven.org/maven2/org/springframework/osgi/spring-osgi-core/1.2.1/spring-osgi-core-1.2.1.jar
Downloaded: http://repo1.maven.org/maven2/org/apache/geronimo/specs/geronimo-jta_1.0.1B_spec/1.0.1/geronimo-jta_1.0.1B_spec-1.0.1.jar
(15 KB at 893.4 KB/sec)
Downloading: http://repo1.maven.org/maven2/org/springframework/osgi/spring-osgi-io/1.2.1/spring-osgi-io-1.2.1.jar
Downloaded: http://repo1.maven.org/maven2/org/apache/activemq/activemq-pool/5.4.1/activemq-pool-5.4.1.jar
(36 KB at 484.6 KB/sec)
Downloading: http://repo1.maven.org/maven2/org/apache/activemq/activemq-optional/5.4.1/activemq-optional-5.4.1.jar
Downloaded: http://repo1.maven.org/maven2/org/springframework/osgi/spring-osgi-io/1.2.1/spring-osgi-io-1.2.1.jar
(36 KB at 454.8 KB/sec)
Downloading: http://repo1.maven.org/maven2/org/apache/activemq/activeio-core/3.1.2/activeio-core-3.1.2.jar
Downloaded: http://repo1.maven.org/maven2/xmlpull/xmlpull/1.1.3.4d_b4_min/xmlpull-1.1.3.4d_b4_min.jar
(24 KB at 117.5 KB/sec)
Downloading: http://repo1.maven.org/maven2/org/apache/activemq/activemq-console/5.4.1/activemq-console-5.4.1.jar
Downloaded: http://repo1.maven.org/maven2/org/springframework/osgi/spring-osgi-core/1.2.1/spring-osgi-core-1.2.1.jar
(355 KB at 2953.2 KB/sec)
Downloading: http://repo1.maven.org/maven2/org/eclipse/jetty/jetty-webapp/7.0.1.v20091125/jetty-webapp-7.0.1.v20091125.jar
Downloaded: http://repo1.maven.org/maven2/org/apache/activemq/activeio-core/3.1.2/activeio-core-3.1.2.jar
(101 KB at 3579.5 KB/sec)
Downloading: http://repo1.maven.org/maven2/org/eclipse/jetty/jetty-xml/7.0.1.v20091125/jetty-xml-7.0.1.v20091125.jar
Downloaded: http://repo1.maven.org/maven2/org/eclipse/jetty/jetty-webapp/7.0.1.v20091125/jetty-webapp-7.0.1.v20091125.jar
(57 KB at 1030.8 KB/sec)
Downloading: http://repo1.maven.org/maven2/org/eclipse/jetty/jetty-util/7.0.1.v20091125/jetty-util-7.0.1.v20091125.jar
Downloaded: http://repo1.maven.org/maven2/org/eclipse/jetty/jetty-xml/7.0.1.v20091125/jetty-xml-7.0.1.v20091125.jar
(28 KB at 472.8 KB/sec)
Downloading: http://repo1.maven.org/maven2/org/eclipse/jetty/jetty-servlet/7.0.1.v20091125/jetty-servlet-7.0.1.v20091125.jar
Downloaded: http://repo1.maven.org/maven2/org/eclipse/jetty/jetty-util/7.0.1.v20091125/jetty-util-7.0.1.v20091125.jar
(175 KB at 2395.6 KB/sec)
Downloading: http://repo1.maven.org/maven2/org/eclipse/jetty/jetty-security/7.0.1.v20091125/jetty-security-7.0.1.v20091125.jar
Downloaded: http://repo1.maven.org/maven2/org/eclipse/jetty/jetty-servlet/7.0.1.v20091125/jetty-servlet-7.0.1.v20091125.jar
(64 KB at 724.5 KB/sec)
Downloading: http://repo1.maven.org/maven2/axis/axis/1.2-RC1/axis-1.2-RC1.jar
Downloaded: http://repo1.maven.org/maven2/org/eclipse/jetty/jetty-security/7.0.1.v20091125/jetty-security-7.0.1.v20091125.jar
(65 KB at 1145.3 KB/sec)
Downloading: http://repo1.maven.org/maven2/commons-httpclient/commons-httpclient/3.1/commons-httpclient-3.1.jar
Downloaded: http://repo1.maven.org/maven2/commons-httpclient/commons-httpclient/3.1/commons-httpclient-3.1.jar
(298 KB at 22911.7 KB/sec)
Downloading: http://repo1.maven.org/maven2/commons-codec/commons-codec/1.2/commons-codec-1.2.jar
Downloaded: http://repo1.maven.org/maven2/commons-codec/commons-codec/1.2/commons-codec-1.2.jar
(30 KB at 4197.1 KB/sec)
Downloading: http://repo1.maven.org/maven2/org/apache/velocity/velocity/1.6.2/velocity-1.6.2.jar
Downloaded: http://repo1.maven.org/maven2/org/apache/activemq/activemq-spring/5.4.1/activemq-spring-5.4.1.jar
(48 KB at 120.2 KB/sec)
Downloading: http://repo1.maven.org/maven2/net/sf/josql/josql/1.5/josql-1.5.jar
Downloading: http://repo1.maven.org/maven2/net/sf/josql/gentlyweb-utils/1.5/gentlyweb-utils-1.5.jar
Downloading: http://repo1.maven.org/maven2/org/apache/activemq/kahadb/5.4.1/kahadb-5.4.1.jar
Downloaded: http://repo1.maven.org/maven2/org/apache/velocity/velocity/1.6.2/velocity-1.6.2.jar
(412 KB at 13703.6 KB/sec)
Downloading: http://repo1.maven.org/maven2/org/apache/geronimo/specs/geronimo-jms_1.1_spec/1.1/geronimo-jms_1.1_spec-1.1.jar
Downloaded: http://repo1.maven.org/maven2/org/apache/geronimo/specs/geronimo-jms_1.1_spec/1.1/geronimo-jms_1.1_spec-1.1.jar
(32 KB at 557.8 KB/sec)
Downloading: http://repo1.maven.org/maven2/org/apache/geronimo/specs/geronimo-j2ee-management_1.1_spec/1.0.1/geronimo-j2ee-management_1.1_spec-1.0.1.jar
Downloaded: http://repo1.maven.org/maven2/org/apache/activemq/activemq-console/5.4.1/activemq-console-5.4.1.jar
(113 KB at 357.8 KB/sec)
Downloading: http://repo1.maven.org/maven2/org/apache/geronimo/specs/geronimo-servlet_2.5_spec/1.2/geronimo-servlet_2.5_spec-1.2.jar
Downloaded: http://repo1.maven.org/maven2/org/apache/activemq/kahadb/5.4.1/kahadb-5.4.1.jar
(152 KB at 1679.1 KB/sec)
Downloading: http://repo1.maven.org/maven2/org/eclipse/jetty/aggregate/jetty-all-server/7.0.1.v20091125/jetty-all-server-7.0.1.v20091125.jar
Downloaded: http://repo1.maven.org/maven2/org/apache/activemq/activemq-optional/5.4.1/activemq-optional-5.4.1.jar
(122 KB at 329.0 KB/sec)
Downloading: http://repo1.maven.org/maven2/org/apache/geronimo/specs/geronimo-jta_1.1_spec/1.1.1/geronimo-jta_1.1_spec-1.1.1.jar
Downloaded: http://repo1.maven.org/maven2/org/apache/geronimo/specs/geronimo-servlet_2.5_spec/1.2/geronimo-servlet_2.5_spec-1.2.jar
(69 KB at 8617.3 KB/sec)
Downloading: http://repo1.maven.org/maven2/javax/mail/mail/1.4/mail-1.4.jar
Downloaded: http://repo1.maven.org/maven2/org/apache/geronimo/specs/geronimo-jta_1.1_spec/1.1.1/geronimo-jta_1.1_spec-1.1.1.jar
(16 KB at 2236.3 KB/sec)
Downloading: http://repo1.maven.org/maven2/javax/activation/activation/1.1/activation-1.1.jar
Downloaded: http://repo1.maven.org/maven2/javax/activation/activation/1.1/activation-1.1.jar
(62 KB at 6834.1 KB/sec)
Downloading: http://repo1.maven.org/maven2/org/apache/geronimo/specs/geronimo-jaspic_1.0_spec/1.0/geronimo-jaspic_1.0_spec-1.0.jar
Downloaded: http://repo1.maven.org/maven2/javax/mail/mail/1.4/mail-1.4.jar (380 KB at 22338.2
KB/sec)
Downloading: http://repo1.maven.org/maven2/org/apache/geronimo/specs/geronimo-annotation_1.0_spec/1.1.1/geronimo-annotation_1.0_spec-1.1.1.jar
Downloaded: http://repo1.maven.org/maven2/org/apache/geronimo/specs/geronimo-annotation_1.0_spec/1.1.1/geronimo-annotation_1.0_spec-1.1.1.jar
(13 KB at 506.7 KB/sec)
Downloading: http://repo1.maven.org/maven2/asm/asm-commons/3.1/asm-commons-3.1.jar
Downloaded: http://repo1.maven.org/maven2/org/apache/geronimo/specs/geronimo-j2ee-management_1.1_spec/1.0.1/geronimo-j2ee-management_1.1_spec-1.0.1.jar
(20 KB at 189.9 KB/sec)
Downloading: http://repo1.maven.org/maven2/asm/asm-tree/3.1/asm-tree-3.1.jar
Downloaded: http://repo1.maven.org/maven2/asm/asm-commons/3.1/asm-commons-3.1.jar (32 KB at
778.7 KB/sec)
Downloading: http://repo1.maven.org/maven2/asm/asm/3.1/asm-3.1.jar
Downloaded: http://repo1.maven.org/maven2/asm/asm/3.1/asm-3.1.jar (43 KB at 6003.5 KB/sec)
Downloaded: http://repo1.maven.org/maven2/org/apache/geronimo/specs/geronimo-jaspic_1.0_spec/1.0/geronimo-jaspic_1.0_spec-1.0.jar
(30 KB at 342.9 KB/sec)
Downloaded: http://repo1.maven.org/maven2/asm/asm-tree/3.1/asm-tree-3.1.jar (22 KB at 763.1
KB/sec)
Downloaded: http://repo1.maven.org/maven2/axis/axis/1.2-RC1/axis-1.2-RC1.jar (1445 KB at 3497.0
KB/sec)
Downloaded: http://repo1.maven.org/maven2/org/eclipse/jetty/aggregate/jetty-all-server/7.0.1.v20091125/jetty-all-server-7.0.1.v20091125.jar
(1203 KB at 3190.8 KB/sec)
Downloading: http://repo.fusesource.com/maven2/net/sf/josql/josql/1.5/josql-1.5.jar
Downloading: http://repo.fusesource.com/maven2/net/sf/josql/gentlyweb-utils/1.5/gentlyweb-utils-1.5.jar
Downloaded: http://repo.fusesource.com/maven2/net/sf/josql/gentlyweb-utils/1.5/gentlyweb-utils-1.5.jar
(68 KB at 98.8 KB/sec)
Downloaded: http://repo.fusesource.com/maven2/net/sf/josql/josql/1.5/josql-1.5.jar (194 KB
at 225.2 KB/sec)
Downloading: http://repository.apache.org/snapshots/org/apache/uima/uimaj-examples/2.4.1-SNAPSHOT/uimaj-examples-2.4.1-20130613.200452-74.jar
Downloading: http://repository.apache.org/snapshots/org/apache/uima/uimaj-document-annotation/2.4.1-SNAPSHOT/uimaj-document-annotation-2.4.1-20130613.200446-75.jar
Downloading: http://repository.apache.org/snapshots/org/apache/uima/uimaj-tools/2.4.1-SNAPSHOT/uimaj-tools-2.4.1-20130613.200453-74.jar
Downloading: http://repository.apache.org/snapshots/org/apache/uima/uimaj-test-util/2.4.1-SNAPSHOT/uimaj-test-util-2.4.1-20130613.200453-74.jar
Downloaded: http://repository.apache.org/snapshots/org/apache/uima/uimaj-document-annotation/2.4.1-SNAPSHOT/uimaj-document-annotation-2.4.1-20130613.200446-75.jar
(12 KB at 49.6 KB/sec)
Downloaded: http://repository.apache.org/snapshots/org/apache/uima/uimaj-test-util/2.4.1-SNAPSHOT/uimaj-test-util-2.4.1-20130613.200453-74.jar
(23 KB at 94.1 KB/sec)
Downloaded: http://repository.apache.org/snapshots/org/apache/uima/uimaj-examples/2.4.1-SNAPSHOT/uimaj-examples-2.4.1-20130613.200452-74.jar
(158 KB at 504.8 KB/sec)
Downloaded: http://repository.apache.org/snapshots/org/apache/uima/uimaj-tools/2.4.1-SNAPSHOT/uimaj-tools-2.4.1-20130613.200453-74.jar
(514 KB at 931.0 KB/sec)
[INFO] [INFO] Deleting <https://builds.apache.org/job/UIMA-AS/ws/trunk/uimaj-as-activemq/target>

[INFO] --- maven-clean-plugin:2.5:clean (default-clean) @ uimaj-as-activemq ---
[INFO] 
[INFO] --- build-helper-maven-plugin:1.7:parse-version (parse-project-version) @ uimaj-as-activemq
---
[INFO] 
[INFO] --- uima-build-helper-maven-plugin:4:parse-date-time (set buildYear and buildMonth)
@ uimaj-as-activemq ---
[INFO] 
[INFO] --- maven-remote-resources-plugin:1.4:process (default) @ uimaj-as-activemq ---
Downloading: http://repo1.maven.org/eclipse/net/sf/josql/josql/1.5/josql-1.5.pom
Downloading: http://repo1.maven.org/maven2/net/sf/josql/josql/1.5/josql-1.5.pom
Downloading: http://repo1.maven.org/eclipse/net/sf/josql/gentlyweb-utils/1.5/gentlyweb-utils-1.5.pom
Downloading: http://repo1.maven.org/maven2/net/sf/josql/gentlyweb-utils/1.5/gentlyweb-utils-1.5.pom
[INFO] [INFO] Using 'UTF-8' encoding to copy filtered resources.

[INFO] --- maven-resources-plugin:2.6:resources (default-resources) @ uimaj-as-activemq ---
[INFO] Copying 0 resource
[INFO] Copying 3 resources
[INFO] 
[INFO] --- maven-compiler-plugin:2.5.1:compile (default-compile) @ uimaj-as-activemq ---
[INFO] Compiling 22 source files to <https://builds.apache.org/job/UIMA-AS/ws/trunk/uimaj-as-activemq/target/classes>
[INFO] -------------------------------------------------------------
[ERROR] COMPILATION ERROR : 
[INFO] -------------------------------------------------------------
[ERROR] <https://builds.apache.org/job/UIMA-AS/ws/trunk/uimaj-as-activemq/src/main/java/org/apache/uima/adapter/jms/activemq/JmsOutputChannel.java>:[1972,40]
cannot find symbol
symbol  : variable MINUTES
location: class java.util.concurrent.TimeUnit
[INFO] 1 error
[INFO] -------------------------------------------------------------
[INFO] ------------------------------------------------------------------------
[INFO] Reactor Summary:
[INFO] 
[INFO] Apache UIMA-AS: uima-as-parent .................... SUCCESS [30.464s]
[INFO] Apache UIMA-AS: uimaj-as-core ..................... SUCCESS [21.838s]
[INFO] Apache UIMA-AS: uimaj-as-jms ...................... SUCCESS [4.983s]
[INFO] Apache UIMA-AS: uimaj-as-activemq ................. FAILURE [38.507s]
[INFO] Apache UIMA-AS Eclipse Plugin: uimaj-ep-runtime-deployeditor  SKIPPED
[INFO] Apache UIMA-AS Eclipse Plugin: uimaj-ep-deployeditor  SKIPPED
[INFO] Apache UIMA AS: uimaj-as-osgi-runtime ............. SKIPPED
[INFO] Apache UIMA-AS: uimaj-as-camel .................... SKIPPED
[INFO] Apache UIMA Eclipse: uimaj-eclipse-feature-deployeditor  SKIPPED
[INFO] Apache UIMA-AS Aggregate: aggregate-uima-as-eclipse-plugins  SKIPPED
[INFO] Apache UIMA-AS: uima-as-docbooks .................. SKIPPED
[INFO] Apache UIMA-AS Aggregate: aggregate-uima-as ....... SKIPPED
[INFO] Apache UIMA-AS: uima-as ........................... SKIPPED
[INFO] ------------------------------------------------------------------------
[INFO] BUILD FAILURE
[INFO] ------------------------------------------------------------------------
[INFO] Total time: 1:40.300s
[INFO] Finished at: Fri Jun 14 22:16:10 UTC 2013
[INFO] Final Memory: 26M/170M
[INFO] ------------------------------------------------------------------------
[JENKINS] Archiving <https://builds.apache.org/job/UIMA-AS/ws/trunk/uima-as-docbooks/pom.xml>
to /home/hudson/hudson/jobs/UIMA-AS/modules/org.apache.uima$uima-as-docbooks/builds/2013-06-14_22-14-12/archive/org.apache.uima/uima-as-docbooks/2.4.1-SNAPSHOT/uima-as-docbooks-2.4.1-SNAPSHOT.pom
[JENKINS] Archiving <https://builds.apache.org/job/UIMA-AS/ws/trunk/uimaj-ep-runtime-deployeditor/pom.xml>
to /home/hudson/hudson/jobs/UIMA-AS/modules/org.apache.uima$uimaj-ep-runtime-deployeditor/builds/2013-06-14_22-14-12/archive/org.apache.uima/uimaj-ep-runtime-deployeditor/2.4.1-SNAPSHOT/uimaj-ep-runtime-deployeditor-2.4.1-SNAPSHOT.pom
[JENKINS] Archiving <https://builds.apache.org/job/UIMA-AS/ws/trunk/aggregate-uima-as-eclipse-plugins/pom.xml>
to /home/hudson/hudson/jobs/UIMA-AS/modules/org.apache.uima$aggregate-uima-as-eclipse-plugins/builds/2013-06-14_22-14-11/archive/org.apache.uima/aggregate-uima-as-eclipse-plugins/2.4.1-SNAPSHOT/aggregate-uima-as-eclipse-plugins-2.4.1-SNAPSHOT.pom
[JENKINS] Archiving <https://builds.apache.org/job/UIMA-AS/ws/trunk/uimaj-as-jms/pom.xml>
to /home/hudson/hudson/jobs/UIMA-AS/modules/org.apache.uima$uimaj-as-jms/builds/2013-06-14_22-14-11/archive/org.apache.uima/uimaj-as-jms/2.4.1-SNAPSHOT/uimaj-as-jms-2.4.1-SNAPSHOT.pom
[JENKINS] Archiving <https://builds.apache.org/job/UIMA-AS/ws/trunk/uimaj-as-jms/target/uimaj-as-jms.jar>
to /home/hudson/hudson/jobs/UIMA-AS/modules/org.apache.uima$uimaj-as-jms/builds/2013-06-14_22-14-11/archive/org.apache.uima/uimaj-as-jms/2.4.1-SNAPSHOT/uimaj-as-jms-2.4.1-SNAPSHOT.jar
[JENKINS] Archiving <https://builds.apache.org/job/UIMA-AS/ws/trunk/uimaj-as-osgi-runtime/pom.xml>
to /home/hudson/hudson/jobs/UIMA-AS/modules/org.apache.uima$uimaj-as-osgi-runtime/builds/2013-06-14_22-14-12/archive/org.apache.uima/uimaj-as-osgi-runtime/2.4.1-SNAPSHOT/uimaj-as-osgi-runtime-2.4.1-SNAPSHOT.pom
[JENKINS] Archiving <https://builds.apache.org/job/UIMA-AS/ws/trunk/aggregate-uima-as/pom.xml>
to /home/hudson/hudson/jobs/UIMA-AS/modules/org.apache.uima$aggregate-uima-as/builds/2013-06-14_22-14-10/archive/org.apache.uima/aggregate-uima-as/2.4.1-SNAPSHOT/aggregate-uima-as-2.4.1-SNAPSHOT.pom
[JENKINS] Archiving <https://builds.apache.org/job/UIMA-AS/ws/trunk/uimaj-as-activemq/pom.xml>
to /home/hudson/hudson/jobs/UIMA-AS/modules/org.apache.uima$uimaj-as-activemq/builds/2013-06-14_22-14-10/archive/org.apache.uima/uimaj-as-activemq/2.4.1-SNAPSHOT/uimaj-as-activemq-2.4.1-SNAPSHOT.pom
[JENKINS] Archiving <https://builds.apache.org/job/UIMA-AS/ws/trunk/uima-as-parent/pom.xml>
to /home/hudson/hudson/jobs/UIMA-AS/modules/org.apache.uima$uima-as-parent/builds/2013-06-14_22-14-10/archive/org.apache.uima/uima-as-parent/2.4.1-SNAPSHOT/uima-as-parent-2.4.1-SNAPSHOT.pom
[JENKINS] Archiving <https://builds.apache.org/job/UIMA-AS/ws/trunk/uimaj-as-core/pom.xml>
to /home/hudson/hudson/jobs/UIMA-AS/modules/org.apache.uima$uimaj-as-core/builds/2013-06-14_22-14-11/archive/org.apache.uima/uimaj-as-core/2.4.1-SNAPSHOT/uimaj-as-core-2.4.1-SNAPSHOT.pom
[JENKINS] Archiving <https://builds.apache.org/job/UIMA-AS/ws/trunk/uimaj-as-core/target/uimaj-as-core.jar>
to /home/hudson/hudson/jobs/UIMA-AS/modules/org.apache.uima$uimaj-as-core/builds/2013-06-14_22-14-11/archive/org.apache.uima/uimaj-as-core/2.4.1-SNAPSHOT/uimaj-as-core-2.4.1-SNAPSHOT.jar
[JENKINS] Archiving <https://builds.apache.org/job/UIMA-AS/ws/trunk/uimaj-eclipse-feature-deployeditor/pom.xml>
to /home/hudson/hudson/jobs/UIMA-AS/modules/org.apache.uima$uimaj-eclipse-feature-deployeditor/builds/2013-06-14_22-14-12/archive/org.apache.uima/uimaj-eclipse-feature-deployeditor/2.4.0/uimaj-eclipse-feature-deployeditor-2.4.0.pom
[JENKINS] Archiving <https://builds.apache.org/job/UIMA-AS/ws/trunk/uimaj-ep-deployeditor/pom.xml>
to /home/hudson/hudson/jobs/UIMA-AS/modules/org.apache.uima$uimaj-ep-deployeditor/builds/2013-06-14_22-14-11/archive/org.apache.uima/uimaj-ep-deployeditor/2.4.1-SNAPSHOT/uimaj-ep-deployeditor-2.4.1-SNAPSHOT.pom
[JENKINS] Archiving <https://builds.apache.org/job/UIMA-AS/ws/trunk/uimaj-as-camel/pom.xml>
to /home/hudson/hudson/jobs/UIMA-AS/modules/org.apache.uima$uimaj-as-camel/builds/2013-06-14_22-14-12/archive/org.apache.uima/uimaj-as-camel/2.4.1-SNAPSHOT/uimaj-as-camel-2.4.1-SNAPSHOT.pom
[JENKINS] Archiving <https://builds.apache.org/job/UIMA-AS/ws/trunk/pom.xml> to /home/hudson/hudson/jobs/UIMA-AS/modules/org.apache.uima$uima-as/builds/2013-06-14_22-14-10/archive/org.apache.uima/uima-as/2.4.1-SNAPSHOT/uima-as-2.4.1-SNAPSHOT.pom
Waiting for Jenkins to finish collecting data
mavenExecutionResult exceptions not empty
message : Failed to execute goal org.apache.maven.plugins:maven-compiler-plugin:2.5.1:compile
(default-compile) on project uimaj-as-activemq: Compilation failure
<https://builds.apache.org/job/UIMA-AS/ws/trunk/uimaj-as-activemq/src/main/java/org/apache/uima/adapter/jms/activemq/JmsOutputChannel.java>:[1972,40]
cannot find symbol
symbol  : variable MINUTES
location: class java.util.concurrent.TimeUnit

cause : Compilation failure
<https://builds.apache.org/job/UIMA-AS/ws/trunk/uimaj-as-activemq/src/main/java/org/apache/uima/adapter/jms/activemq/JmsOutputChannel.java>:[1972,40]
cannot find symbol
symbol  : variable MINUTES
location: class java.util.concurrent.TimeUnit

Stack trace : 
org.apache.maven.lifecycle.LifecycleExecutionException: Failed to execute goal org.apache.maven.plugins:maven-compiler-plugin:2.5.1:compile
(default-compile) on project uimaj-as-activemq: Compilation failure
<https://builds.apache.org/job/UIMA-AS/ws/trunk/uimaj-as-activemq/src/main/java/org/apache/uima/adapter/jms/activemq/JmsOutputChannel.java>:[1972,40]
cannot find symbol
symbol  : variable MINUTES
location: class java.util.concurrent.TimeUnit

	at org.apache.maven.lifecycle.internal.MojoExecutor.execute(MojoExecutor.java:213)
	at org.apache.maven.lifecycle.internal.MojoExecutor.execute(MojoExecutor.java:153)
	at org.apache.maven.lifecycle.internal.MojoExecutor.execute(MojoExecutor.java:145)
	at org.apache.maven.lifecycle.internal.LifecycleModuleBuilder.buildProject(LifecycleModuleBuilder.java:84)
	at org.apache.maven.lifecycle.internal.LifecycleModuleBuilder.buildProject(LifecycleModuleBuilder.java:59)
	at org.apache.maven.lifecycle.internal.LifecycleStarter.singleThreadedBuild(LifecycleStarter.java:183)
	at org.apache.maven.lifecycle.internal.LifecycleStarter.execute(LifecycleStarter.java:161)
	at org.apache.maven.DefaultMaven.doExecute(DefaultMaven.java:319)
	at org.apache.maven.DefaultMaven.execute(DefaultMaven.java:156)
	at org.jvnet.hudson.maven3.launcher.Maven3Launcher.main(Maven3Launcher.java:79)
	at sun.reflect.NativeMethodAccessorImpl.invoke0(Native Method)
	at sun.reflect.NativeMethodAccessorImpl.invoke(NativeMethodAccessorImpl.java:39)
	at sun.reflect.DelegatingMethodAccessorImpl.invoke(DelegatingMethodAccessorImpl.java:25)
	at java.lang.reflect.Method.invoke(Method.java:592)
	at org.codehaus.plexus.classworlds.launcher.Launcher.launchStandard(Launcher.java:329)
	at org.codehaus.plexus.classworlds.launcher.Launcher.launch(Launcher.java:239)
	at org.jvnet.hudson.maven3.agent.Maven3Main.launch(Maven3Main.java:158)
	at hudson.maven.Maven3Builder.call(Maven3Builder.java:100)
	at hudson.maven.Maven3Builder.call(Maven3Builder.java:66)
	at hudson.remoting.UserRequest.perform(UserRequest.java:118)
	at hudson.remoting.UserRequest.perform(UserRequest.java:48)
	at hudson.remoting.Request$2.run(Request.java:326)
	at hudson.remoting.InterceptingExecutorService$1.call(InterceptingExecutorService.java:72)
	at java.util.concurrent.FutureTask$Sync.innerRun(FutureTask.java:269)
	at java.util.concurrent.FutureTask.run(FutureTask.java:123)
	at java.util.concurrent.ThreadPoolExecutor$Worker.runTask(ThreadPoolExecutor.java:651)
	at java.util.concurrent.ThreadPoolExecutor$Worker.run(ThreadPoolExecutor.java:676)
	at java.lang.Thread.run(Thread.java:595)
Caused by: org.apache.maven.plugin.CompilationFailureException: Compilation failure
<https://builds.apache.org/job/UIMA-AS/ws/trunk/uimaj-as-activemq/src/main/java/org/apache/uima/adapter/jms/activemq/JmsOutputChannel.java>:[1972,40]
cannot find symbol
symbol  : variable MINUTES
location: class java.util.concurrent.TimeUnit

	at org.apache.maven.plugin.AbstractCompilerMojo.execute(AbstractCompilerMojo.java:729)
	at org.apache.maven.plugin.CompilerMojo.execute(CompilerMojo.java:128)
	at org.apache.maven.plugin.DefaultBuildPluginManager.executeMojo(DefaultBuildPluginManager.java:101)
	at org.apache.maven.lifecycle.internal.MojoExecutor.execute(MojoExecutor.java:209)
	... 27 more
Sending e-mails to: dev@uima.apache.org
channel stopped

Mime
View raw message